You are viewing a plain text version of this content. The canonical link for it is here.
Posted to builds@beam.apache.org by Apache Jenkins Server <je...@builds.apache.org> on 2020/02/13 18:11:22 UTC
Build failed in Jenkins: beam_PostCommit_Python2 #1706
See <https://builds.apache.org/job/beam_PostCommit_Python2/1706/display/redirect?page=changes>
Changes:
[github] [BEAM-6522] [BEAM-7455] Unskip Avro IO tests that are now passing.
------------------------------------------
[...truncated 3.73 MB...]
"display_data": [
{
"key": "fn",
"label": "Transform Function",
"namespace": "apache_beam.transforms.core.ParDo",
"shortValue": "TeamScoresDict",
"type": "STRING",
"value": "apache_beam.examples.complete.game.hourly_team_score.TeamScoresDict"
}
],
"non_parallel_inputs": {},
"output_info": [
{
"encoding": {
"@type": "kind:windowed_value",
"component_encodings": [
{
"@type": "FastPrimitivesCoder$eNprYEpOLEhMzkiNT0pNzNVLzk9JLSqGUlxuicUlAUWZuZklmWWpxc4gQa5CBs3GQsbaQqZQ/vi0xJycpMTk7Hiw+kJmPEYFZCZn56RCjWABGsFaW8iWVJykBwDlGS3/",
"component_encodings": [
{
"@type": "FastPrimitivesCoder$eNprYEpOLEhMzkiNT0pNzNVLzk9JLSqGUlxuicUlAUWZuZklmWWpxc4gQa5CBs3GQsbaQqZQ/vi0xJycpMTk7Hiw+kJmPEYFZCZn56RCjWABGsFaW8iWVJykBwDlGS3/",
"component_encodings": [],
"pipeline_proto_coder_id": "ref_Coder_FastPrimitivesCoder_4"
},
{
"@type": "FastPrimitivesCoder$eNprYEpOLEhMzkiNT0pNzNVLzk9JLSqGUlxuicUlAUWZuZklmWWpxc4gQa5CBs3GQsbaQqZQ/vi0xJycpMTk7Hiw+kJmPEYFZCZn56RCjWABGsFaW8iWVJykBwDlGS3/",
"component_encodings": [],
"pipeline_proto_coder_id": "ref_Coder_FastPrimitivesCoder_4"
}
],
"is_pair_like": true,
"pipeline_proto_coder_id": "ref_Coder_FastPrimitivesCoder_4"
},
{
"@type": "kind:interval_window"
}
],
"is_wrapper": true
},
"output_name": "out",
"user_name": "TeamScoresDict.out"
}
],
"parallel_input": {
"@type": "OutputReference",
"output_name": "out",
"step_name": "s9"
},
"serialized_fn": "<string of 576 bytes>",
"user_name": "TeamScoresDict"
}
},
{
"kind": "ParallelDo",
"name": "s11",
"properties": {
"display_data": [
{
"key": "fn",
"label": "Transform Function",
"namespace": "apache_beam.transforms.core.CallableWrapperDoFn",
"type": "STRING",
"value": "<lambda>"
},
{
"key": "fn",
"label": "Transform Function",
"namespace": "apache_beam.transforms.core.ParDo",
"shortValue": "CallableWrapperDoFn",
"type": "STRING",
"value": "apache_beam.transforms.core.CallableWrapperDoFn"
}
],
"non_parallel_inputs": {},
"output_info": [
{
"encoding": {
"@type": "kind:windowed_value",
"component_encodings": [
{
"@type": "FastPrimitivesCoder$eNprYEpOLEhMzkiNT0pNzNVLzk9JLSqGUlxuicUlAUWZuZklmWWpxc4gQa5CBs3GQsbaQqZQ/vi0xJycpMTk7Hiw+kJmPEYFZCZn56RCjWABGsFaW8iWVJykBwDlGS3/",
"component_encodings": [
{
"@type": "FastPrimitivesCoder$eNprYEpOLEhMzkiNT0pNzNVLzk9JLSqGUlxuicUlAUWZuZklmWWpxc4gQa5CBs3GQsbaQqZQ/vi0xJycpMTk7Hiw+kJmPEYFZCZn56RCjWABGsFaW8iWVJykBwDlGS3/",
"component_encodings": [],
"pipeline_proto_coder_id": "ref_Coder_FastPrimitivesCoder_4"
},
{
"@type": "FastPrimitivesCoder$eNprYEpOLEhMzkiNT0pNzNVLzk9JLSqGUlxuicUlAUWZuZklmWWpxc4gQa5CBs3GQsbaQqZQ/vi0xJycpMTk7Hiw+kJmPEYFZCZn56RCjWABGsFaW8iWVJykBwDlGS3/",
"component_encodings": [],
"pipeline_proto_coder_id": "ref_Coder_FastPrimitivesCoder_4"
}
],
"is_pair_like": true,
"pipeline_proto_coder_id": "ref_Coder_FastPrimitivesCoder_4"
},
{
"@type": "kind:interval_window"
}
],
"is_wrapper": true
},
"output_name": "out",
"user_name": "WriteTeamScoreSums/ConvertToRow.out"
}
],
"parallel_input": {
"@type": "OutputReference",
"output_name": "out",
"step_name": "s10"
},
"serialized_fn": "<string of 1508 bytes>",
"user_name": "WriteTeamScoreSums/ConvertToRow"
}
},
{
"kind": "ParallelWrite",
"name": "s12",
"properties": {
"create_disposition": "CREATE_IF_NEEDED",
"dataset": "hourly_team_score_it_dataset15816140456719",
"display_data": [],
"encoding": {
"@type": "kind:windowed_value",
"component_encodings": [
{
"@type": "RowAsDictJsonCoder$eNprYEpOLEhMzkiNT0pNzNXLzNdLTy7QS8pMLyxNLaqML8nPzynmCsovdyx2yUwu8SrOz3POT0kt4ipk0GwsZKwtZErSAwBKpRfo",
"component_encodings": [],
"pipeline_proto_coder_id": "ref_Coder_RowAsDictJsonCoder_9"
},
{
"@type": "kind:global_window"
}
],
"is_wrapper": true
},
"format": "bigquery",
"parallel_input": {
"@type": "OutputReference",
"output_name": "out",
"step_name": "s11"
},
"project": "apache-beam-testing",
"schema": "{\"fields\": [{\"type\": \"INTEGER\", \"name\": \"total_score\", \"mode\": \"NULLABLE\"}, {\"type\": \"STRING\", \"name\": \"window_start\", \"mode\": \"NULLABLE\"}, {\"type\": \"STRING\", \"name\": \"team\", \"mode\": \"NULLABLE\"}]}",
"table": "leader_board",
"user_name": "WriteTeamScoreSums/WriteToBigQuery/WriteToBigQuery/NativeWrite",
"write_disposition": "WRITE_APPEND"
}
}
],
"type": "JOB_TYPE_BATCH"
}
apache_beam.runners.dataflow.internal.apiclient: INFO: Create job: <Job
createTime: u'2020-02-13T17:14:24.737769Z'
currentStateTime: u'1970-01-01T00:00:00Z'
id: u'2020-02-13_09_14_23-12151004696919463114'
location: u'us-central1'
name: u'beamapp-jenkins-0213171407-239696'
projectId: u'apache-beam-testing'
stageStates: []
startTime: u'2020-02-13T17:14:24.737769Z'
steps: []
tempFiles: []
type: TypeValueValuesEnum(JOB_TYPE_BATCH, 1)>
apache_beam.runners.dataflow.internal.apiclient: INFO: Created job with id: [2020-02-13_09_14_23-12151004696919463114]
apache_beam.runners.dataflow.internal.apiclient: INFO: To access the Dataflow monitoring console, please navigate to https://console.cloud.google.com/dataflow/jobsDetail/locations/us-central1/jobs/2020-02-13_09_14_23-12151004696919463114?project=apache-beam-testing
--------------------- >> end captured logging << ---------------------
----------------------------------------------------------------------
XML: nosetests-postCommitIT-df.xml
----------------------------------------------------------------------
XML: <https://builds.apache.org/job/beam_PostCommit_Python2/ws/src/sdks/python/nosetests.xml>
----------------------------------------------------------------------
Ran 52 tests in 3438.597s
FAILED (SKIP=7, failures=1)
Worker logs: https://console.cloud.google.com/dataflow/jobsDetail/locations/us-central1/jobs/2020-02-13_09_14_21-13154273299965203734?project=apache-beam-testing
Worker logs: https://console.cloud.google.com/dataflow/jobsDetail/locations/us-central1/jobs/2020-02-13_09_22_19-2481828520008298073?project=apache-beam-testing
Worker logs: https://console.cloud.google.com/dataflow/jobsDetail/locations/us-central1/jobs/2020-02-13_09_31_48-15533162236929685131?project=apache-beam-testing
Worker logs: https://console.cloud.google.com/dataflow/jobsDetail/locations/us-central1/jobs/2020-02-13_09_38_43-10097139222453408598?project=apache-beam-testing
Worker logs: https://console.cloud.google.com/dataflow/jobsDetail/locations/us-central1/jobs/2020-02-13_09_45_12-1350545307845738978?project=apache-beam-testing
Worker logs: https://console.cloud.google.com/dataflow/jobsDetail/locations/us-central1/jobs/2020-02-13_09_51_52-1932787925632675327?project=apache-beam-testing
Worker logs: https://console.cloud.google.com/dataflow/jobsDetail/locations/us-central1/jobs/2020-02-13_09_59_00-11256286089494797869?project=apache-beam-testing
Worker logs: https://console.cloud.google.com/dataflow/jobsDetail/locations/us-central1/jobs/2020-02-13_10_05_07-1896716779396573212?project=apache-beam-testing
Worker logs: https://console.cloud.google.com/dataflow/jobsDetail/locations/us-central1/jobs/2020-02-13_09_14_26-1015373624998994060?project=apache-beam-testing
Worker logs: https://console.cloud.google.com/dataflow/jobsDetail/locations/us-central1/jobs/2020-02-13_09_28_28-1554762978322855442?project=apache-beam-testing
Worker logs: https://console.cloud.google.com/dataflow/jobsDetail/locations/us-central1/jobs/2020-02-13_09_35_22-6982430278596959851?project=apache-beam-testing
Worker logs: https://console.cloud.google.com/dataflow/jobsDetail/locations/us-central1/jobs/2020-02-13_09_42_11-13197197780209969242?project=apache-beam-testing
Worker logs: https://console.cloud.google.com/dataflow/jobsDetail/locations/us-central1/jobs/2020-02-13_09_48_24-3393956795322999502?project=apache-beam-testing
Worker logs: https://console.cloud.google.com/dataflow/jobsDetail/locations/us-central1/jobs/2020-02-13_09_14_23-12151004696919463114?project=apache-beam-testing
Worker logs: https://console.cloud.google.com/dataflow/jobsDetail/locations/us-central1/jobs/2020-02-13_09_15_56-4548997911316013729?project=apache-beam-testing
Worker logs: https://console.cloud.google.com/dataflow/jobsDetail/locations/us-central1/jobs/2020-02-13_09_24_34-14750301930719209851?project=apache-beam-testing
Worker logs: https://console.cloud.google.com/dataflow/jobsDetail/locations/us-central1/jobs/2020-02-13_09_32_33-15502609456632135713?project=apache-beam-testing
Worker logs: https://console.cloud.google.com/dataflow/jobsDetail/locations/us-central1/jobs/2020-02-13_09_40_41-7228847230318953572?project=apache-beam-testing
Worker logs: https://console.cloud.google.com/dataflow/jobsDetail/locations/us-central1/jobs/2020-02-13_09_47_31-1534978872680769074?project=apache-beam-testing
Worker logs: https://console.cloud.google.com/dataflow/jobsDetail/locations/us-central1/jobs/2020-02-13_09_14_26-17416162233432337118?project=apache-beam-testing
Worker logs: https://console.cloud.google.com/dataflow/jobsDetail/locations/us-central1/jobs/2020-02-13_09_26_25-4099158762480987204?project=apache-beam-testing
Worker logs: https://console.cloud.google.com/dataflow/jobsDetail/locations/us-central1/jobs/2020-02-13_09_33_08-15086238369214068592?project=apache-beam-testing
Worker logs: https://console.cloud.google.com/dataflow/jobsDetail/locations/us-central1/jobs/2020-02-13_09_40_34-864663974985730276?project=apache-beam-testing
Worker logs: https://console.cloud.google.com/dataflow/jobsDetail/locations/us-central1/jobs/2020-02-13_09_46_57-3882018946244334356?project=apache-beam-testing
Worker logs: https://console.cloud.google.com/dataflow/jobsDetail/locations/us-central1/jobs/2020-02-13_09_14_22-16011815792744813549?project=apache-beam-testing
Worker logs: https://console.cloud.google.com/dataflow/jobsDetail/locations/us-central1/jobs/2020-02-13_09_32_30-3561851901284245540?project=apache-beam-testing
Worker logs: https://console.cloud.google.com/dataflow/jobsDetail/locations/us-central1/jobs/2020-02-13_09_14_22-8317226645085059073?project=apache-beam-testing
Worker logs: https://console.cloud.google.com/dataflow/jobsDetail/locations/us-central1/jobs/2020-02-13_09_21_49-1206815816472123287?project=apache-beam-testing
Worker logs: https://console.cloud.google.com/dataflow/jobsDetail/locations/us-central1/jobs/2020-02-13_09_28_28-10648457594164365865?project=apache-beam-testing
Worker logs: https://console.cloud.google.com/dataflow/jobsDetail/locations/us-central1/jobs/2020-02-13_09_35_37-4408415809626618773?project=apache-beam-testing
Worker logs: https://console.cloud.google.com/dataflow/jobsDetail/locations/us-central1/jobs/2020-02-13_09_41_56-6371569649162260?project=apache-beam-testing
Worker logs: https://console.cloud.google.com/dataflow/jobsDetail/locations/us-central1/jobs/2020-02-13_09_48_39-8109169283981958264?project=apache-beam-testing
Worker logs: https://console.cloud.google.com/dataflow/jobsDetail/locations/us-central1/jobs/2020-02-13_09_14_20-11268710488166133541?project=apache-beam-testing
Worker logs: https://console.cloud.google.com/dataflow/jobsDetail/locations/us-central1/jobs/2020-02-13_09_21_16-13115848467284957073?project=apache-beam-testing
Worker logs: https://console.cloud.google.com/dataflow/jobsDetail/locations/us-central1/jobs/2020-02-13_09_28_45-1628544941930268157?project=apache-beam-testing
Worker logs: https://console.cloud.google.com/dataflow/jobsDetail/locations/us-central1/jobs/2020-02-13_09_35_33-2734941504421975130?project=apache-beam-testing
Worker logs: https://console.cloud.google.com/dataflow/jobsDetail/locations/us-central1/jobs/2020-02-13_09_42_16-15265186689052039157?project=apache-beam-testing
Worker logs: https://console.cloud.google.com/dataflow/jobsDetail/locations/us-central1/jobs/2020-02-13_09_48_40-4896399306650738127?project=apache-beam-testing
Worker logs: https://console.cloud.google.com/dataflow/jobsDetail/locations/us-central1/jobs/2020-02-13_09_14_22-8182422606841173929?project=apache-beam-testing
Worker logs: https://console.cloud.google.com/dataflow/jobsDetail/locations/us-central1/jobs/2020-02-13_09_21_28-2875032641236932200?project=apache-beam-testing
Worker logs: https://console.cloud.google.com/dataflow/jobsDetail/locations/us-central1/jobs/2020-02-13_09_28_37-15863787655926303557?project=apache-beam-testing
Worker logs: https://console.cloud.google.com/dataflow/jobsDetail/locations/us-central1/jobs/2020-02-13_09_35_24-16532841804607969342?project=apache-beam-testing
Worker logs: https://console.cloud.google.com/dataflow/jobsDetail/locations/us-central1/jobs/2020-02-13_09_41_28-11837290632232014281?project=apache-beam-testing
Worker logs: https://console.cloud.google.com/dataflow/jobsDetail/locations/us-central1/jobs/2020-02-13_09_49_27-3482778298854407190?project=apache-beam-testing
> Task :sdks:python:test-suites:dataflow:py2:postCommitIT FAILED
FAILURE: Build failed with an exception.
* Where:
Build file '<https://builds.apache.org/job/beam_PostCommit_Python2/ws/src/sdks/python/test-suites/dataflow/py2/build.gradle'> line: 85
* What went wrong:
Execution failed for task ':sdks:python:test-suites:dataflow:py2:postCommitIT'.
> Process 'command 'sh'' finished with non-zero exit value 1
* Try:
Run with --stacktrace option to get the stack trace. Run with --info or --debug option to get more log output. Run with --scan to get full insights.
* Get more help at https://help.gradle.org
Deprecated Gradle features were used in this build, making it incompatible with Gradle 6.0.
Use '--warning-mode all' to show the individual deprecation warnings.
See https://docs.gradle.org/5.2.1/userguide/command_line_interface.html#sec:command_line_warnings
BUILD FAILED in 59m 1s
124 actionable tasks: 100 executed, 21 from cache, 3 up-to-date
Publishing build scan...
https://gradle.com/s/77cqeyre6r2jq
Build step 'Invoke Gradle script' changed build result to FAILURE
Build step 'Invoke Gradle script' marked build as failure
---------------------------------------------------------------------
To unsubscribe, e-mail: builds-unsubscribe@beam.apache.org
For additional commands, e-mail: builds-help@beam.apache.org
Jenkins build is back to normal : beam_PostCommit_Python2 #1710
Posted by Apache Jenkins Server <je...@builds.apache.org>.
See <https://builds.apache.org/job/beam_PostCommit_Python2/1710/display/redirect?page=changes>
---------------------------------------------------------------------
To unsubscribe, e-mail: builds-unsubscribe@beam.apache.org
For additional commands, e-mail: builds-help@beam.apache.org
Build failed in Jenkins: beam_PostCommit_Python2 #1709
Posted by Apache Jenkins Server <je...@builds.apache.org>.
See <https://builds.apache.org/job/beam_PostCommit_Python2/1709/display/redirect?page=changes>
Changes:
[github] [BEAM-8758] Google-cloud-spanner upgrade to 1.49.1 (#10765)
[github] Ensuring appropriate write_disposition and create_disposition for jobs
[github] [BEAM-3545] Return metrics as MonitoringInfos (#10777)
[github] Modify the TestStreamFileRecord to use TestStreamPayload events.
------------------------------------------
[...truncated 3.76 MB...]
20/02/13 22:42:16 INFO org.apache.beam.runners.spark.SparkPipelineRunner: Job BeamApp-jenkins-0213224154-742f5cab_e2d2e148-7a1e-4970-9dbf-a176539f09b1: Pipeline translated successfully. Computing outputs
INFO:apache_beam.io.filebasedsink:Starting finalize_write threads with num_shards: 4 (skipped: 0), batches: 4, num_threads: 4
INFO:apache_beam.io.filebasedsink:Renamed 4 shards in 0.12 seconds.
20/02/13 22:42:30 INFO org.apache.beam.runners.spark.SparkPipelineRunner: Job BeamApp-jenkins-0213224154-742f5cab_e2d2e148-7a1e-4970-9dbf-a176539f09b1 finished.
20/02/13 22:42:30 INFO org.apache.beam.runners.fnexecution.artifact.AbstractArtifactRetrievalService: Manifest at /tmp/beam-temp9Ngkqc/artifactshfErCn/job_535bbddc-1f6c-4044-994f-e42e1c344b6d/MANIFEST has 1 artifact locations
20/02/13 22:42:30 INFO org.apache.beam.runners.fnexecution.artifact.BeamFileSystemArtifactStagingService: Removed dir /tmp/beam-temp9Ngkqc/artifactshfErCn/job_535bbddc-1f6c-4044-994f-e42e1c344b6d/
INFO:apache_beam.runners.portability.portable_runner:Job state changed to DONE
20/02/13 22:42:30 INFO org.apache.beam.runners.fnexecution.jobsubmission.InMemoryJobService: Getting job metrics for BeamApp-jenkins-0213224154-742f5cab_e2d2e148-7a1e-4970-9dbf-a176539f09b1
20/02/13 22:42:30 INFO org.apache.beam.runners.fnexecution.jobsubmission.InMemoryJobService: Finished getting job metrics for BeamApp-jenkins-0213224154-742f5cab_e2d2e148-7a1e-4970-9dbf-a176539f09b1
INFO:root:number of empty lines: 2
INFO:root:average word length: 3
ERROR:apache_beam.runners.worker.data_plane:Failed to read inputs in the data plane.
Traceback (most recent call last):
File "<https://builds.apache.org/job/beam_PostCommit_Python2/ws/src/sdks/python/apache_beam/runners/worker/data_plane.py",> line 419, in _read_inputs
for elements in elements_iterator:
File "<https://builds.apache.org/job/beam_PostCommit_Python2/ws/src/build/gradleenv/1866363813/local/lib/python2.7/site-packages/grpc/_channel.py",> line 413, in next
return self._next()
File "<https://builds.apache.org/job/beam_PostCommit_Python2/ws/src/build/gradleenv/1866363813/local/lib/python2.7/site-packages/grpc/_channel.py",> line 706, in _next
raise self
_MultiThreadedRendezvous: <_MultiThreadedRendezvous of RPC that terminated with:
status = StatusCode.UNAVAILABLE
details = "Socket closed"
debug_error_string = "{"created":"@1581633751.267534914","description":"Error received from peer ipv4:127.0.0.1:46475","file":"src/core/lib/surface/call.cc","file_line":1056,"grpc_message":"Socket closed","grpc_status":14}"
>
Exception in thread read_state:
Traceback (most recent call last):
File "/usr/lib/python2.7/threading.py", line 801, in __bootstrap_inner
self.run()
File "/usr/lib/python2.7/threading.py", line 754, in run
self.__target(*self.__args, **self.__kwargs)
File "<https://builds.apache.org/job/beam_PostCommit_Python2/ws/src/sdks/python/apache_beam/runners/worker/sdk_worker.py",> line 675, in pull_responses
for response in responses:
File "<https://builds.apache.org/job/beam_PostCommit_Python2/ws/src/build/gradleenv/1866363813/local/lib/python2.7/site-packages/grpc/_channel.py",> line 413, in next
return self._next()
File "<https://builds.apache.org/job/beam_PostCommit_Python2/ws/src/build/gradleenv/1866363813/local/lib/python2.7/site-packages/grpc/_channel.py",> line 706, in _next
raise self
_MultiThreadedRendezvous: <_MultiThreadedRendezvous of RPC that terminated with:
status = StatusCode.UNAVAILABLE
details = "Socket closed"
debug_error_string = "{"created":"@1581633751.267551428","description":"Error received from peer ipv4:127.0.0.1:37745","file":"src/core/lib/surface/call.cc","file_line":1056,"grpc_message":"Socket closed","grpc_status":14}"
>
Exception in thread read_grpc_client_inputs:
Traceback (most recent call last):
File "/usr/lib/python2.7/threading.py", line 801, in __bootstrap_inner
self.run()
File "/usr/lib/python2.7/threading.py", line 754, in run
self.__target(*self.__args, **self.__kwargs)
File "<https://builds.apache.org/job/beam_PostCommit_Python2/ws/src/sdks/python/apache_beam/runners/worker/data_plane.py",> line 434, in <lambda>
target=lambda: self._read_inputs(elements_iterator),
File "<https://builds.apache.org/job/beam_PostCommit_Python2/ws/src/sdks/python/apache_beam/runners/worker/data_plane.py",> line 419, in _read_inputs
for elements in elements_iterator:
File "<https://builds.apache.org/job/beam_PostCommit_Python2/ws/src/build/gradleenv/1866363813/local/lib/python2.7/site-packages/grpc/_channel.py",> line 413, in next
return self._next()
File "<https://builds.apache.org/job/beam_PostCommit_Python2/ws/src/build/gradleenv/1866363813/local/lib/python2.7/site-packages/grpc/_channel.py",> line 706, in _next
raise self
_MultiThreadedRendezvous: <_MultiThreadedRendezvous of RPC that terminated with:
status = StatusCode.UNAVAILABLE
details = "Socket closed"
debug_error_string = "{"created":"@1581633751.267534914","description":"Error received from peer ipv4:127.0.0.1:46475","file":"src/core/lib/surface/call.cc","file_line":1056,"grpc_message":"Socket closed","grpc_status":14}"
>
Exception in thread run_worker_1-1:
Traceback (most recent call last):
File "/usr/lib/python2.7/threading.py", line 801, in __bootstrap_inner
self.run()
File "/usr/lib/python2.7/threading.py", line 754, in run
self.__target(*self.__args, **self.__kwargs)
File "<https://builds.apache.org/job/beam_PostCommit_Python2/ws/src/sdks/python/apache_beam/runners/worker/sdk_worker.py",> line 153, in run
for work_request in control_stub.Control(get_responses()):
File "<https://builds.apache.org/job/beam_PostCommit_Python2/ws/src/build/gradleenv/1866363813/local/lib/python2.7/site-packages/grpc/_channel.py",> line 413, in next
return self._next()
File "<https://builds.apache.org/job/beam_PostCommit_Python2/ws/src/build/gradleenv/1866363813/local/lib/python2.7/site-packages/grpc/_channel.py",> line 706, in _next
raise self
_MultiThreadedRendezvous: <_MultiThreadedRendezvous of RPC that terminated with:
status = StatusCode.UNAVAILABLE
details = "Socket closed"
debug_error_string = "{"created":"@1581633751.267739938","description":"Error received from peer ipv4:127.0.0.1:43195","file":"src/core/lib/surface/call.cc","file_line":1056,"grpc_message":"Socket closed","grpc_status":14}"
>
> Task :sdks:python:test-suites:portable:py2:postCommitPy2
> Task :sdks:python:test-suites:dataflow:py2:postCommitIT
test_leader_board_it (apache_beam.examples.complete.game.leader_board_it_test.LeaderBoardIT) ... ok
test_datastore_write_limit (apache_beam.io.gcp.datastore.v1new.datastore_write_it_test.DatastoreWriteIT) ... SKIP: GCP dependencies are not installed
<https://builds.apache.org/job/beam_PostCommit_Python2/ws/src/sdks/python/apache_beam/io/gcp/big_query_query_to_table_pipeline.py>:87: FutureWarning: _ReadFromBigQuery is experimental.
kms_key=kms_key)
<https://builds.apache.org/job/beam_PostCommit_Python2/ws/src/sdks/python/apache_beam/runners/dataflow/dataflow_runner.py>:787: BeamDeprecationWarning: BigQuerySink is deprecated since 2.11.0. Use WriteToBigQuery instead.
kms_key=transform.kms_key))
test_wordcount_it (apache_beam.examples.wordcount_it_test.WordCountIT) ... ok
test_wordcount_fnapi_it (apache_beam.examples.wordcount_it_test.WordCountIT) ... ok
<https://builds.apache.org/job/beam_PostCommit_Python2/ws/src/sdks/python/apache_beam/io/gcp/bigquery_io_read_pipeline.py>:84: FutureWarning: _ReadFromBigQuery is experimental.
(options.view_as(GoogleCloudOptions).project, known_args.input_table))
<https://builds.apache.org/job/beam_PostCommit_Python2/ws/src/sdks/python/apache_beam/io/gcp/bigquery.py>:1655: BeamDeprecationWarning: options is deprecated since First stable release. References to <pipeline>.options will not be supported
temp_location = pcoll.pipeline.options.view_as(
<https://builds.apache.org/job/beam_PostCommit_Python2/ws/src/sdks/python/apache_beam/io/gcp/bigquery.py>:1466: BeamDeprecationWarning: options is deprecated since First stable release. References to <pipeline>.options will not be supported
experiments = p.options.view_as(DebugOptions).experiments or []
<https://builds.apache.org/job/beam_PostCommit_Python2/ws/src/sdks/python/apache_beam/io/gcp/bigquery_file_loads.py>:818: BeamDeprecationWarning: options is deprecated since First stable release. References to <pipeline>.options will not be supported
temp_location = p.options.view_as(GoogleCloudOptions).temp_location
test_game_stats_it (apache_beam.examples.complete.game.game_stats_it_test.GameStatsIT) ... ok
<https://builds.apache.org/job/beam_PostCommit_Python2/ws/src/sdks/python/apache_beam/io/gcp/bigquery_read_it_test.py>:275: FutureWarning: _ReadFromBigQuery is experimental.
query=self.query, use_standard_sql=True, project=self.project))
test_streaming_wordcount_it (apache_beam.examples.streaming_wordcount_it_test.StreamingWordCountIT) ... ok
<https://builds.apache.org/job/beam_PostCommit_Python2/ws/src/sdks/python/apache_beam/io/gcp/bigquery_read_it_test.py>:162: FutureWarning: _ReadFromBigQuery is experimental.
query=self.query, use_standard_sql=True, project=self.project))
<https://builds.apache.org/job/beam_PostCommit_Python2/ws/src/sdks/python/apache_beam/io/gcp/bigquery.py>:1655: BeamDeprecationWarning: options is deprecated since First stable release. References to <pipeline>.options will not be supported
temp_location = pcoll.pipeline.options.view_as(
test_hourly_team_score_it (apache_beam.examples.complete.game.hourly_team_score_it_test.HourlyTeamScoreIT) ... ok
<https://builds.apache.org/job/beam_PostCommit_Python2/ws/src/sdks/python/apache_beam/io/gcp/bigquery_test.py>:823: BeamDeprecationWarning: options is deprecated since First stable release. References to <pipeline>.options will not be supported
streaming = self.test_pipeline.options.view_as(StandardOptions).streaming
<https://builds.apache.org/job/beam_PostCommit_Python2/ws/src/sdks/python/apache_beam/io/gcp/bigquery.py>:1466: BeamDeprecationWarning: options is deprecated since First stable release. References to <pipeline>.options will not be supported
experiments = p.options.view_as(DebugOptions).experiments or []
test_user_score_it (apache_beam.examples.complete.game.user_score_it_test.UserScoreIT) ... ok
<https://builds.apache.org/job/beam_PostCommit_Python2/ws/src/sdks/python/apache_beam/io/gcp/bigquery.py>:1466: BeamDeprecationWarning: options is deprecated since First stable release. References to <pipeline>.options will not be supported
experiments = p.options.view_as(DebugOptions).experiments or []
<https://builds.apache.org/job/beam_PostCommit_Python2/ws/src/sdks/python/apache_beam/io/gcp/bigquery_file_loads.py>:818: BeamDeprecationWarning: options is deprecated since First stable release. References to <pipeline>.options will not be supported
temp_location = p.options.view_as(GoogleCloudOptions).temp_location
test_avro_it (apache_beam.examples.fastavro_it_test.FastavroIT) ... ok
<https://builds.apache.org/job/beam_PostCommit_Python2/ws/src/sdks/python/apache_beam/io/gcp/bigquery.py>:1463: BeamDeprecationWarning: options is deprecated since First stable release. References to <pipeline>.options will not be supported
self.table_reference.projectId = pcoll.pipeline.options.view_as(
test_multiple_destinations_transform (apache_beam.io.gcp.bigquery_test.BigQueryStreamingInsertTransformIntegrationTests) ... ok
test_value_provider_transform (apache_beam.io.gcp.bigquery_test.BigQueryStreamingInsertTransformIntegrationTests) ... ok
<https://builds.apache.org/job/beam_PostCommit_Python2/ws/src/sdks/python/apache_beam/io/gcp/big_query_query_to_table_pipeline.py>:95: BeamDeprecationWarning: BigQuerySink is deprecated since 2.11.0. Use WriteToBigQuery instead.
kms_key=kms_key))
test_iobase_source (apache_beam.io.gcp.bigquery_read_it_test.ReadNewTypesTests) ... ok
test_native_source (apache_beam.io.gcp.bigquery_read_it_test.ReadNewTypesTests) ... ok
test_copy (apache_beam.io.gcp.gcsio_integration_test.GcsIOIntegrationTest) ... ok
test_copy_batch (apache_beam.io.gcp.gcsio_integration_test.GcsIOIntegrationTest) ... ok
test_copy_batch_kms (apache_beam.io.gcp.gcsio_integration_test.GcsIOIntegrationTest) ... ok
test_copy_batch_rewrite_token (apache_beam.io.gcp.gcsio_integration_test.GcsIOIntegrationTest) ... ok
test_copy_kms (apache_beam.io.gcp.gcsio_integration_test.GcsIOIntegrationTest) ... ok
test_copy_rewrite_token (apache_beam.io.gcp.gcsio_integration_test.GcsIOIntegrationTest) ... ok
test_bigquery_read_1M_python (apache_beam.io.gcp.bigquery_io_read_it_test.BigqueryIOReadIT) ... ok
test_bigquery_read_custom_1M_python (apache_beam.io.gcp.bigquery_io_read_it_test.BigqueryIOReadIT) ... ok
<https://builds.apache.org/job/beam_PostCommit_Python2/ws/src/sdks/python/apache_beam/io/fileio_test.py>:303: FutureWarning: MatchAll is experimental.
| 'GetPath' >> beam.Map(lambda metadata: metadata.path))
<https://builds.apache.org/job/beam_PostCommit_Python2/ws/src/sdks/python/apache_beam/io/fileio_test.py>:316: FutureWarning: MatchAll is experimental.
| 'Checksums' >> beam.Map(compute_hash))
<https://builds.apache.org/job/beam_PostCommit_Python2/ws/src/sdks/python/apache_beam/io/fileio_test.py>:316: FutureWarning: ReadMatches is experimental.
| 'Checksums' >> beam.Map(compute_hash))
test_iobase_source (apache_beam.io.gcp.bigquery_read_it_test.ReadTests) ... ok
test_native_source (apache_beam.io.gcp.bigquery_read_it_test.ReadTests) ... ok
test_bqfl_streaming (apache_beam.io.gcp.bigquery_file_loads_test.BigQueryFileLoadsIT) ... SKIP: TestStream is not supported on TestDataflowRunner
test_multiple_destinations_transform (apache_beam.io.gcp.bigquery_file_loads_test.BigQueryFileLoadsIT) ... ok
test_one_job_fails_all_jobs_fail (apache_beam.io.gcp.bigquery_file_loads_test.BigQueryFileLoadsIT) ... ok
test_transform_on_gcs (apache_beam.io.fileio_test.MatchIntegrationTest) ... ok
test_file_loads (apache_beam.io.gcp.bigquery_test.PubSubBigQueryIT) ... SKIP: https://issuetracker.google.com/issues/118375066
test_streaming_inserts (apache_beam.io.gcp.bigquery_test.PubSubBigQueryIT) ... ok
test_parquetio_it (apache_beam.io.parquetio_it_test.TestParquetIT) ... ok
test_basic_execution (apache_beam.testing.test_stream_it_test.TestStreamIntegrationTests) ... SKIP: The "TestDataflowRunner", does not support the TestStream transform. Supported runners: ['DirectRunner', 'SwitchingDirectRunner']
Tests that the TestStream supports emitting to multiple PCollections. ... SKIP: The "TestDataflowRunner", does not support the TestStream transform. Supported runners: ['DirectRunner', 'SwitchingDirectRunner']
Tests that the TestStream can independently control output watermarks. ... SKIP: The "TestDataflowRunner", does not support the TestStream transform. Supported runners: ['DirectRunner', 'SwitchingDirectRunner']
Runs streaming Dataflow job and verifies that user metrics are reported ... ok
test_job_python_from_python_it (apache_beam.transforms.external_test_it.ExternalTransformIT) ... ok
test_streaming_data_only (apache_beam.io.gcp.pubsub_integration_test.PubSubIntegrationTest) ... ok
test_streaming_with_attributes (apache_beam.io.gcp.pubsub_integration_test.PubSubIntegrationTest) ... ok
test_metrics_fnapi_it (apache_beam.runners.dataflow.dataflow_exercise_metrics_pipeline_test.ExerciseMetricsPipelineTest) ... ok
test_metrics_it (apache_beam.runners.dataflow.dataflow_exercise_metrics_pipeline_test.ExerciseMetricsPipelineTest) ... ok
test_big_query_write (apache_beam.io.gcp.bigquery_write_it_test.BigQueryWriteIntegrationTests) ... ok
test_big_query_write_new_types (apache_beam.io.gcp.bigquery_write_it_test.BigQueryWriteIntegrationTests) ... ok
test_big_query_write_schema_autodetect (apache_beam.io.gcp.bigquery_write_it_test.BigQueryWriteIntegrationTests) ... SKIP: DataflowRunner does not support schema autodetection
test_big_query_write_without_schema (apache_beam.io.gcp.bigquery_write_it_test.BigQueryWriteIntegrationTests) ... ok
test_big_query_legacy_sql (apache_beam.io.gcp.big_query_query_to_table_it_test.BigQueryQueryToTableIT) ... ok
test_big_query_new_types (apache_beam.io.gcp.big_query_query_to_table_it_test.BigQueryQueryToTableIT) ... ok
test_big_query_new_types_native (apache_beam.io.gcp.big_query_query_to_table_it_test.BigQueryQueryToTableIT) ... ok
test_big_query_standard_sql (apache_beam.io.gcp.big_query_query_to_table_it_test.BigQueryQueryToTableIT) ... ok
test_big_query_standard_sql_kms_key_native (apache_beam.io.gcp.big_query_query_to_table_it_test.BigQueryQueryToTableIT) ... ok
test_datastore_write_limit (apache_beam.io.gcp.datastore_write_it_test.DatastoreWriteIT) ... ok
----------------------------------------------------------------------
XML: nosetests-postCommitIT-df.xml
----------------------------------------------------------------------
XML: <https://builds.apache.org/job/beam_PostCommit_Python2/ws/src/sdks/python/nosetests.xml>
----------------------------------------------------------------------
Ran 52 tests in 3568.819s
OK (SKIP=7)
Worker logs: https://console.cloud.google.com/dataflow/jobsDetail/locations/us-central1/jobs/2020-02-13_14_31_57-8921374199178645623?project=apache-beam-testing
Worker logs: https://console.cloud.google.com/dataflow/jobsDetail/locations/us-central1/jobs/2020-02-13_14_49_33-7648731987104962838?project=apache-beam-testing
Worker logs: https://console.cloud.google.com/dataflow/jobsDetail/locations/us-central1/jobs/2020-02-13_14_57_18-17333128565062219702?project=apache-beam-testing
Worker logs: https://console.cloud.google.com/dataflow/jobsDetail/locations/us-central1/jobs/2020-02-13_15_03_32-1366411887589957733?project=apache-beam-testing
Worker logs: https://console.cloud.google.com/dataflow/jobsDetail/locations/us-central1/jobs/2020-02-13_15_10_16-12935140512997165385?project=apache-beam-testing
Worker logs: https://console.cloud.google.com/dataflow/jobsDetail/locations/us-central1/jobs/2020-02-13_15_17_40-16487195794711240864?project=apache-beam-testing
Worker logs: https://console.cloud.google.com/dataflow/jobsDetail/locations/us-central1/jobs/2020-02-13_15_24_20-2881991520100104692?project=apache-beam-testing
Worker logs: https://console.cloud.google.com/dataflow/jobsDetail/locations/us-central1/jobs/2020-02-13_14_32_02-12257332294295124173?project=apache-beam-testing
Worker logs: https://console.cloud.google.com/dataflow/jobsDetail/locations/us-central1/jobs/2020-02-13_14_46_09-905383081814175011?project=apache-beam-testing
Worker logs: https://console.cloud.google.com/dataflow/jobsDetail/locations/us-central1/jobs/2020-02-13_14_52_52-17383085102358060000?project=apache-beam-testing
Worker logs: https://console.cloud.google.com/dataflow/jobsDetail/locations/us-central1/jobs/2020-02-13_15_00_13-10711351674038696125?project=apache-beam-testing
Worker logs: https://console.cloud.google.com/dataflow/jobsDetail/locations/us-central1/jobs/2020-02-13_15_07_11-3360291669632146822?project=apache-beam-testing
Worker logs: https://console.cloud.google.com/dataflow/jobsDetail/locations/us-central1/jobs/2020-02-13_14_31_58-16538878408897308907?project=apache-beam-testing
Worker logs: https://console.cloud.google.com/dataflow/jobsDetail/locations/us-central1/jobs/2020-02-13_14_48_48-8730225730078579869?project=apache-beam-testing
Worker logs: https://console.cloud.google.com/dataflow/jobsDetail/locations/us-central1/jobs/2020-02-13_14_55_34-16374020351924306329?project=apache-beam-testing
Worker logs: https://console.cloud.google.com/dataflow/jobsDetail/locations/us-central1/jobs/2020-02-13_15_02_24-6411595783865996347?project=apache-beam-testing
Worker logs: https://console.cloud.google.com/dataflow/jobsDetail/locations/us-central1/jobs/2020-02-13_15_09_15-17793740196421397981?project=apache-beam-testing
Worker logs: https://console.cloud.google.com/dataflow/jobsDetail/locations/us-central1/jobs/2020-02-13_14_32_00-16873507237242766806?project=apache-beam-testing
Worker logs: https://console.cloud.google.com/dataflow/jobsDetail/locations/us-central1/jobs/2020-02-13_14_44_08-1578322336835920004?project=apache-beam-testing
Worker logs: https://console.cloud.google.com/dataflow/jobsDetail/locations/us-central1/jobs/2020-02-13_14_51_00-8674048801654934629?project=apache-beam-testing
Worker logs: https://console.cloud.google.com/dataflow/jobsDetail/locations/us-central1/jobs/2020-02-13_14_57_41-15552403037649244858?project=apache-beam-testing
Worker logs: https://console.cloud.google.com/dataflow/jobsDetail/locations/us-central1/jobs/2020-02-13_15_03_46-16202684740600066996?project=apache-beam-testing
Worker logs: https://console.cloud.google.com/dataflow/jobsDetail/locations/us-central1/jobs/2020-02-13_15_11_06-15027585627451280219?project=apache-beam-testing
Worker logs: https://console.cloud.google.com/dataflow/jobsDetail/locations/us-central1/jobs/2020-02-13_14_31_59-4650566502283504502?project=apache-beam-testing
Worker logs: https://console.cloud.google.com/dataflow/jobsDetail/locations/us-central1/jobs/2020-02-13_14_38_48-4564165702148416797?project=apache-beam-testing
Worker logs: https://console.cloud.google.com/dataflow/jobsDetail/locations/us-central1/jobs/2020-02-13_14_45_59-4437415350197262572?project=apache-beam-testing
Worker logs: https://console.cloud.google.com/dataflow/jobsDetail/locations/us-central1/jobs/2020-02-13_14_52_41-8880002687651040140?project=apache-beam-testing
Worker logs: https://console.cloud.google.com/dataflow/jobsDetail/locations/us-central1/jobs/2020-02-13_15_00_27-743201217261181303?project=apache-beam-testing
Worker logs: https://console.cloud.google.com/dataflow/jobsDetail/locations/us-central1/jobs/2020-02-13_15_07_09-8314247311312200854?project=apache-beam-testing
Worker logs: https://console.cloud.google.com/dataflow/jobsDetail/locations/us-central1/jobs/2020-02-13_14_31_57-4546817159070442889?project=apache-beam-testing
Worker logs: https://console.cloud.google.com/dataflow/jobsDetail/locations/us-central1/jobs/2020-02-13_14_38_22-2216667540323413465?project=apache-beam-testing
Worker logs: https://console.cloud.google.com/dataflow/jobsDetail/locations/us-central1/jobs/2020-02-13_14_47_07-1583229270332067376?project=apache-beam-testing
Worker logs: https://console.cloud.google.com/dataflow/jobsDetail/locations/us-central1/jobs/2020-02-13_14_55_15-10890204360807709333?project=apache-beam-testing
Worker logs: https://console.cloud.google.com/dataflow/jobsDetail/locations/us-central1/jobs/2020-02-13_15_01_31-13409257090635487561?project=apache-beam-testing
Worker logs: https://console.cloud.google.com/dataflow/jobsDetail/locations/us-central1/jobs/2020-02-13_14_31_58-2792649991868938339?project=apache-beam-testing
Worker logs: https://console.cloud.google.com/dataflow/jobsDetail/locations/us-central1/jobs/2020-02-13_14_38_57-4922297325578137918?project=apache-beam-testing
Worker logs: https://console.cloud.google.com/dataflow/jobsDetail/locations/us-central1/jobs/2020-02-13_14_46_01-10704051881274197371?project=apache-beam-testing
Worker logs: https://console.cloud.google.com/dataflow/jobsDetail/locations/us-central1/jobs/2020-02-13_14_55_25-17606897594972681983?project=apache-beam-testing
Worker logs: https://console.cloud.google.com/dataflow/jobsDetail/locations/us-central1/jobs/2020-02-13_15_03_10-15730593727887971327?project=apache-beam-testing
Worker logs: https://console.cloud.google.com/dataflow/jobsDetail/locations/us-central1/jobs/2020-02-13_15_09_28-11640109749678951157?project=apache-beam-testing
Worker logs: https://console.cloud.google.com/dataflow/jobsDetail/locations/us-central1/jobs/2020-02-13_14_31_57-5051850232686320007?project=apache-beam-testing
Worker logs: https://console.cloud.google.com/dataflow/jobsDetail/locations/us-central1/jobs/2020-02-13_14_40_26-7246333617613971069?project=apache-beam-testing
Worker logs: https://console.cloud.google.com/dataflow/jobsDetail/locations/us-central1/jobs/2020-02-13_14_50_38-5582988538697791643?project=apache-beam-testing
Worker logs: https://console.cloud.google.com/dataflow/jobsDetail/locations/us-central1/jobs/2020-02-13_15_07_45-6283290060303439707?project=apache-beam-testing
FAILURE: Build failed with an exception.
* Where:
Build file '<https://builds.apache.org/job/beam_PostCommit_Python2/ws/src/sdks/python/test-suites/direct/py2/build.gradle'> line: 50
* What went wrong:
Execution failed for task ':sdks:python:test-suites:direct:py2:directRunnerIT'.
> Process 'command 'sh'' finished with non-zero exit value 1
* Try:
Run with --stacktrace option to get the stack trace. Run with --info or --debug option to get more log output. Run with --scan to get full insights.
* Get more help at https://help.gradle.org
Deprecated Gradle features were used in this build, making it incompatible with Gradle 6.0.
Use '--warning-mode all' to show the individual deprecation warnings.
See https://docs.gradle.org/5.2.1/userguide/command_line_interface.html#sec:command_line_warnings
BUILD FAILED in 1h 1m 14s
124 actionable tasks: 106 executed, 15 from cache, 3 up-to-date
Publishing build scan...
https://gradle.com/s/dwuriufe77hj4
Build step 'Invoke Gradle script' changed build result to FAILURE
Build step 'Invoke Gradle script' marked build as failure
---------------------------------------------------------------------
To unsubscribe, e-mail: builds-unsubscribe@beam.apache.org
For additional commands, e-mail: builds-help@beam.apache.org
Build failed in Jenkins: beam_PostCommit_Python2 #1708
Posted by Apache Jenkins Server <je...@builds.apache.org>.
See <https://builds.apache.org/job/beam_PostCommit_Python2/1708/display/redirect?page=changes>
Changes:
[github] [BEAM-5605] Convert all BoundedSources to SplittableDoFns when using
------------------------------------------
[...truncated 3.76 MB...]
INFO:apache_beam.io.filebasedsink:Renamed 4 shards in 0.12 seconds.
20/02/13 21:25:31 INFO org.apache.beam.runners.spark.SparkPipelineRunner: Job BeamApp-jenkins-0213212517-c690f0b2_a9d6840d-906e-4be2-a54d-063e4e3a33e6 finished.
20/02/13 21:25:31 INFO org.apache.beam.runners.fnexecution.artifact.AbstractArtifactRetrievalService: Manifest at /tmp/beam-temp1D1Ka2/artifacts9nK1GZ/job_ab87601a-6f6a-4273-be7c-851aa8388e1d/MANIFEST has 1 artifact locations
20/02/13 21:25:31 INFO org.apache.beam.runners.fnexecution.artifact.BeamFileSystemArtifactStagingService: Removed dir /tmp/beam-temp1D1Ka2/artifacts9nK1GZ/job_ab87601a-6f6a-4273-be7c-851aa8388e1d/
INFO:apache_beam.runners.portability.portable_runner:Job state changed to DONE
20/02/13 21:25:31 INFO org.apache.beam.runners.fnexecution.jobsubmission.InMemoryJobService: Getting job metrics for BeamApp-jenkins-0213212517-c690f0b2_a9d6840d-906e-4be2-a54d-063e4e3a33e6
20/02/13 21:25:31 INFO org.apache.beam.runners.fnexecution.jobsubmission.InMemoryJobService: Finished getting job metrics for BeamApp-jenkins-0213212517-c690f0b2_a9d6840d-906e-4be2-a54d-063e4e3a33e6
INFO:root:number of empty lines: 2
INFO:root:average word length: 3
ERROR:apache_beam.runners.worker.data_plane:Failed to read inputs in the data plane.
Traceback (most recent call last):
File "<https://builds.apache.org/job/beam_PostCommit_Python2/ws/src/sdks/python/apache_beam/runners/worker/data_plane.py",> line 419, in _read_inputs
for elements in elements_iterator:
File "<https://builds.apache.org/job/beam_PostCommit_Python2/ws/src/build/gradleenv/1866363813/local/lib/python2.7/site-packages/grpc/_channel.py",> line 413, in next
return self._next()
File "<https://builds.apache.org/job/beam_PostCommit_Python2/ws/src/build/gradleenv/1866363813/local/lib/python2.7/site-packages/grpc/_channel.py",> line 706, in _next
raise self
_MultiThreadedRendezvous: <_MultiThreadedRendezvous of RPC that terminated with:
status = StatusCode.UNAVAILABLE
details = "Socket closed"
debug_error_string = "{"created":"@1581629131.944116333","description":"Error received from peer ipv4:127.0.0.1:46477","file":"src/core/lib/surface/call.cc","file_line":1056,"grpc_message":"Socket closed","grpc_status":14}"
>
Exception in thread read_grpc_client_inputs:
Traceback (most recent call last):
File "/usr/lib/python2.7/threading.py", line 801, in __bootstrap_inner
self.run()
File "/usr/lib/python2.7/threading.py", line 754, in run
self.__target(*self.__args, **self.__kwargs)
File "<https://builds.apache.org/job/beam_PostCommit_Python2/ws/src/sdks/python/apache_beam/runners/worker/data_plane.py",> line 434, in <lambda>
target=lambda: self._read_inputs(elements_iterator),
File "<https://builds.apache.org/job/beam_PostCommit_Python2/ws/src/sdks/python/apache_beam/runners/worker/data_plane.py",> line 419, in _read_inputs
for elements in elements_iterator:
File "<https://builds.apache.org/job/beam_PostCommit_Python2/ws/src/build/gradleenv/1866363813/local/lib/python2.7/site-packages/grpc/_channel.py",> line 413, in next
return self._next()
File "<https://builds.apache.org/job/beam_PostCommit_Python2/ws/src/build/gradleenv/1866363813/local/lib/python2.7/site-packages/grpc/_channel.py",> line 706, in _next
raise self
_MultiThreadedRendezvous: <_MultiThreadedRendezvous of RPC that terminated with:
status = StatusCode.UNAVAILABLE
details = "Socket closed"
debug_error_string = "{"created":"@1581629131.944116333","description":"Error received from peer ipv4:127.0.0.1:46477","file":"src/core/lib/surface/call.cc","file_line":1056,"grpc_message":"Socket closed","grpc_status":14}"
>
Exception in thread read_state:
Traceback (most recent call last):
File "/usr/lib/python2.7/threading.py", line 801, in __bootstrap_inner
self.run()
File "/usr/lib/python2.7/threading.py", line 754, in run
self.__target(*self.__args, **self.__kwargs)
File "<https://builds.apache.org/job/beam_PostCommit_Python2/ws/src/sdks/python/apache_beam/runners/worker/sdk_worker.py",> line 675, in pull_responses
for response in responses:
File "<https://builds.apache.org/job/beam_PostCommit_Python2/ws/src/build/gradleenv/1866363813/local/lib/python2.7/site-packages/grpc/_channel.py",> line 413, in next
return self._next()
File "<https://builds.apache.org/job/beam_PostCommit_Python2/ws/src/build/gradleenv/1866363813/local/lib/python2.7/site-packages/grpc/_channel.py",> line 706, in _next
raise self
_MultiThreadedRendezvous: <_MultiThreadedRendezvous of RPC that terminated with:
status = StatusCode.UNAVAILABLE
details = "Socket closed"
debug_error_string = "{"created":"@1581629131.944116554","description":"Error received from peer ipv4:127.0.0.1:35877","file":"src/core/lib/surface/call.cc","file_line":1056,"grpc_message":"Socket closed","grpc_status":14}"
>
Exception in thread run_worker_1-1:
Traceback (most recent call last):
File "/usr/lib/python2.7/threading.py", line 801, in __bootstrap_inner
self.run()
File "/usr/lib/python2.7/threading.py", line 754, in run
self.__target(*self.__args, **self.__kwargs)
File "<https://builds.apache.org/job/beam_PostCommit_Python2/ws/src/sdks/python/apache_beam/runners/worker/sdk_worker.py",> line 153, in run
for work_request in control_stub.Control(get_responses()):
File "<https://builds.apache.org/job/beam_PostCommit_Python2/ws/src/build/gradleenv/1866363813/local/lib/python2.7/site-packages/grpc/_channel.py",> line 413, in next
return self._next()
File "<https://builds.apache.org/job/beam_PostCommit_Python2/ws/src/build/gradleenv/1866363813/local/lib/python2.7/site-packages/grpc/_channel.py",> line 706, in _next
raise self
_MultiThreadedRendezvous: <_MultiThreadedRendezvous of RPC that terminated with:
status = StatusCode.UNAVAILABLE
details = "Socket closed"
debug_error_string = "{"created":"@1581629131.944151735","description":"Error received from peer ipv4:127.0.0.1:46669","file":"src/core/lib/surface/call.cc","file_line":1056,"grpc_message":"Socket closed","grpc_status":14}"
>
> Task :sdks:python:test-suites:portable:py2:postCommitPy2
> Task :sdks:python:test-suites:dataflow:py2:postCommitIT
test_leader_board_it (apache_beam.examples.complete.game.leader_board_it_test.LeaderBoardIT) ... ok
test_datastore_write_limit (apache_beam.io.gcp.datastore.v1new.datastore_write_it_test.DatastoreWriteIT) ... SKIP: GCP dependencies are not installed
<https://builds.apache.org/job/beam_PostCommit_Python2/ws/src/sdks/python/apache_beam/io/gcp/big_query_query_to_table_pipeline.py>:87: FutureWarning: _ReadFromBigQuery is experimental.
kms_key=kms_key)
<https://builds.apache.org/job/beam_PostCommit_Python2/ws/src/sdks/python/apache_beam/runners/dataflow/dataflow_runner.py>:787: BeamDeprecationWarning: BigQuerySink is deprecated since 2.11.0. Use WriteToBigQuery instead.
kms_key=transform.kms_key))
test_game_stats_it (apache_beam.examples.complete.game.game_stats_it_test.GameStatsIT) ... ok
<https://builds.apache.org/job/beam_PostCommit_Python2/ws/src/sdks/python/apache_beam/io/gcp/bigquery_file_loads.py>:793: BeamDeprecationWarning: options is deprecated since First stable release. References to <pipeline>.options will not be supported
temp_location = p.options.view_as(GoogleCloudOptions).temp_location
test_wordcount_it (apache_beam.examples.wordcount_it_test.WordCountIT) ... ok
<https://builds.apache.org/job/beam_PostCommit_Python2/ws/src/sdks/python/apache_beam/io/gcp/bigquery_io_read_pipeline.py>:84: FutureWarning: _ReadFromBigQuery is experimental.
(options.view_as(GoogleCloudOptions).project, known_args.input_table))
<https://builds.apache.org/job/beam_PostCommit_Python2/ws/src/sdks/python/apache_beam/io/gcp/bigquery.py>:1655: BeamDeprecationWarning: options is deprecated since First stable release. References to <pipeline>.options will not be supported
temp_location = pcoll.pipeline.options.view_as(
test_wordcount_fnapi_it (apache_beam.examples.wordcount_it_test.WordCountIT) ... ok
<https://builds.apache.org/job/beam_PostCommit_Python2/ws/src/sdks/python/apache_beam/io/gcp/bigquery_read_it_test.py>:275: FutureWarning: _ReadFromBigQuery is experimental.
query=self.query, use_standard_sql=True, project=self.project))
<https://builds.apache.org/job/beam_PostCommit_Python2/ws/src/sdks/python/apache_beam/io/gcp/bigquery.py>:1655: BeamDeprecationWarning: options is deprecated since First stable release. References to <pipeline>.options will not be supported
temp_location = pcoll.pipeline.options.view_as(
test_streaming_wordcount_it (apache_beam.examples.streaming_wordcount_it_test.StreamingWordCountIT) ... ok
<https://builds.apache.org/job/beam_PostCommit_Python2/ws/src/sdks/python/apache_beam/io/gcp/bigquery_read_it_test.py>:162: FutureWarning: _ReadFromBigQuery is experimental.
query=self.query, use_standard_sql=True, project=self.project))
<https://builds.apache.org/job/beam_PostCommit_Python2/ws/src/sdks/python/apache_beam/io/gcp/bigquery.py>:1655: BeamDeprecationWarning: options is deprecated since First stable release. References to <pipeline>.options will not be supported
temp_location = pcoll.pipeline.options.view_as(
test_avro_it (apache_beam.examples.fastavro_it_test.FastavroIT) ... ok
<https://builds.apache.org/job/beam_PostCommit_Python2/ws/src/sdks/python/apache_beam/io/gcp/bigquery_test.py>:823: BeamDeprecationWarning: options is deprecated since First stable release. References to <pipeline>.options will not be supported
streaming = self.test_pipeline.options.view_as(StandardOptions).streaming
<https://builds.apache.org/job/beam_PostCommit_Python2/ws/src/sdks/python/apache_beam/io/gcp/bigquery.py>:1466: BeamDeprecationWarning: options is deprecated since First stable release. References to <pipeline>.options will not be supported
experiments = p.options.view_as(DebugOptions).experiments or []
test_user_score_it (apache_beam.examples.complete.game.user_score_it_test.UserScoreIT) ... ok
<https://builds.apache.org/job/beam_PostCommit_Python2/ws/src/sdks/python/apache_beam/io/gcp/bigquery.py>:1466: BeamDeprecationWarning: options is deprecated since First stable release. References to <pipeline>.options will not be supported
experiments = p.options.view_as(DebugOptions).experiments or []
<https://builds.apache.org/job/beam_PostCommit_Python2/ws/src/sdks/python/apache_beam/io/gcp/bigquery_file_loads.py>:793: BeamDeprecationWarning: options is deprecated since First stable release. References to <pipeline>.options will not be supported
temp_location = p.options.view_as(GoogleCloudOptions).temp_location
test_hourly_team_score_it (apache_beam.examples.complete.game.hourly_team_score_it_test.HourlyTeamScoreIT) ... ok
<https://builds.apache.org/job/beam_PostCommit_Python2/ws/src/sdks/python/apache_beam/io/gcp/bigquery.py>:1463: BeamDeprecationWarning: options is deprecated since First stable release. References to <pipeline>.options will not be supported
self.table_reference.projectId = pcoll.pipeline.options.view_as(
test_multiple_destinations_transform (apache_beam.io.gcp.bigquery_test.BigQueryStreamingInsertTransformIntegrationTests) ... ok
<https://builds.apache.org/job/beam_PostCommit_Python2/ws/src/sdks/python/apache_beam/runners/dataflow/dataflow_runner.py>:787: BeamDeprecationWarning: BigQuerySink is deprecated since 2.11.0. Use WriteToBigQuery instead.
kms_key=transform.kms_key))
<https://builds.apache.org/job/beam_PostCommit_Python2/ws/src/sdks/python/apache_beam/io/gcp/big_query_query_to_table_pipeline.py>:95: BeamDeprecationWarning: BigQuerySink is deprecated since 2.11.0. Use WriteToBigQuery instead.
kms_key=kms_key))
test_value_provider_transform (apache_beam.io.gcp.bigquery_test.BigQueryStreamingInsertTransformIntegrationTests) ... ok
test_iobase_source (apache_beam.io.gcp.bigquery_read_it_test.ReadNewTypesTests) ... ok
test_native_source (apache_beam.io.gcp.bigquery_read_it_test.ReadNewTypesTests) ... ok
test_bigquery_read_1M_python (apache_beam.io.gcp.bigquery_io_read_it_test.BigqueryIOReadIT) ... ok
test_bigquery_read_custom_1M_python (apache_beam.io.gcp.bigquery_io_read_it_test.BigqueryIOReadIT) ... ok
test_bqfl_streaming (apache_beam.io.gcp.bigquery_file_loads_test.BigQueryFileLoadsIT) ... SKIP: TestStream is not supported on TestDataflowRunner
test_multiple_destinations_transform (apache_beam.io.gcp.bigquery_file_loads_test.BigQueryFileLoadsIT) ... ok
test_one_job_fails_all_jobs_fail (apache_beam.io.gcp.bigquery_file_loads_test.BigQueryFileLoadsIT) ... ok
<https://builds.apache.org/job/beam_PostCommit_Python2/ws/src/sdks/python/apache_beam/io/fileio_test.py>:303: FutureWarning: MatchAll is experimental.
| 'GetPath' >> beam.Map(lambda metadata: metadata.path))
<https://builds.apache.org/job/beam_PostCommit_Python2/ws/src/sdks/python/apache_beam/io/fileio_test.py>:316: FutureWarning: MatchAll is experimental.
| 'Checksums' >> beam.Map(compute_hash))
<https://builds.apache.org/job/beam_PostCommit_Python2/ws/src/sdks/python/apache_beam/io/fileio_test.py>:316: FutureWarning: ReadMatches is experimental.
| 'Checksums' >> beam.Map(compute_hash))
test_iobase_source (apache_beam.io.gcp.bigquery_read_it_test.ReadTests) ... ok
test_native_source (apache_beam.io.gcp.bigquery_read_it_test.ReadTests) ... ok
test_copy (apache_beam.io.gcp.gcsio_integration_test.GcsIOIntegrationTest) ... ok
test_copy_batch (apache_beam.io.gcp.gcsio_integration_test.GcsIOIntegrationTest) ... ok
test_copy_batch_kms (apache_beam.io.gcp.gcsio_integration_test.GcsIOIntegrationTest) ... ok
test_copy_batch_rewrite_token (apache_beam.io.gcp.gcsio_integration_test.GcsIOIntegrationTest) ... ok
test_copy_kms (apache_beam.io.gcp.gcsio_integration_test.GcsIOIntegrationTest) ... ok
test_copy_rewrite_token (apache_beam.io.gcp.gcsio_integration_test.GcsIOIntegrationTest) ... ok
test_transform_on_gcs (apache_beam.io.fileio_test.MatchIntegrationTest) ... ok
test_file_loads (apache_beam.io.gcp.bigquery_test.PubSubBigQueryIT) ... SKIP: https://issuetracker.google.com/issues/118375066
test_streaming_inserts (apache_beam.io.gcp.bigquery_test.PubSubBigQueryIT) ... ok
test_parquetio_it (apache_beam.io.parquetio_it_test.TestParquetIT) ... ok
test_basic_execution (apache_beam.testing.test_stream_it_test.TestStreamIntegrationTests) ... SKIP: The "TestDataflowRunner", does not support the TestStream transform. Supported runners: ['DirectRunner', 'SwitchingDirectRunner']
Tests that the TestStream supports emitting to multiple PCollections. ... SKIP: The "TestDataflowRunner", does not support the TestStream transform. Supported runners: ['DirectRunner', 'SwitchingDirectRunner']
Tests that the TestStream can independently control output watermarks. ... SKIP: The "TestDataflowRunner", does not support the TestStream transform. Supported runners: ['DirectRunner', 'SwitchingDirectRunner']
test_metrics_fnapi_it (apache_beam.runners.dataflow.dataflow_exercise_metrics_pipeline_test.ExerciseMetricsPipelineTest) ... ok
test_metrics_it (apache_beam.runners.dataflow.dataflow_exercise_metrics_pipeline_test.ExerciseMetricsPipelineTest) ... ok
test_streaming_data_only (apache_beam.io.gcp.pubsub_integration_test.PubSubIntegrationTest) ... ok
test_streaming_with_attributes (apache_beam.io.gcp.pubsub_integration_test.PubSubIntegrationTest) ... ok
Runs streaming Dataflow job and verifies that user metrics are reported ... ok
test_job_python_from_python_it (apache_beam.transforms.external_test_it.ExternalTransformIT) ... ok
test_big_query_write (apache_beam.io.gcp.bigquery_write_it_test.BigQueryWriteIntegrationTests) ... ok
test_big_query_write_new_types (apache_beam.io.gcp.bigquery_write_it_test.BigQueryWriteIntegrationTests) ... ok
test_big_query_write_schema_autodetect (apache_beam.io.gcp.bigquery_write_it_test.BigQueryWriteIntegrationTests) ... SKIP: DataflowRunner does not support schema autodetection
test_big_query_write_without_schema (apache_beam.io.gcp.bigquery_write_it_test.BigQueryWriteIntegrationTests) ... ok
test_big_query_legacy_sql (apache_beam.io.gcp.big_query_query_to_table_it_test.BigQueryQueryToTableIT) ... ok
test_big_query_new_types (apache_beam.io.gcp.big_query_query_to_table_it_test.BigQueryQueryToTableIT) ... ok
test_big_query_new_types_native (apache_beam.io.gcp.big_query_query_to_table_it_test.BigQueryQueryToTableIT) ... ok
test_big_query_standard_sql (apache_beam.io.gcp.big_query_query_to_table_it_test.BigQueryQueryToTableIT) ... ok
test_big_query_standard_sql_kms_key_native (apache_beam.io.gcp.big_query_query_to_table_it_test.BigQueryQueryToTableIT) ... ok
test_datastore_write_limit (apache_beam.io.gcp.datastore_write_it_test.DatastoreWriteIT) ... ok
----------------------------------------------------------------------
XML: nosetests-postCommitIT-df.xml
----------------------------------------------------------------------
XML: <https://builds.apache.org/job/beam_PostCommit_Python2/ws/src/sdks/python/nosetests.xml>
----------------------------------------------------------------------
Ran 52 tests in 3637.015s
OK (SKIP=7)
Worker logs: https://console.cloud.google.com/dataflow/jobsDetail/locations/us-central1/jobs/2020-02-13_13_17_09-4907884419939093997?project=apache-beam-testing
Worker logs: https://console.cloud.google.com/dataflow/jobsDetail/locations/us-central1/jobs/2020-02-13_13_35_31-4737823573400570518?project=apache-beam-testing
Worker logs: https://console.cloud.google.com/dataflow/jobsDetail/locations/us-central1/jobs/2020-02-13_13_43_00-8586729237257907350?project=apache-beam-testing
Worker logs: https://console.cloud.google.com/dataflow/jobsDetail/locations/us-central1/jobs/2020-02-13_13_49_23-9559704715809827294?project=apache-beam-testing
Worker logs: https://console.cloud.google.com/dataflow/jobsDetail/locations/us-central1/jobs/2020-02-13_13_56_21-5168265434566500742?project=apache-beam-testing
Worker logs: https://console.cloud.google.com/dataflow/jobsDetail/locations/us-central1/jobs/2020-02-13_14_03_18-3421031382479681347?project=apache-beam-testing
Worker logs: https://console.cloud.google.com/dataflow/jobsDetail/locations/us-central1/jobs/2020-02-13_14_10_06-993089964093327813?project=apache-beam-testing
Worker logs: https://console.cloud.google.com/dataflow/jobsDetail/locations/us-central1/jobs/2020-02-13_13_17_14-6198833378771660174?project=apache-beam-testing
Worker logs: https://console.cloud.google.com/dataflow/jobsDetail/locations/us-central1/jobs/2020-02-13_13_31_05-8404425341472862683?project=apache-beam-testing
Worker logs: https://console.cloud.google.com/dataflow/jobsDetail/locations/us-central1/jobs/2020-02-13_13_39_11-3976292727988297062?project=apache-beam-testing
Worker logs: https://console.cloud.google.com/dataflow/jobsDetail/locations/us-central1/jobs/2020-02-13_13_46_32-15242250910793359924?project=apache-beam-testing
Worker logs: https://console.cloud.google.com/dataflow/jobsDetail/locations/us-central1/jobs/2020-02-13_13_53_15-16948450059233345643?project=apache-beam-testing
Worker logs: https://console.cloud.google.com/dataflow/jobsDetail/locations/us-central1/jobs/2020-02-13_13_17_09-18144170382268510047?project=apache-beam-testing
Worker logs: https://console.cloud.google.com/dataflow/jobsDetail/locations/us-central1/jobs/2020-02-13_13_36_55-733166156898641592?project=apache-beam-testing
Worker logs: https://console.cloud.google.com/dataflow/jobsDetail/locations/us-central1/jobs/2020-02-13_13_54_09-2164507164815920004?project=apache-beam-testing
Worker logs: https://console.cloud.google.com/dataflow/jobsDetail/locations/us-central1/jobs/2020-02-13_13_17_12-17460388283498012367?project=apache-beam-testing
Worker logs: https://console.cloud.google.com/dataflow/jobsDetail/locations/us-central1/jobs/2020-02-13_13_28_57-10462117316203903520?project=apache-beam-testing
Worker logs: https://console.cloud.google.com/dataflow/jobsDetail/locations/us-central1/jobs/2020-02-13_13_35_56-11751126160064087864?project=apache-beam-testing
Worker logs: https://console.cloud.google.com/dataflow/jobsDetail/locations/us-central1/jobs/2020-02-13_13_42_45-7977473099954543949?project=apache-beam-testing
Worker logs: https://console.cloud.google.com/dataflow/jobsDetail/locations/us-central1/jobs/2020-02-13_13_48_50-3609762820515212038?project=apache-beam-testing
Worker logs: https://console.cloud.google.com/dataflow/jobsDetail/locations/us-central1/jobs/2020-02-13_13_55_41-4258611260313819321?project=apache-beam-testing
Worker logs: https://console.cloud.google.com/dataflow/jobsDetail/locations/us-central1/jobs/2020-02-13_13_17_10-3161291043202143528?project=apache-beam-testing
Worker logs: https://console.cloud.google.com/dataflow/jobsDetail/locations/us-central1/jobs/2020-02-13_13_24_11-13746340844328537125?project=apache-beam-testing
Worker logs: https://console.cloud.google.com/dataflow/jobsDetail/locations/us-central1/jobs/2020-02-13_13_32_48-7180483352121882224?project=apache-beam-testing
Worker logs: https://console.cloud.google.com/dataflow/jobsDetail/locations/us-central1/jobs/2020-02-13_13_40_04-984112193476039517?project=apache-beam-testing
Worker logs: https://console.cloud.google.com/dataflow/jobsDetail/locations/us-central1/jobs/2020-02-13_13_46_33-10525719439033049871?project=apache-beam-testing
Worker logs: https://console.cloud.google.com/dataflow/jobsDetail/locations/us-central1/jobs/2020-02-13_13_17_07-2388359683478505537?project=apache-beam-testing
Worker logs: https://console.cloud.google.com/dataflow/jobsDetail/locations/us-central1/jobs/2020-02-13_13_24_34-530500074416806637?project=apache-beam-testing
Worker logs: https://console.cloud.google.com/dataflow/jobsDetail/locations/us-central1/jobs/2020-02-13_13_32_08-15392128189576501500?project=apache-beam-testing
Worker logs: https://console.cloud.google.com/dataflow/jobsDetail/locations/us-central1/jobs/2020-02-13_13_39_05-4941885056718048762?project=apache-beam-testing
Worker logs: https://console.cloud.google.com/dataflow/jobsDetail/locations/us-central1/jobs/2020-02-13_13_46_44-16852184815524500493?project=apache-beam-testing
Worker logs: https://console.cloud.google.com/dataflow/jobsDetail/locations/us-central1/jobs/2020-02-13_13_53_07-9148904012716012947?project=apache-beam-testing
Worker logs: https://console.cloud.google.com/dataflow/jobsDetail/locations/us-central1/jobs/2020-02-13_13_17_09-7870513608999903028?project=apache-beam-testing
Worker logs: https://console.cloud.google.com/dataflow/jobsDetail/locations/us-central1/jobs/2020-02-13_13_24_38-7428716793654555749?project=apache-beam-testing
Worker logs: https://console.cloud.google.com/dataflow/jobsDetail/locations/us-central1/jobs/2020-02-13_13_31_47-11804343370400937343?project=apache-beam-testing
Worker logs: https://console.cloud.google.com/dataflow/jobsDetail/locations/us-central1/jobs/2020-02-13_13_39_12-2388303114473341454?project=apache-beam-testing
Worker logs: https://console.cloud.google.com/dataflow/jobsDetail/locations/us-central1/jobs/2020-02-13_13_46_10-3039933981463901577?project=apache-beam-testing
Worker logs: https://console.cloud.google.com/dataflow/jobsDetail/locations/us-central1/jobs/2020-02-13_13_53_08-5118432351911001909?project=apache-beam-testing
Worker logs: https://console.cloud.google.com/dataflow/jobsDetail/locations/us-central1/jobs/2020-02-13_13_17_11-16990140182674791061?project=apache-beam-testing
Worker logs: https://console.cloud.google.com/dataflow/jobsDetail/locations/us-central1/jobs/2020-02-13_13_24_50-18356751826468223718?project=apache-beam-testing
Worker logs: https://console.cloud.google.com/dataflow/jobsDetail/locations/us-central1/jobs/2020-02-13_13_34_30-14285548297120619938?project=apache-beam-testing
Worker logs: https://console.cloud.google.com/dataflow/jobsDetail/locations/us-central1/jobs/2020-02-13_13_41_26-11921233597685230912?project=apache-beam-testing
Worker logs: https://console.cloud.google.com/dataflow/jobsDetail/locations/us-central1/jobs/2020-02-13_13_48_31-12480771940635470084?project=apache-beam-testing
Worker logs: https://console.cloud.google.com/dataflow/jobsDetail/locations/us-central1/jobs/2020-02-13_13_54_46-15660023631240159628?project=apache-beam-testing
FAILURE: Build failed with an exception.
* Where:
Build file '<https://builds.apache.org/job/beam_PostCommit_Python2/ws/src/sdks/python/test-suites/direct/py2/build.gradle'> line: 50
* What went wrong:
Execution failed for task ':sdks:python:test-suites:direct:py2:directRunnerIT'.
> Process 'command 'sh'' finished with non-zero exit value 1
* Try:
Run with --stacktrace option to get the stack trace. Run with --info or --debug option to get more log output. Run with --scan to get full insights.
* Get more help at https://help.gradle.org
Deprecated Gradle features were used in this build, making it incompatible with Gradle 6.0.
Use '--warning-mode all' to show the individual deprecation warnings.
See https://docs.gradle.org/5.2.1/userguide/command_line_interface.html#sec:command_line_warnings
BUILD FAILED in 1h 1m 55s
124 actionable tasks: 100 executed, 21 from cache, 3 up-to-date
Publishing build scan...
https://gradle.com/s/kyudetxllnot2
Build step 'Invoke Gradle script' changed build result to FAILURE
Build step 'Invoke Gradle script' marked build as failure
---------------------------------------------------------------------
To unsubscribe, e-mail: builds-unsubscribe@beam.apache.org
For additional commands, e-mail: builds-help@beam.apache.org
Build failed in Jenkins: beam_PostCommit_Python2 #1707
Posted by Apache Jenkins Server <je...@builds.apache.org>.
See <https://builds.apache.org/job/beam_PostCommit_Python2/1707/display/redirect>
Changes:
------------------------------------------
[...truncated 3.69 MB...]
INFO:apache_beam.io.filebasedsink:Renamed 4 shards in 0.12 seconds.
20/02/13 18:46:05 INFO org.apache.beam.runners.spark.SparkPipelineRunner: Job BeamApp-jenkins-0213184547-98e583fc_0482453e-4b33-421a-a9d0-9bcdb93ae37e finished.
20/02/13 18:46:05 INFO org.apache.beam.runners.fnexecution.artifact.AbstractArtifactRetrievalService: Manifest at /tmp/beam-tempa7GBYP/artifacts0XrEPg/job_6077546e-642b-4f12-afae-6d201419fff6/MANIFEST has 1 artifact locations
20/02/13 18:46:05 INFO org.apache.beam.runners.fnexecution.artifact.BeamFileSystemArtifactStagingService: Removed dir /tmp/beam-tempa7GBYP/artifacts0XrEPg/job_6077546e-642b-4f12-afae-6d201419fff6/
INFO:apache_beam.runners.portability.portable_runner:Job state changed to DONE
20/02/13 18:46:06 INFO org.apache.beam.runners.fnexecution.jobsubmission.InMemoryJobService: Getting job metrics for BeamApp-jenkins-0213184547-98e583fc_0482453e-4b33-421a-a9d0-9bcdb93ae37e
20/02/13 18:46:06 INFO org.apache.beam.runners.fnexecution.jobsubmission.InMemoryJobService: Finished getting job metrics for BeamApp-jenkins-0213184547-98e583fc_0482453e-4b33-421a-a9d0-9bcdb93ae37e
INFO:root:number of empty lines: 2
INFO:root:average word length: 3
Exception in thread read_state:
Traceback (most recent call last):
File "/usr/lib/python2.7/threading.py", line 801, in __bootstrap_inner
self.run()
File "/usr/lib/python2.7/threading.py", line 754, in run
self.__target(*self.__args, **self.__kwargs)
File "<https://builds.apache.org/job/beam_PostCommit_Python2/ws/src/sdks/python/apache_beam/runners/worker/sdk_worker.py",> line 675, in pull_responses
for response in responses:
File "<https://builds.apache.org/job/beam_PostCommit_Python2/ws/src/build/gradleenv/1866363813/local/lib/python2.7/site-packages/grpc/_channel.py",> line 413, in next
return self._next()
File "<https://builds.apache.org/job/beam_PostCommit_Python2/ws/src/build/gradleenv/1866363813/local/lib/python2.7/site-packages/grpc/_channel.py",> line 706, in _next
raise self
_MultiThreadedRendezvous: <_MultiThreadedRendezvous of RPC that terminated with:
status = StatusCode.UNAVAILABLE
details = "Socket closed"
debug_error_string = "{"created":"@1581619566.427697614","description":"Error received from peer ipv4:127.0.0.1:37953","file":"src/core/lib/surface/call.cc","file_line":1056,"grpc_message":"Socket closed","grpc_status":14}"
>
ERROR:apache_beam.runners.worker.data_plane:Failed to read inputs in the data plane.
Traceback (most recent call last):
File "<https://builds.apache.org/job/beam_PostCommit_Python2/ws/src/sdks/python/apache_beam/runners/worker/data_plane.py",> line 419, in _read_inputs
for elements in elements_iterator:
File "<https://builds.apache.org/job/beam_PostCommit_Python2/ws/src/build/gradleenv/1866363813/local/lib/python2.7/site-packages/grpc/_channel.py",> line 413, in next
return self._next()
File "<https://builds.apache.org/job/beam_PostCommit_Python2/ws/src/build/gradleenv/1866363813/local/lib/python2.7/site-packages/grpc/_channel.py",> line 706, in _next
raise self
_MultiThreadedRendezvous: <_MultiThreadedRendezvous of RPC that terminated with:
status = StatusCode.UNAVAILABLE
details = "Socket closed"
debug_error_string = "{"created":"@1581619566.427642384","description":"Error received from peer ipv4:127.0.0.1:45173","file":"src/core/lib/surface/call.cc","file_line":1056,"grpc_message":"Socket closed","grpc_status":14}"
>
Exception in thread read_grpc_client_inputs:
Traceback (most recent call last):
File "/usr/lib/python2.7/threading.py", line 801, in __bootstrap_inner
self.run()
File "/usr/lib/python2.7/threading.py", line 754, in run
self.__target(*self.__args, **self.__kwargs)
File "<https://builds.apache.org/job/beam_PostCommit_Python2/ws/src/sdks/python/apache_beam/runners/worker/data_plane.py",> line 434, in <lambda>
target=lambda: self._read_inputs(elements_iterator),
File "<https://builds.apache.org/job/beam_PostCommit_Python2/ws/src/sdks/python/apache_beam/runners/worker/data_plane.py",> line 419, in _read_inputs
for elements in elements_iterator:
File "<https://builds.apache.org/job/beam_PostCommit_Python2/ws/src/build/gradleenv/1866363813/local/lib/python2.7/site-packages/grpc/_channel.py",> line 413, in next
return self._next()
File "<https://builds.apache.org/job/beam_PostCommit_Python2/ws/src/build/gradleenv/1866363813/local/lib/python2.7/site-packages/grpc/_channel.py",> line 706, in _next
raise self
_MultiThreadedRendezvous: <_MultiThreadedRendezvous of RPC that terminated with:
status = StatusCode.UNAVAILABLE
details = "Socket closed"
debug_error_string = "{"created":"@1581619566.427642384","description":"Error received from peer ipv4:127.0.0.1:45173","file":"src/core/lib/surface/call.cc","file_line":1056,"grpc_message":"Socket closed","grpc_status":14}"
>
Exception in thread run_worker_1-1:
Traceback (most recent call last):
File "/usr/lib/python2.7/threading.py", line 801, in __bootstrap_inner
self.run()
File "/usr/lib/python2.7/threading.py", line 754, in run
self.__target(*self.__args, **self.__kwargs)
File "<https://builds.apache.org/job/beam_PostCommit_Python2/ws/src/sdks/python/apache_beam/runners/worker/sdk_worker.py",> line 153, in run
for work_request in control_stub.Control(get_responses()):
File "<https://builds.apache.org/job/beam_PostCommit_Python2/ws/src/build/gradleenv/1866363813/local/lib/python2.7/site-packages/grpc/_channel.py",> line 413, in next
return self._next()
File "<https://builds.apache.org/job/beam_PostCommit_Python2/ws/src/build/gradleenv/1866363813/local/lib/python2.7/site-packages/grpc/_channel.py",> line 706, in _next
raise self
_MultiThreadedRendezvous: <_MultiThreadedRendezvous of RPC that terminated with:
status = StatusCode.UNAVAILABLE
details = "Socket closed"
debug_error_string = "{"created":"@1581619566.427857839","description":"Error received from peer ipv4:127.0.0.1:35893","file":"src/core/lib/surface/call.cc","file_line":1056,"grpc_message":"Socket closed","grpc_status":14}"
>
> Task :sdks:python:test-suites:portable:py2:postCommitPy2
> Task :sdks:python:test-suites:dataflow:py2:postCommitIT
test_leader_board_it (apache_beam.examples.complete.game.leader_board_it_test.LeaderBoardIT) ... ok
test_datastore_write_limit (apache_beam.io.gcp.datastore.v1new.datastore_write_it_test.DatastoreWriteIT) ... SKIP: GCP dependencies are not installed
<https://builds.apache.org/job/beam_PostCommit_Python2/ws/src/sdks/python/apache_beam/io/gcp/big_query_query_to_table_pipeline.py>:87: FutureWarning: _ReadFromBigQuery is experimental.
kms_key=kms_key)
<https://builds.apache.org/job/beam_PostCommit_Python2/ws/src/sdks/python/apache_beam/runners/dataflow/dataflow_runner.py>:787: BeamDeprecationWarning: BigQuerySink is deprecated since 2.11.0. Use WriteToBigQuery instead.
kms_key=transform.kms_key))
test_wordcount_fnapi_it (apache_beam.examples.wordcount_it_test.WordCountIT) ... ok
<https://builds.apache.org/job/beam_PostCommit_Python2/ws/src/sdks/python/apache_beam/io/gcp/bigquery.py>:1466: BeamDeprecationWarning: options is deprecated since First stable release. References to <pipeline>.options will not be supported
experiments = p.options.view_as(DebugOptions).experiments or []
<https://builds.apache.org/job/beam_PostCommit_Python2/ws/src/sdks/python/apache_beam/io/gcp/bigquery_file_loads.py>:793: BeamDeprecationWarning: options is deprecated since First stable release. References to <pipeline>.options will not be supported
temp_location = p.options.view_as(GoogleCloudOptions).temp_location
test_game_stats_it (apache_beam.examples.complete.game.game_stats_it_test.GameStatsIT) ... ok
<https://builds.apache.org/job/beam_PostCommit_Python2/ws/src/sdks/python/apache_beam/io/gcp/bigquery_io_read_pipeline.py>:84: FutureWarning: _ReadFromBigQuery is experimental.
(options.view_as(GoogleCloudOptions).project, known_args.input_table))
test_wordcount_it (apache_beam.examples.wordcount_it_test.WordCountIT) ... ok
<https://builds.apache.org/job/beam_PostCommit_Python2/ws/src/sdks/python/apache_beam/io/gcp/bigquery_read_it_test.py>:275: FutureWarning: _ReadFromBigQuery is experimental.
query=self.query, use_standard_sql=True, project=self.project))
<https://builds.apache.org/job/beam_PostCommit_Python2/ws/src/sdks/python/apache_beam/io/gcp/bigquery.py>:1655: BeamDeprecationWarning: options is deprecated since First stable release. References to <pipeline>.options will not be supported
temp_location = pcoll.pipeline.options.view_as(
test_streaming_wordcount_it (apache_beam.examples.streaming_wordcount_it_test.StreamingWordCountIT) ... ok
<https://builds.apache.org/job/beam_PostCommit_Python2/ws/src/sdks/python/apache_beam/io/gcp/bigquery_read_it_test.py>:162: FutureWarning: _ReadFromBigQuery is experimental.
query=self.query, use_standard_sql=True, project=self.project))
<https://builds.apache.org/job/beam_PostCommit_Python2/ws/src/sdks/python/apache_beam/io/gcp/bigquery.py>:1655: BeamDeprecationWarning: options is deprecated since First stable release. References to <pipeline>.options will not be supported
temp_location = pcoll.pipeline.options.view_as(
test_user_score_it (apache_beam.examples.complete.game.user_score_it_test.UserScoreIT) ... ok
<https://builds.apache.org/job/beam_PostCommit_Python2/ws/src/sdks/python/apache_beam/io/gcp/bigquery_test.py>:823: BeamDeprecationWarning: options is deprecated since First stable release. References to <pipeline>.options will not be supported
streaming = self.test_pipeline.options.view_as(StandardOptions).streaming
<https://builds.apache.org/job/beam_PostCommit_Python2/ws/src/sdks/python/apache_beam/io/gcp/bigquery.py>:1466: BeamDeprecationWarning: options is deprecated since First stable release. References to <pipeline>.options will not be supported
experiments = p.options.view_as(DebugOptions).experiments or []
test_hourly_team_score_it (apache_beam.examples.complete.game.hourly_team_score_it_test.HourlyTeamScoreIT) ... ok
<https://builds.apache.org/job/beam_PostCommit_Python2/ws/src/sdks/python/apache_beam/io/gcp/bigquery.py>:1466: BeamDeprecationWarning: options is deprecated since First stable release. References to <pipeline>.options will not be supported
experiments = p.options.view_as(DebugOptions).experiments or []
<https://builds.apache.org/job/beam_PostCommit_Python2/ws/src/sdks/python/apache_beam/io/gcp/bigquery_file_loads.py>:793: BeamDeprecationWarning: options is deprecated since First stable release. References to <pipeline>.options will not be supported
temp_location = p.options.view_as(GoogleCloudOptions).temp_location
test_avro_it (apache_beam.examples.fastavro_it_test.FastavroIT) ... ok
<https://builds.apache.org/job/beam_PostCommit_Python2/ws/src/sdks/python/apache_beam/io/gcp/bigquery.py>:1463: BeamDeprecationWarning: options is deprecated since First stable release. References to <pipeline>.options will not be supported
self.table_reference.projectId = pcoll.pipeline.options.view_as(
test_multiple_destinations_transform (apache_beam.io.gcp.bigquery_test.BigQueryStreamingInsertTransformIntegrationTests) ... ok
<https://builds.apache.org/job/beam_PostCommit_Python2/ws/src/sdks/python/apache_beam/runners/dataflow/dataflow_runner.py>:787: BeamDeprecationWarning: BigQuerySink is deprecated since 2.11.0. Use WriteToBigQuery instead.
kms_key=transform.kms_key))
test_value_provider_transform (apache_beam.io.gcp.bigquery_test.BigQueryStreamingInsertTransformIntegrationTests) ... ok
<https://builds.apache.org/job/beam_PostCommit_Python2/ws/src/sdks/python/apache_beam/io/gcp/big_query_query_to_table_pipeline.py>:95: BeamDeprecationWarning: BigQuerySink is deprecated since 2.11.0. Use WriteToBigQuery instead.
kms_key=kms_key))
test_iobase_source (apache_beam.io.gcp.bigquery_read_it_test.ReadTests) ... ok
test_native_source (apache_beam.io.gcp.bigquery_read_it_test.ReadTests) ... ok
test_iobase_source (apache_beam.io.gcp.bigquery_read_it_test.ReadNewTypesTests) ... ok
test_native_source (apache_beam.io.gcp.bigquery_read_it_test.ReadNewTypesTests) ... ok
test_bigquery_read_1M_python (apache_beam.io.gcp.bigquery_io_read_it_test.BigqueryIOReadIT) ... ok
test_bigquery_read_custom_1M_python (apache_beam.io.gcp.bigquery_io_read_it_test.BigqueryIOReadIT) ... ok
<https://builds.apache.org/job/beam_PostCommit_Python2/ws/src/sdks/python/apache_beam/io/fileio_test.py>:303: FutureWarning: MatchAll is experimental.
| 'GetPath' >> beam.Map(lambda metadata: metadata.path))
<https://builds.apache.org/job/beam_PostCommit_Python2/ws/src/sdks/python/apache_beam/io/fileio_test.py>:316: FutureWarning: MatchAll is experimental.
| 'Checksums' >> beam.Map(compute_hash))
<https://builds.apache.org/job/beam_PostCommit_Python2/ws/src/sdks/python/apache_beam/io/fileio_test.py>:316: FutureWarning: ReadMatches is experimental.
| 'Checksums' >> beam.Map(compute_hash))
test_copy (apache_beam.io.gcp.gcsio_integration_test.GcsIOIntegrationTest) ... ok
test_copy_batch (apache_beam.io.gcp.gcsio_integration_test.GcsIOIntegrationTest) ... ok
test_copy_batch_kms (apache_beam.io.gcp.gcsio_integration_test.GcsIOIntegrationTest) ... ok
test_copy_batch_rewrite_token (apache_beam.io.gcp.gcsio_integration_test.GcsIOIntegrationTest) ... ok
test_copy_kms (apache_beam.io.gcp.gcsio_integration_test.GcsIOIntegrationTest) ... ok
test_copy_rewrite_token (apache_beam.io.gcp.gcsio_integration_test.GcsIOIntegrationTest) ... ok
test_bqfl_streaming (apache_beam.io.gcp.bigquery_file_loads_test.BigQueryFileLoadsIT) ... SKIP: TestStream is not supported on TestDataflowRunner
test_multiple_destinations_transform (apache_beam.io.gcp.bigquery_file_loads_test.BigQueryFileLoadsIT) ... ok
test_one_job_fails_all_jobs_fail (apache_beam.io.gcp.bigquery_file_loads_test.BigQueryFileLoadsIT) ... ok
test_transform_on_gcs (apache_beam.io.fileio_test.MatchIntegrationTest) ... ok
test_file_loads (apache_beam.io.gcp.bigquery_test.PubSubBigQueryIT) ... SKIP: https://issuetracker.google.com/issues/118375066
test_streaming_inserts (apache_beam.io.gcp.bigquery_test.PubSubBigQueryIT) ... ok
test_parquetio_it (apache_beam.io.parquetio_it_test.TestParquetIT) ... ok
test_basic_execution (apache_beam.testing.test_stream_it_test.TestStreamIntegrationTests) ... SKIP: The "TestDataflowRunner", does not support the TestStream transform. Supported runners: ['DirectRunner', 'SwitchingDirectRunner']
Tests that the TestStream supports emitting to multiple PCollections. ... SKIP: The "TestDataflowRunner", does not support the TestStream transform. Supported runners: ['DirectRunner', 'SwitchingDirectRunner']
Tests that the TestStream can independently control output watermarks. ... SKIP: The "TestDataflowRunner", does not support the TestStream transform. Supported runners: ['DirectRunner', 'SwitchingDirectRunner']
test_streaming_data_only (apache_beam.io.gcp.pubsub_integration_test.PubSubIntegrationTest) ... ok
test_streaming_with_attributes (apache_beam.io.gcp.pubsub_integration_test.PubSubIntegrationTest) ... ok
Runs streaming Dataflow job and verifies that user metrics are reported ... ok
test_big_query_write (apache_beam.io.gcp.bigquery_write_it_test.BigQueryWriteIntegrationTests) ... ok
test_big_query_write_new_types (apache_beam.io.gcp.bigquery_write_it_test.BigQueryWriteIntegrationTests) ... ok
test_big_query_write_schema_autodetect (apache_beam.io.gcp.bigquery_write_it_test.BigQueryWriteIntegrationTests) ... SKIP: DataflowRunner does not support schema autodetection
test_big_query_write_without_schema (apache_beam.io.gcp.bigquery_write_it_test.BigQueryWriteIntegrationTests) ... ok
test_job_python_from_python_it (apache_beam.transforms.external_test_it.ExternalTransformIT) ... ok
test_metrics_fnapi_it (apache_beam.runners.dataflow.dataflow_exercise_metrics_pipeline_test.ExerciseMetricsPipelineTest) ... ok
test_metrics_it (apache_beam.runners.dataflow.dataflow_exercise_metrics_pipeline_test.ExerciseMetricsPipelineTest) ... ok
test_big_query_legacy_sql (apache_beam.io.gcp.big_query_query_to_table_it_test.BigQueryQueryToTableIT) ... ok
test_big_query_new_types (apache_beam.io.gcp.big_query_query_to_table_it_test.BigQueryQueryToTableIT) ... ok
test_big_query_new_types_native (apache_beam.io.gcp.big_query_query_to_table_it_test.BigQueryQueryToTableIT) ... ok
test_big_query_standard_sql (apache_beam.io.gcp.big_query_query_to_table_it_test.BigQueryQueryToTableIT) ... ok
test_big_query_standard_sql_kms_key_native (apache_beam.io.gcp.big_query_query_to_table_it_test.BigQueryQueryToTableIT) ... ok
test_datastore_write_limit (apache_beam.io.gcp.datastore_write_it_test.DatastoreWriteIT) ... ok
----------------------------------------------------------------------
XML: nosetests-postCommitIT-df.xml
----------------------------------------------------------------------
XML: <https://builds.apache.org/job/beam_PostCommit_Python2/ws/src/sdks/python/nosetests.xml>
----------------------------------------------------------------------
Ran 52 tests in 3398.966s
OK (SKIP=7)
Worker logs: https://console.cloud.google.com/dataflow/jobsDetail/locations/us-central1/jobs/2020-02-13_10_37_27-4348669194324502591?project=apache-beam-testing
Worker logs: https://console.cloud.google.com/dataflow/jobsDetail/locations/us-central1/jobs/2020-02-13_10_54_29-3877427826324016514?project=apache-beam-testing
Worker logs: https://console.cloud.google.com/dataflow/jobsDetail/locations/us-central1/jobs/2020-02-13_11_01_46-2434402530366248552?project=apache-beam-testing
Worker logs: https://console.cloud.google.com/dataflow/jobsDetail/locations/us-central1/jobs/2020-02-13_11_07_36-2219452997595404986?project=apache-beam-testing
Worker logs: https://console.cloud.google.com/dataflow/jobsDetail/locations/us-central1/jobs/2020-02-13_11_13_53-6733999462066549495?project=apache-beam-testing
Worker logs: https://console.cloud.google.com/dataflow/jobsDetail/locations/us-central1/jobs/2020-02-13_11_20_26-14837453249751830023?project=apache-beam-testing
Worker logs: https://console.cloud.google.com/dataflow/jobsDetail/locations/us-central1/jobs/2020-02-13_11_27_17-10229582853020599777?project=apache-beam-testing
Worker logs: https://console.cloud.google.com/dataflow/jobsDetail/locations/us-central1/jobs/2020-02-13_10_37_30-693151244298304019?project=apache-beam-testing
Worker logs: https://console.cloud.google.com/dataflow/jobsDetail/locations/us-central1/jobs/2020-02-13_10_51_32-12518246923976622073?project=apache-beam-testing
Worker logs: https://console.cloud.google.com/dataflow/jobsDetail/locations/us-central1/jobs/2020-02-13_10_57_58-8088469147282581204?project=apache-beam-testing
Worker logs: https://console.cloud.google.com/dataflow/jobsDetail/locations/us-central1/jobs/2020-02-13_11_04_38-10478606002342326350?project=apache-beam-testing
Worker logs: https://console.cloud.google.com/dataflow/jobsDetail/locations/us-central1/jobs/2020-02-13_11_11_02-8624008848666403309?project=apache-beam-testing
Worker logs: https://console.cloud.google.com/dataflow/jobsDetail/locations/us-central1/jobs/2020-02-13_10_37_30-10735780872013124850?project=apache-beam-testing
Worker logs: https://console.cloud.google.com/dataflow/jobsDetail/locations/us-central1/jobs/2020-02-13_10_49_32-2078440914721063840?project=apache-beam-testing
Worker logs: https://console.cloud.google.com/dataflow/jobsDetail/locations/us-central1/jobs/2020-02-13_10_56_04-5940570958766382922?project=apache-beam-testing
Worker logs: https://console.cloud.google.com/dataflow/jobsDetail/locations/us-central1/jobs/2020-02-13_11_02_27-4601841722016177299?project=apache-beam-testing
Worker logs: https://console.cloud.google.com/dataflow/jobsDetail/locations/us-central1/jobs/2020-02-13_11_08_54-1099393343807177758?project=apache-beam-testing
Worker logs: https://console.cloud.google.com/dataflow/jobsDetail/locations/us-central1/jobs/2020-02-13_11_15_31-15411574166784799655?project=apache-beam-testing
Worker logs: https://console.cloud.google.com/dataflow/jobsDetail/locations/us-central1/jobs/2020-02-13_10_37_27-12328170816379666867?project=apache-beam-testing
Worker logs: https://console.cloud.google.com/dataflow/jobsDetail/locations/us-central1/jobs/2020-02-13_10_53_15-15932992136082812630?project=apache-beam-testing
Worker logs: https://console.cloud.google.com/dataflow/jobsDetail/locations/us-central1/jobs/2020-02-13_10_59_47-14942239112240153258?project=apache-beam-testing
Worker logs: https://console.cloud.google.com/dataflow/jobsDetail/locations/us-central1/jobs/2020-02-13_11_05_49-1514970690490350130?project=apache-beam-testing
Worker logs: https://console.cloud.google.com/dataflow/jobsDetail/locations/us-central1/jobs/2020-02-13_11_12_00-4587676371622524018?project=apache-beam-testing
Worker logs: https://console.cloud.google.com/dataflow/jobsDetail/locations/us-central1/jobs/2020-02-13_10_37_25-12769403244155150600?project=apache-beam-testing
Worker logs: https://console.cloud.google.com/dataflow/jobsDetail/locations/us-central1/jobs/2020-02-13_10_44_33-1603351699165859427?project=apache-beam-testing
Worker logs: https://console.cloud.google.com/dataflow/jobsDetail/locations/us-central1/jobs/2020-02-13_10_51_19-961029338361555320?project=apache-beam-testing
Worker logs: https://console.cloud.google.com/dataflow/jobsDetail/locations/us-central1/jobs/2020-02-13_10_59_37-5653356600399795329?project=apache-beam-testing
Worker logs: https://console.cloud.google.com/dataflow/jobsDetail/locations/us-central1/jobs/2020-02-13_11_07_11-10307547458336733877?project=apache-beam-testing
Worker logs: https://console.cloud.google.com/dataflow/jobsDetail/locations/us-central1/jobs/2020-02-13_11_13_29-7371003102231490166?project=apache-beam-testing
Worker logs: https://console.cloud.google.com/dataflow/jobsDetail/locations/us-central1/jobs/2020-02-13_10_37_26-16164298858048645558?project=apache-beam-testing
Worker logs: https://console.cloud.google.com/dataflow/jobsDetail/locations/us-central1/jobs/2020-02-13_10_43_56-57103530884646014?project=apache-beam-testing
Worker logs: https://console.cloud.google.com/dataflow/jobsDetail/locations/us-central1/jobs/2020-02-13_10_52_05-8115941043988836993?project=apache-beam-testing
Worker logs: https://console.cloud.google.com/dataflow/jobsDetail/locations/us-central1/jobs/2020-02-13_10_58_30-4244576108863797760?project=apache-beam-testing
Worker logs: https://console.cloud.google.com/dataflow/jobsDetail/locations/us-central1/jobs/2020-02-13_11_04_50-16770035604662157053?project=apache-beam-testing
Worker logs: https://console.cloud.google.com/dataflow/jobsDetail/locations/us-central1/jobs/2020-02-13_10_37_25-16059179986095970963?project=apache-beam-testing
Worker logs: https://console.cloud.google.com/dataflow/jobsDetail/locations/us-central1/jobs/2020-02-13_10_44_38-16089550679907741221?project=apache-beam-testing
Worker logs: https://console.cloud.google.com/dataflow/jobsDetail/locations/us-central1/jobs/2020-02-13_10_51_38-9845656274308186399?project=apache-beam-testing
Worker logs: https://console.cloud.google.com/dataflow/jobsDetail/locations/us-central1/jobs/2020-02-13_10_58_33-9260313788810355918?project=apache-beam-testing
Worker logs: https://console.cloud.google.com/dataflow/jobsDetail/locations/us-central1/jobs/2020-02-13_11_04_28-10725472051983498780?project=apache-beam-testing
Worker logs: https://console.cloud.google.com/dataflow/jobsDetail/locations/us-central1/jobs/2020-02-13_11_11_24-15090608519608824912?project=apache-beam-testing
Worker logs: https://console.cloud.google.com/dataflow/jobsDetail/locations/us-central1/jobs/2020-02-13_10_37_25-11258000866500032163?project=apache-beam-testing
Worker logs: https://console.cloud.google.com/dataflow/jobsDetail/locations/us-central1/jobs/2020-02-13_10_45_46-4099539936678547092?project=apache-beam-testing
Worker logs: https://console.cloud.google.com/dataflow/jobsDetail/locations/us-central1/jobs/2020-02-13_10_55_41-1017730205531484343?project=apache-beam-testing
Worker logs: https://console.cloud.google.com/dataflow/jobsDetail/locations/us-central1/jobs/2020-02-13_11_12_28-4032481881829372574?project=apache-beam-testing
FAILURE: Build failed with an exception.
* Where:
Build file '<https://builds.apache.org/job/beam_PostCommit_Python2/ws/src/sdks/python/test-suites/direct/py2/build.gradle'> line: 50
* What went wrong:
Execution failed for task ':sdks:python:test-suites:direct:py2:directRunnerIT'.
> Process 'command 'sh'' finished with non-zero exit value 1
* Try:
Run with --stacktrace option to get the stack trace. Run with --info or --debug option to get more log output. Run with --scan to get full insights.
* Get more help at https://help.gradle.org
Deprecated Gradle features were used in this build, making it incompatible with Gradle 6.0.
Use '--warning-mode all' to show the individual deprecation warnings.
See https://docs.gradle.org/5.2.1/userguide/command_line_interface.html#sec:command_line_warnings
BUILD FAILED in 57m 59s
124 actionable tasks: 100 executed, 21 from cache, 3 up-to-date
Publishing build scan...
https://gradle.com/s/ipau5b45uqlte
Build step 'Invoke Gradle script' changed build result to FAILURE
Build step 'Invoke Gradle script' marked build as failure
---------------------------------------------------------------------
To unsubscribe, e-mail: builds-unsubscribe@beam.apache.org
For additional commands, e-mail: builds-help@beam.apache.org