You are viewing a plain text version of this content. The canonical link for it is here.
Posted to builds@beam.apache.org by Apache Jenkins Server <je...@builds.apache.org> on 2019/07/14 18:44:53 UTC

Build failed in Jenkins: beam_PostCommit_Py_VR_Dataflow #4016

See <https://builds.apache.org/job/beam_PostCommit_Py_VR_Dataflow/4016/display/redirect>

------------------------------------------
[...truncated 168.85 KB...]
test_as_list_twice (apache_beam.transforms.sideinputs_test.SideInputsTest) ... ok
test_flattened_side_input (apache_beam.transforms.sideinputs_test.SideInputsTest) ... ok
test_empty_singleton_side_input (apache_beam.transforms.sideinputs_test.SideInputsTest) ... ok
test_as_singleton_without_unique_labels (apache_beam.transforms.sideinputs_test.SideInputsTest) ... ok
test_iterable_side_input (apache_beam.transforms.sideinputs_test.SideInputsTest) ... ok

----------------------------------------------------------------------
XML: <https://builds.apache.org/job/beam_PostCommit_Py_VR_Dataflow/ws/src/sdks/python/nosetests.xml>
----------------------------------------------------------------------
Ran 15 tests in 1251.394s

OK

> Task :sdks:python:validatesRunnerBatchTests
test_multi_valued_singleton_side_input (apache_beam.transforms.sideinputs_test.SideInputsTest) ... ok

----------------------------------------------------------------------
XML: <https://builds.apache.org/job/beam_PostCommit_Py_VR_Dataflow/ws/src/sdks/python/nosetests.xml>
----------------------------------------------------------------------
Ran 17 tests in 1437.803s

OK
Found: https://console.cloud.google.com/dataflow/jobsDetail/locations/us-central1/jobs/2019-07-14_11_01_44-5967736882281595451?project=apache-beam-testing.
Found: https://console.cloud.google.com/dataflow/jobsDetail/locations/us-central1/jobs/2019-07-14_11_09_37-10267750722451558455?project=apache-beam-testing.
Found: https://console.cloud.google.com/dataflow/jobsDetail/locations/us-central1/jobs/2019-07-14_11_17_27-3737871119077979934?project=apache-beam-testing.
Found: https://console.cloud.google.com/dataflow/jobsDetail/locations/us-central1/jobs/2019-07-14_11_01_41-4654557609694283584?project=apache-beam-testing.
Found: https://console.cloud.google.com/dataflow/jobsDetail/locations/us-central1/jobs/2019-07-14_11_09_25-8816106533854883240?project=apache-beam-testing.
Found: https://console.cloud.google.com/dataflow/jobsDetail/locations/us-central1/jobs/2019-07-14_11_01_44-4414984365188510678?project=apache-beam-testing.
Found: https://console.cloud.google.com/dataflow/jobsDetail/locations/us-central1/jobs/2019-07-14_11_10_54-482501708004727705?project=apache-beam-testing.
Found: https://console.cloud.google.com/dataflow/jobsDetail/locations/us-central1/jobs/2019-07-14_11_01_44-17106270266416483337?project=apache-beam-testing.
Found: https://console.cloud.google.com/dataflow/jobsDetail/locations/us-central1/jobs/2019-07-14_11_10_25-8755086499338010606?project=apache-beam-testing.
Found: https://console.cloud.google.com/dataflow/jobsDetail/locations/us-central1/jobs/2019-07-14_11_01_45-4535075807130556504?project=apache-beam-testing.
Found: https://console.cloud.google.com/dataflow/jobsDetail/locations/us-central1/jobs/2019-07-14_11_11_20-17054852866380602910?project=apache-beam-testing.
Found: https://console.cloud.google.com/dataflow/jobsDetail/locations/us-central1/jobs/2019-07-14_11_01_44-1058164354369795146?project=apache-beam-testing.
Found: https://console.cloud.google.com/dataflow/jobsDetail/locations/us-central1/jobs/2019-07-14_11_10_49-5202455928367538991?project=apache-beam-testing.
Found: https://console.cloud.google.com/dataflow/jobsDetail/locations/us-central1/jobs/2019-07-14_11_01_43-4843830802348168398?project=apache-beam-testing.
Found: https://console.cloud.google.com/dataflow/jobsDetail/locations/us-central1/jobs/2019-07-14_11_09_35-4953848615549576317?project=apache-beam-testing.
Found: https://console.cloud.google.com/dataflow/jobsDetail/locations/us-central1/jobs/2019-07-14_11_01_45-4741810461367833883?project=apache-beam-testing.
Found: https://console.cloud.google.com/dataflow/jobsDetail/locations/us-central1/jobs/2019-07-14_11_11_35-5013959156569098928?project=apache-beam-testing.

> Task :sdks:python:validatesRunnerStreamingTests
>>> RUNNING integration tests with pipeline options: --runner=TestDataflowRunner --project=apache-beam-testing --staging_location=gs://temp-storage-for-end-to-end-tests/staging-it --temp_location=gs://temp-storage-for-end-to-end-tests/temp-it --output=gs://temp-storage-for-end-to-end-tests/py-it-cloud/output --sdk_location=build/apache-beam.tar.gz --requirements_file=postcommit_requirements.txt --num_workers=1 --sleep_secs=20 --streaming --dataflow_worker_jar=<https://builds.apache.org/job/beam_PostCommit_Py_VR_Dataflow/ws/src/runners/google-cloud-dataflow-java/worker/build/libs/beam-runners-google-cloud-dataflow-java-fn-api-worker-2.15.0-SNAPSHOT.jar> --kms_key_name=projects/apache-beam-testing/locations/global/keyRings/beam-it/cryptoKeys/test --dataflow_kms_key=projects/apache-beam-testing/locations/global/keyRings/beam-it/cryptoKeys/test
>>>   test options: --nocapture --processes=8 --process-timeout=4500 --attr=ValidatesRunner,!sickbay-streaming
<https://builds.apache.org/job/beam_PostCommit_Py_VR_Dataflow/ws/src/build/gradleenv/1922375555/local/lib/python2.7/site-packages/setuptools/dist.py>:472: UserWarning: Normalizing '2.15.0.dev' to '2.15.0.dev0'
  normalized_version,
running nosetests
running egg_info
writing requirements to apache_beam.egg-info/requires.txt
writing apache_beam.egg-info/PKG-INFO
writing top-level names to apache_beam.egg-info/top_level.txt
writing dependency_links to apache_beam.egg-info/dependency_links.txt
writing entry points to apache_beam.egg-info/entry_points.txt
reading manifest file 'apache_beam.egg-info/SOURCES.txt'
reading manifest template 'MANIFEST.in'
warning: no files found matching 'README.md'
warning: no files found matching 'NOTICE'
warning: no files found matching 'LICENSE'
writing manifest file 'apache_beam.egg-info/SOURCES.txt'

> Task :sdks:python:test-suites:dataflow:py37:validatesRunnerBatchTests
Found: https://console.cloud.google.com/dataflow/jobsDetail/locations/us-central1/jobs/2019-07-14_11_01_44-3909336011984527211?project=apache-beam-testing.
Found: https://console.cloud.google.com/dataflow/jobsDetail/locations/us-central1/jobs/2019-07-14_11_10_25-15235697577764260553?project=apache-beam-testing.
Found: https://console.cloud.google.com/dataflow/jobsDetail/locations/us-central1/jobs/2019-07-14_11_01_47-15898948121559635303?project=apache-beam-testing.
Found: https://console.cloud.google.com/dataflow/jobsDetail/locations/us-central1/jobs/2019-07-14_11_11_37-1753401593279288502?project=apache-beam-testing.
Found: https://console.cloud.google.com/dataflow/jobsDetail/locations/us-central1/jobs/2019-07-14_11_01_46-9022030056617863545?project=apache-beam-testing.
Found: https://console.cloud.google.com/dataflow/jobsDetail/locations/us-central1/jobs/2019-07-14_11_10_56-773949139517334754?project=apache-beam-testing.
Found: https://console.cloud.google.com/dataflow/jobsDetail/locations/us-central1/jobs/2019-07-14_11_01_46-6370872155021718120?project=apache-beam-testing.
Found: https://console.cloud.google.com/dataflow/jobsDetail/locations/us-central1/jobs/2019-07-14_11_12_17-14878454681110321231?project=apache-beam-testing.
Found: https://console.cloud.google.com/dataflow/jobsDetail/locations/us-central1/jobs/2019-07-14_11_01_47-7138821433709262899?project=apache-beam-testing.
Found: https://console.cloud.google.com/dataflow/jobsDetail/locations/us-central1/jobs/2019-07-14_11_12_17-14340337125886619057?project=apache-beam-testing.
Found: https://console.cloud.google.com/dataflow/jobsDetail/locations/us-central1/jobs/2019-07-14_11_01_46-9822277834332639107?project=apache-beam-testing.
Found: https://console.cloud.google.com/dataflow/jobsDetail/locations/us-central1/jobs/2019-07-14_11_10_27-16298557901730006061?project=apache-beam-testing.
Found: https://console.cloud.google.com/dataflow/jobsDetail/locations/us-central1/jobs/2019-07-14_11_18_37-16487677545658111841?project=apache-beam-testing.
Found: https://console.cloud.google.com/dataflow/jobsDetail/locations/us-central1/jobs/2019-07-14_11_01_47-9649612868247810906?project=apache-beam-testing.
Found: https://console.cloud.google.com/dataflow/jobsDetail/locations/us-central1/jobs/2019-07-14_11_12_13-2651394237962181976?project=apache-beam-testing.
Found: https://console.cloud.google.com/dataflow/jobsDetail/locations/us-central1/jobs/2019-07-14_11_01_47-16748981425204265899?project=apache-beam-testing.
Found: https://console.cloud.google.com/dataflow/jobsDetail/locations/us-central1/jobs/2019-07-14_11_11_52-15448568084009851067?project=apache-beam-testing.
test_dofn_lifecycle (apache_beam.transforms.dofn_lifecycle_test.DoFnLifecycleTest) ... ok
test_read_metrics (apache_beam.transforms.ptransform_test.PTransformTest) ... ok
test_multiple_empty_outputs (apache_beam.transforms.ptransform_test.PTransformTest) ... ok
test_flatten_multiple_pcollections_having_multiple_consumers (apache_beam.transforms.ptransform_test.PTransformTest) ... ok
test_as_dict_twice (apache_beam.transforms.sideinputs_test.SideInputsTest) ... ok
test_undeclared_outputs (apache_beam.transforms.ptransform_test.PTransformTest) ... ok
test_par_do_with_multiple_outputs_and_using_return (apache_beam.transforms.ptransform_test.PTransformTest) ... ok
test_par_do_with_multiple_outputs_and_using_yield (apache_beam.transforms.ptransform_test.PTransformTest) ... ok
test_as_list_twice (apache_beam.transforms.sideinputs_test.SideInputsTest) ... ok
test_as_list_and_as_dict_side_inputs (apache_beam.transforms.sideinputs_test.SideInputsTest) ... ok
test_as_singleton_without_unique_labels (apache_beam.transforms.sideinputs_test.SideInputsTest) ... ok
test_default_value_singleton_side_input (apache_beam.transforms.sideinputs_test.SideInputsTest) ... ok
test_as_singleton_with_different_defaults (apache_beam.transforms.sideinputs_test.SideInputsTest) ... ok
test_empty_singleton_side_input (apache_beam.transforms.sideinputs_test.SideInputsTest) ... ok
test_flattened_side_input (apache_beam.transforms.sideinputs_test.SideInputsTest) ... ok
test_iterable_side_input (apache_beam.transforms.sideinputs_test.SideInputsTest) ... ok
test_multi_valued_singleton_side_input (apache_beam.transforms.sideinputs_test.SideInputsTest) ... ok

----------------------------------------------------------------------
XML: <https://builds.apache.org/job/beam_PostCommit_Py_VR_Dataflow/ws/src/sdks/python/nosetests.xml>
----------------------------------------------------------------------
Ran 17 tests in 1523.219s

OK

> Task :sdks:python:test-suites:dataflow:py37:validatesRunnerStreamingTests
>>> RUNNING integration tests with pipeline options: --runner=TestDataflowRunner --project=apache-beam-testing --staging_location=gs://temp-storage-for-end-to-end-tests/staging-it --temp_location=gs://temp-storage-for-end-to-end-tests/temp-it --output=gs://temp-storage-for-end-to-end-tests/py-it-cloud/output --sdk_location=<https://builds.apache.org/job/beam_PostCommit_Py_VR_Dataflow/ws/src/sdks/python/test-suites/dataflow/py37/build/apache-beam.tar.gz> --requirements_file=postcommit_requirements.txt --num_workers=1 --sleep_secs=20 --streaming --dataflow_worker_jar=<https://builds.apache.org/job/beam_PostCommit_Py_VR_Dataflow/ws/src/runners/google-cloud-dataflow-java/worker/build/libs/beam-runners-google-cloud-dataflow-java-fn-api-worker-2.15.0-SNAPSHOT.jar> --kms_key_name=projects/apache-beam-testing/locations/global/keyRings/beam-it/cryptoKeys/test --dataflow_kms_key=projects/apache-beam-testing/locations/global/keyRings/beam-it/cryptoKeys/test
>>>   test options: --nocapture --processes=8 --process-timeout=4500 --attr=ValidatesRunner,!sickbay-streaming
running nosetests
running egg_info
writing apache_beam.egg-info/PKG-INFO
writing dependency_links to apache_beam.egg-info/dependency_links.txt
writing entry points to apache_beam.egg-info/entry_points.txt
writing requirements to apache_beam.egg-info/requires.txt
writing top-level names to apache_beam.egg-info/top_level.txt
reading manifest file 'apache_beam.egg-info/SOURCES.txt'
reading manifest template 'MANIFEST.in'
setup.py:177: UserWarning: Some syntactic constructs of Python 3 are not yet fully supported by Apache Beam.
  'Some syntactic constructs of Python 3 are not yet fully supported by '
<https://builds.apache.org/job/beam_PostCommit_Py_VR_Dataflow/ws/src/build/gradleenv/-1734967052/lib/python3.7/site-packages/setuptools/dist.py>:472: UserWarning: Normalizing '2.15.0.dev' to '2.15.0.dev0'
  normalized_version,
warning: no files found matching 'README.md'
warning: no files found matching 'NOTICE'
warning: no files found matching 'LICENSE'
writing manifest file 'apache_beam.egg-info/SOURCES.txt'
<https://builds.apache.org/job/beam_PostCommit_Py_VR_Dataflow/ws/src/sdks/python/apache_beam/__init__.py>:84: UserWarning: Some syntactic constructs of Python 3 are not yet fully supported by Apache Beam.
  'Some syntactic constructs of Python 3 are not yet fully supported by '
<https://builds.apache.org/job/beam_PostCommit_Py_VR_Dataflow/ws/src/sdks/python/apache_beam/io/gcp/datastore/v1/datastoreio.py>:59: UserWarning: Datastore IO will support Python 3 after replacing googledatastore by google-cloud-datastore, see: BEAM-4543.
  warnings.warn('Datastore IO will support Python 3 after replacing '
<https://builds.apache.org/job/beam_PostCommit_Py_VR_Dataflow/ws/src/sdks/python/apache_beam/io/vcfio.py>:47: UserWarning: VCF IO will support Python 3 after migration to Nucleus, see: BEAM-5628.
  warnings.warn("VCF IO will support Python 3 after migration to Nucleus, "

> Task :sdks:python:validatesRunnerStreamingTests
test_par_do_with_multiple_outputs_and_using_yield (apache_beam.transforms.ptransform_test.PTransformTest) ... ok
test_dofn_lifecycle (apache_beam.transforms.dofn_lifecycle_test.DoFnLifecycleTest) ... ok
test_par_do_with_multiple_outputs_and_using_return (apache_beam.transforms.ptransform_test.PTransformTest) ... ok
test_flatten_multiple_pcollections_having_multiple_consumers (apache_beam.transforms.ptransform_test.PTransformTest) ... ok
test_as_dict_twice (apache_beam.transforms.sideinputs_test.SideInputsTest) ... ok
test_multiple_empty_outputs (apache_beam.transforms.ptransform_test.PTransformTest) ... ok
test_undeclared_outputs (apache_beam.transforms.ptransform_test.PTransformTest) ... ok
test_as_list_and_as_dict_side_inputs (apache_beam.transforms.sideinputs_test.SideInputsTest) ... ok
test_as_singleton_with_different_defaults (apache_beam.transforms.sideinputs_test.SideInputsTest) ... ok
test_as_list_twice (apache_beam.transforms.sideinputs_test.SideInputsTest) ... ok
test_iterable_side_input (apache_beam.transforms.sideinputs_test.SideInputsTest) ... ok
test_as_singleton_without_unique_labels (apache_beam.transforms.sideinputs_test.SideInputsTest) ... ok
test_flattened_side_input (apache_beam.transforms.sideinputs_test.SideInputsTest) ... ok
test_empty_singleton_side_input (apache_beam.transforms.sideinputs_test.SideInputsTest) ... ok
test_default_value_singleton_side_input (apache_beam.transforms.sideinputs_test.SideInputsTest) ... ok

----------------------------------------------------------------------
XML: <https://builds.apache.org/job/beam_PostCommit_Py_VR_Dataflow/ws/src/sdks/python/nosetests.xml>
----------------------------------------------------------------------
Ran 15 tests in 1083.792s

OK
Found: https://console.cloud.google.com/dataflow/jobsDetail/locations/us-central1/jobs/2019-07-14_11_25_32-8977143012385598573?project=apache-beam-testing.
Found: https://console.cloud.google.com/dataflow/jobsDetail/locations/us-central1/jobs/2019-07-14_11_33_52-9499531754808388352?project=apache-beam-testing.
Found: https://console.cloud.google.com/dataflow/jobsDetail/locations/us-central1/jobs/2019-07-14_11_25_32-18071875761193813077?project=apache-beam-testing.
Found: https://console.cloud.google.com/dataflow/jobsDetail/locations/us-central1/jobs/2019-07-14_11_33_56-74308436671883398?project=apache-beam-testing.
Found: https://console.cloud.google.com/dataflow/jobsDetail/locations/us-central1/jobs/2019-07-14_11_25_33-3593705661373774910?project=apache-beam-testing.
Found: https://console.cloud.google.com/dataflow/jobsDetail/locations/us-central1/jobs/2019-07-14_11_34_23-10699401138320024981?project=apache-beam-testing.
Found: https://console.cloud.google.com/dataflow/jobsDetail/locations/us-central1/jobs/2019-07-14_11_25_31-7575048882475626849?project=apache-beam-testing.
Found: https://console.cloud.google.com/dataflow/jobsDetail/locations/us-central1/jobs/2019-07-14_11_33_20-17394796303041082413?project=apache-beam-testing.
Found: https://console.cloud.google.com/dataflow/jobsDetail/locations/us-central1/jobs/2019-07-14_11_25_31-15805621091783937016?project=apache-beam-testing.
Found: https://console.cloud.google.com/dataflow/jobsDetail/locations/us-central1/jobs/2019-07-14_11_34_21-18269004138135019507?project=apache-beam-testing.
Found: https://console.cloud.google.com/dataflow/jobsDetail/locations/us-central1/jobs/2019-07-14_11_25_32-4586602703895383479?project=apache-beam-testing.
Found: https://console.cloud.google.com/dataflow/jobsDetail/locations/us-central1/jobs/2019-07-14_11_33_02-17142567756803792967?project=apache-beam-testing.
Found: https://console.cloud.google.com/dataflow/jobsDetail/locations/us-central1/jobs/2019-07-14_11_25_31-2443900197849179368?project=apache-beam-testing.
Found: https://console.cloud.google.com/dataflow/jobsDetail/locations/us-central1/jobs/2019-07-14_11_34_16-6070929247814646000?project=apache-beam-testing.
Found: https://console.cloud.google.com/dataflow/jobsDetail/locations/us-central1/jobs/2019-07-14_11_25_31-17466517757830609684?project=apache-beam-testing.

> Task :sdks:python:test-suites:dataflow:py37:validatesRunnerStreamingTests
Found: https://console.cloud.google.com/dataflow/jobsDetail/locations/us-central1/jobs/2019-07-14_11_26_57-6008649885706254454?project=apache-beam-testing.
Found: https://console.cloud.google.com/dataflow/jobsDetail/locations/us-central1/jobs/2019-07-14_11_35_22-5302604178128927495?project=apache-beam-testing.
Found: https://console.cloud.google.com/dataflow/jobsDetail/locations/us-central1/jobs/2019-07-14_11_26_57-16636956039879727710?project=apache-beam-testing.
Found: https://console.cloud.google.com/dataflow/jobsDetail/locations/us-central1/jobs/2019-07-14_11_36_18-1457115341138597819?project=apache-beam-testing.
Found: https://console.cloud.google.com/dataflow/jobsDetail/locations/us-central1/jobs/2019-07-14_11_26_57-14520079787757791824?project=apache-beam-testing.
Found: https://console.cloud.google.com/dataflow/jobsDetail/locations/us-central1/jobs/2019-07-14_11_35_23-16723904373854028539?project=apache-beam-testing.
Found: https://console.cloud.google.com/dataflow/jobsDetail/locations/us-central1/jobs/2019-07-14_11_26_57-4381654967926354126?project=apache-beam-testing.
Found: https://console.cloud.google.com/dataflow/jobsDetail/locations/us-central1/jobs/2019-07-14_11_36_22-10357275086958858614?project=apache-beam-testing.
Found: https://console.cloud.google.com/dataflow/jobsDetail/locations/us-central1/jobs/2019-07-14_11_26_58-210934723292092159?project=apache-beam-testing.
Found: https://console.cloud.google.com/dataflow/jobsDetail/locations/us-central1/jobs/2019-07-14_11_35_48-8156520640590357619?project=apache-beam-testing.
Found: https://console.cloud.google.com/dataflow/jobsDetail/locations/us-central1/jobs/2019-07-14_11_26_57-11108256328779554204?project=apache-beam-testing.
Found: https://console.cloud.google.com/dataflow/jobsDetail/locations/us-central1/jobs/2019-07-14_11_35_22-4078814917418459843?project=apache-beam-testing.
Found: https://console.cloud.google.com/dataflow/jobsDetail/locations/us-central1/jobs/2019-07-14_11_26_57-13199943135648465751?project=apache-beam-testing.
Found: https://console.cloud.google.com/dataflow/jobsDetail/locations/us-central1/jobs/2019-07-14_11_26_57-2644546077946211537?project=apache-beam-testing.
Found: https://console.cloud.google.com/dataflow/jobsDetail/locations/us-central1/jobs/2019-07-14_11_35_17-6276097934287182809?project=apache-beam-testing.
test_as_list_and_as_dict_side_inputs (apache_beam.transforms.sideinputs_test.SideInputsTest) ... ok
test_undeclared_outputs (apache_beam.transforms.ptransform_test.PTransformTest) ... ok
test_dofn_lifecycle (apache_beam.transforms.dofn_lifecycle_test.DoFnLifecycleTest) ... ok
test_multiple_empty_outputs (apache_beam.transforms.ptransform_test.PTransformTest) ... ok
test_par_do_with_multiple_outputs_and_using_yield (apache_beam.transforms.ptransform_test.PTransformTest) ... ok
test_flatten_multiple_pcollections_having_multiple_consumers (apache_beam.transforms.ptransform_test.PTransformTest) ... ok
test_par_do_with_multiple_outputs_and_using_return (apache_beam.transforms.ptransform_test.PTransformTest) ... ok
test_as_dict_twice (apache_beam.transforms.sideinputs_test.SideInputsTest) ... ok
test_as_list_twice (apache_beam.transforms.sideinputs_test.SideInputsTest) ... ok
test_empty_singleton_side_input (apache_beam.transforms.sideinputs_test.SideInputsTest) ... ok
test_default_value_singleton_side_input (apache_beam.transforms.sideinputs_test.SideInputsTest) ... ok
test_as_singleton_without_unique_labels (apache_beam.transforms.sideinputs_test.SideInputsTest) ... ok
test_as_singleton_with_different_defaults (apache_beam.transforms.sideinputs_test.SideInputsTest) ... ok
test_flattened_side_input (apache_beam.transforms.sideinputs_test.SideInputsTest) ... ok
test_iterable_side_input (apache_beam.transforms.sideinputs_test.SideInputsTest) ... ok

----------------------------------------------------------------------
XML: <https://builds.apache.org/job/beam_PostCommit_Py_VR_Dataflow/ws/src/sdks/python/nosetests.xml>
----------------------------------------------------------------------
Ran 15 tests in 1083.909s

OK

FAILURE: Build completed with 2 failures.

1: Task failed with an exception.
-----------
* Where:
Build file '<https://builds.apache.org/job/beam_PostCommit_Py_VR_Dataflow/ws/src/sdks/python/test-suites/dataflow/py36/build.gradle'> line: 67

* What went wrong:
Execution failed for task ':sdks:python:test-suites:dataflow:py36:validatesRunnerBatchTests'.
> Process 'command 'sh'' finished with non-zero exit value 1

* Try:
Run with --stacktrace option to get the stack trace. Run with --info or --debug option to get more log output. Run with --scan to get full insights.
==============================================================================

2: Task failed with an exception.
-----------
* Where:
Build file '<https://builds.apache.org/job/beam_PostCommit_Py_VR_Dataflow/ws/src/sdks/python/test-suites/dataflow/py35/build.gradle'> line: 67

* What went wrong:
Execution failed for task ':sdks:python:test-suites:dataflow:py35:validatesRunnerBatchTests'.
> Process 'command 'sh'' finished with non-zero exit value 1

* Try:
Run with --stacktrace option to get the stack trace. Run with --info or --debug option to get more log output. Run with --scan to get full insights.
==============================================================================

* Get more help at https://help.gradle.org

Deprecated Gradle features were used in this build, making it incompatible with Gradle 6.0.
Use '--warning-mode all' to show the individual deprecation warnings.
See https://docs.gradle.org/5.2.1/userguide/command_line_interface.html#sec:command_line_warnings

BUILD FAILED in 44m 40s
76 actionable tasks: 59 executed, 17 from cache

Publishing build scan...
https://gradle.com/s/3hofhgv523uie

Build step 'Invoke Gradle script' changed build result to FAILURE
Build step 'Invoke Gradle script' marked build as failure

---------------------------------------------------------------------
To unsubscribe, e-mail: builds-unsubscribe@beam.apache.org
For additional commands, e-mail: builds-help@beam.apache.org


Jenkins build is back to normal : beam_PostCommit_Py_VR_Dataflow #4022

Posted by Apache Jenkins Server <je...@builds.apache.org>.
See <https://builds.apache.org/job/beam_PostCommit_Py_VR_Dataflow/4022/display/redirect?page=changes>


---------------------------------------------------------------------
To unsubscribe, e-mail: builds-unsubscribe@beam.apache.org
For additional commands, e-mail: builds-help@beam.apache.org


Build failed in Jenkins: beam_PostCommit_Py_VR_Dataflow #4021

Posted by Apache Jenkins Server <je...@builds.apache.org>.
See <https://builds.apache.org/job/beam_PostCommit_Py_VR_Dataflow/4021/display/redirect?page=changes>

Changes:

[yanzhi.wyl] [BEAM-7694]Fix error spelling in annotation of SparkTransformOverrides.

[yanzhi.wyl] update annotation for PTransformMatcher.

------------------------------------------
[...truncated 240.16 KB...]
root: INFO: 2019-07-15T14:15:14.084Z: JOB_MESSAGE_BASIC: Executing operation assert_that/Group/GroupByKey/Read+assert_that/Group/GroupByKey/GroupByWindow+assert_that/Group/Map(_merge_tagged_vals_under_key)+assert_that/Unkey+assert_that/Match
root: INFO: 2019-07-15T14:15:23.291Z: JOB_MESSAGE_BASIC: Finished operation assert_that/Group/GroupByKey/Read+assert_that/Group/GroupByKey/GroupByWindow+assert_that/Group/Map(_merge_tagged_vals_under_key)+assert_that/Unkey+assert_that/Match
root: INFO: 2019-07-15T14:15:23.399Z: JOB_MESSAGE_DEBUG: Executing success step success19
root: INFO: 2019-07-15T14:15:23.560Z: JOB_MESSAGE_DETAILED: Cleaning up.
root: INFO: 2019-07-15T14:15:23.669Z: JOB_MESSAGE_DEBUG: Starting worker pool teardown.
root: INFO: 2019-07-15T14:15:23.719Z: JOB_MESSAGE_BASIC: Stopping worker pool...
--------------------- >> end captured logging << ---------------------
Found: https://console.cloud.google.com/dataflow/jobsDetail/locations/us-central1/jobs/2019-07-15_07_00_01-14731632406815984645?project=apache-beam-testing.
Found: https://console.cloud.google.com/dataflow/jobsDetail/locations/us-central1/jobs/2019-07-15_07_09_00-17605251573612695355?project=apache-beam-testing.
Found: https://console.cloud.google.com/dataflow/jobsDetail/locations/us-central1/jobs/2019-07-15_07_17_35-17739861072464164524?project=apache-beam-testing.
Found: https://console.cloud.google.com/dataflow/jobsDetail/locations/us-central1/jobs/2019-07-15_07_00_02-12047155067225244574?project=apache-beam-testing.
Found: https://console.cloud.google.com/dataflow/jobsDetail/locations/us-central1/jobs/2019-07-15_07_10_12-16183013042046772683?project=apache-beam-testing.
Found: https://console.cloud.google.com/dataflow/jobsDetail/locations/us-central1/jobs/2019-07-15_07_00_02-7768953938742879805?project=apache-beam-testing.
Exception in thread Thread-2:
Traceback (most recent call last):
  File "/usr/lib/python3.7/threading.py", line 917, in _bootstrap_inner
Found: https://console.cloud.google.com/dataflow/jobsDetail/locations/us-central1/jobs/2019-07-15_07_09_42-1536083215331451852?project=apache-beam-testing.
    self.run()
  File "/usr/lib/python3.7/threading.py", line 865, in run
    self._target(*self._args, **self._kwargs)
  File "<https://builds.apache.org/job/beam_PostCommit_Py_VR_Dataflow/ws/src/sdks/python/apache_beam/runners/dataflow/dataflow_runner.py",> line 190, in poll_for_job_completion
    job_id, page_token=page_token, start_time=last_message_time)
  File "<https://builds.apache.org/job/beam_PostCommit_Py_VR_Dataflow/ws/src/sdks/python/apache_beam/utils/retry.py",> line 197, in wrapper
    return fun(*args, **kwargs)
  File "<https://builds.apache.org/job/beam_PostCommit_Py_VR_Dataflow/ws/src/sdks/python/apache_beam/runners/dataflow/internal/apiclient.py",> line 748, in list_messages
    response = self._client.projects_locations_jobs_messages.List(request)
  File "<https://builds.apache.org/job/beam_PostCommit_Py_VR_Dataflow/ws/src/sdks/python/apache_beam/runners/dataflow/internal/clients/dataflow/dataflow_v1b3_client.py",> line 553, in List
    config, request, global_params=global_params)
  File "<https://builds.apache.org/job/beam_PostCommit_Py_VR_Dataflow/ws/src/build/gradleenv/-1734967052/lib/python3.7/site-packages/apitools/base/py/base_api.py",> line 731, in _RunMethod
    return self.ProcessHttpResponse(method_config, http_response, request)
  File "<https://builds.apache.org/job/beam_PostCommit_Py_VR_Dataflow/ws/src/build/gradleenv/-1734967052/lib/python3.7/site-packages/apitools/base/py/base_api.py",> line 737, in ProcessHttpResponse
    self.__ProcessHttpResponse(method_config, http_response, request))
  File "<https://builds.apache.org/job/beam_PostCommit_Py_VR_Dataflow/ws/src/build/gradleenv/-1734967052/lib/python3.7/site-packages/apitools/base/py/base_api.py",> line 604, in __ProcessHttpResponse
    http_response, method_config=method_config, request=request)
apitools.base.py.exceptions.HttpNotFoundError: HttpError accessing <https://dataflow.googleapis.com/v1b3/projects/apache-beam-testing/locations/us-central1/jobs/2019-07-15_07_09_42-1536083215331451852/messages?alt=json&startTime=2019-07-15T14%3A15%3A23.719Z>: response: <{'vary': 'Origin, X-Origin, Referer', 'content-type': 'application/json; charset=UTF-8', 'date': 'Mon, 15 Jul 2019 14:18:17 GMT', 'server': 'ESF', 'cache-control': 'private', 'x-xss-protection': '0', 'x-frame-options': 'SAMEORIGIN', 'x-content-type-options': 'nosniff', 'transfer-encoding': 'chunked', 'status': '404', 'content-length': '279', '-content-encoding': 'gzip'}>, content <{
  "error": {
    "code": 404,
    "message": "(e83428ac7e73750f): Information about job 2019-07-15_07_09_42-1536083215331451852 could not be found in our system. Please double check the id is correct. If it is please contact customer support.",
    "status": "NOT_FOUND"
  }
}
>

Found: https://console.cloud.google.com/dataflow/jobsDetail/locations/us-central1/jobs/2019-07-15_07_00_02-13925048337263657522?project=apache-beam-testing.
Found: https://console.cloud.google.com/dataflow/jobsDetail/locations/us-central1/jobs/2019-07-15_07_09_37-9695109633033315026?project=apache-beam-testing.
Found: https://console.cloud.google.com/dataflow/jobsDetail/locations/us-central1/jobs/2019-07-15_07_00_02-3389741047241954930?project=apache-beam-testing.
Found: https://console.cloud.google.com/dataflow/jobsDetail/locations/us-central1/jobs/2019-07-15_07_10_22-3918428860415901500?project=apache-beam-testing.
Found: https://console.cloud.google.com/dataflow/jobsDetail/locations/us-central1/jobs/2019-07-15_07_00_01-8412325824341245780?project=apache-beam-testing.
Found: https://console.cloud.google.com/dataflow/jobsDetail/locations/us-central1/jobs/2019-07-15_07_09_01-8507743024538275491?project=apache-beam-testing.
Found: https://console.cloud.google.com/dataflow/jobsDetail/locations/us-central1/jobs/2019-07-15_07_00_02-12777763744785919874?project=apache-beam-testing.
Found: https://console.cloud.google.com/dataflow/jobsDetail/locations/us-central1/jobs/2019-07-15_07_09_12-2710387403623692077?project=apache-beam-testing.
Found: https://console.cloud.google.com/dataflow/jobsDetail/locations/us-central1/jobs/2019-07-15_07_00_02-8260141334835562744?project=apache-beam-testing.
Found: https://console.cloud.google.com/dataflow/jobsDetail/locations/us-central1/jobs/2019-07-15_07_10_07-9693772427300170565?project=apache-beam-testing.

----------------------------------------------------------------------
XML: <https://builds.apache.org/job/beam_PostCommit_Py_VR_Dataflow/ws/src/sdks/python/nosetests.xml>
----------------------------------------------------------------------
Ran 17 tests in 1659.698s

FAILED (failures=1)

> Task :sdks:python:test-suites:dataflow:py37:validatesRunnerBatchTests FAILED

> Task :sdks:python:test-suites:dataflow:py37:validatesRunnerStreamingTests
>>> RUNNING integration tests with pipeline options: --runner=TestDataflowRunner --project=apache-beam-testing --staging_location=gs://temp-storage-for-end-to-end-tests/staging-it --temp_location=gs://temp-storage-for-end-to-end-tests/temp-it --output=gs://temp-storage-for-end-to-end-tests/py-it-cloud/output --sdk_location=<https://builds.apache.org/job/beam_PostCommit_Py_VR_Dataflow/ws/src/sdks/python/test-suites/dataflow/py37/build/apache-beam.tar.gz> --requirements_file=postcommit_requirements.txt --num_workers=1 --sleep_secs=20 --streaming --dataflow_worker_jar=<https://builds.apache.org/job/beam_PostCommit_Py_VR_Dataflow/ws/src/runners/google-cloud-dataflow-java/worker/build/libs/beam-runners-google-cloud-dataflow-java-fn-api-worker-2.15.0-SNAPSHOT.jar> --kms_key_name=projects/apache-beam-testing/locations/global/keyRings/beam-it/cryptoKeys/test --dataflow_kms_key=projects/apache-beam-testing/locations/global/keyRings/beam-it/cryptoKeys/test
>>>   test options: --nocapture --processes=8 --process-timeout=4500 --attr=ValidatesRunner,!sickbay-streaming
running nosetests
running egg_info
writing apache_beam.egg-info/PKG-INFO
writing dependency_links to apache_beam.egg-info/dependency_links.txt
writing entry points to apache_beam.egg-info/entry_points.txt
writing requirements to apache_beam.egg-info/requires.txt
writing top-level names to apache_beam.egg-info/top_level.txt
reading manifest file 'apache_beam.egg-info/SOURCES.txt'
reading manifest template 'MANIFEST.in'
setup.py:177: UserWarning: Some syntactic constructs of Python 3 are not yet fully supported by Apache Beam.
  'Some syntactic constructs of Python 3 are not yet fully supported by '
<https://builds.apache.org/job/beam_PostCommit_Py_VR_Dataflow/ws/src/build/gradleenv/-1734967052/lib/python3.7/site-packages/setuptools/dist.py>:472: UserWarning: Normalizing '2.15.0.dev' to '2.15.0.dev0'
  normalized_version,
warning: no files found matching 'README.md'
warning: no files found matching 'NOTICE'
warning: no files found matching 'LICENSE'
writing manifest file 'apache_beam.egg-info/SOURCES.txt'
<https://builds.apache.org/job/beam_PostCommit_Py_VR_Dataflow/ws/src/sdks/python/apache_beam/__init__.py>:84: UserWarning: Some syntactic constructs of Python 3 are not yet fully supported by Apache Beam.
  'Some syntactic constructs of Python 3 are not yet fully supported by '
<https://builds.apache.org/job/beam_PostCommit_Py_VR_Dataflow/ws/src/sdks/python/apache_beam/io/gcp/datastore/v1/datastoreio.py>:59: UserWarning: Datastore IO will support Python 3 after replacing googledatastore by google-cloud-datastore, see: BEAM-4543.
  warnings.warn('Datastore IO will support Python 3 after replacing '
<https://builds.apache.org/job/beam_PostCommit_Py_VR_Dataflow/ws/src/sdks/python/apache_beam/io/vcfio.py>:47: UserWarning: VCF IO will support Python 3 after migration to Nucleus, see: BEAM-5628.
  warnings.warn("VCF IO will support Python 3 after migration to Nucleus, "

> Task :sdks:python:validatesRunnerStreamingTests
test_multiple_empty_outputs (apache_beam.transforms.ptransform_test.PTransformTest) ... ok
test_dofn_lifecycle (apache_beam.transforms.dofn_lifecycle_test.DoFnLifecycleTest) ... ok
test_as_dict_twice (apache_beam.transforms.sideinputs_test.SideInputsTest) ... ok
test_undeclared_outputs (apache_beam.transforms.ptransform_test.PTransformTest) ... ok
test_flatten_multiple_pcollections_having_multiple_consumers (apache_beam.transforms.ptransform_test.PTransformTest) ... ok
test_as_list_and_as_dict_side_inputs (apache_beam.transforms.sideinputs_test.SideInputsTest) ... ok
test_par_do_with_multiple_outputs_and_using_yield (apache_beam.transforms.ptransform_test.PTransformTest) ... ok
test_par_do_with_multiple_outputs_and_using_return (apache_beam.transforms.ptransform_test.PTransformTest) ... ok
test_as_list_twice (apache_beam.transforms.sideinputs_test.SideInputsTest) ... ok
test_default_value_singleton_side_input (apache_beam.transforms.sideinputs_test.SideInputsTest) ... ok
test_flattened_side_input (apache_beam.transforms.sideinputs_test.SideInputsTest) ... ok
test_as_singleton_with_different_defaults (apache_beam.transforms.sideinputs_test.SideInputsTest) ... ok
test_empty_singleton_side_input (apache_beam.transforms.sideinputs_test.SideInputsTest) ... ok
test_as_singleton_without_unique_labels (apache_beam.transforms.sideinputs_test.SideInputsTest) ... ok
test_iterable_side_input (apache_beam.transforms.sideinputs_test.SideInputsTest) ... ok

----------------------------------------------------------------------
XML: <https://builds.apache.org/job/beam_PostCommit_Py_VR_Dataflow/ws/src/sdks/python/nosetests.xml>
----------------------------------------------------------------------
Ran 15 tests in 1119.991s

OK
Found: https://console.cloud.google.com/dataflow/jobsDetail/locations/us-central1/jobs/2019-07-15_07_24_20-18134008342698207653?project=apache-beam-testing.
Found: https://console.cloud.google.com/dataflow/jobsDetail/locations/us-central1/jobs/2019-07-15_07_32_57-9687496810372708076?project=apache-beam-testing.
Found: https://console.cloud.google.com/dataflow/jobsDetail/locations/us-central1/jobs/2019-07-15_07_24_21-12652275886791494858?project=apache-beam-testing.
Found: https://console.cloud.google.com/dataflow/jobsDetail/locations/us-central1/jobs/2019-07-15_07_33_26-12769408219420677136?project=apache-beam-testing.
Found: https://console.cloud.google.com/dataflow/jobsDetail/locations/us-central1/jobs/2019-07-15_07_24_14-9966815595798686583?project=apache-beam-testing.
Found: https://console.cloud.google.com/dataflow/jobsDetail/locations/us-central1/jobs/2019-07-15_07_32_55-14929322916754453008?project=apache-beam-testing.
Found: https://console.cloud.google.com/dataflow/jobsDetail/locations/us-central1/jobs/2019-07-15_07_24_20-9679010634284903874?project=apache-beam-testing.
Found: https://console.cloud.google.com/dataflow/jobsDetail/locations/us-central1/jobs/2019-07-15_07_32_56-16788849155403454038?project=apache-beam-testing.
Found: https://console.cloud.google.com/dataflow/jobsDetail/locations/us-central1/jobs/2019-07-15_07_24_20-12450015877101903511?project=apache-beam-testing.
Found: https://console.cloud.google.com/dataflow/jobsDetail/locations/us-central1/jobs/2019-07-15_07_32_57-1655528681863021976?project=apache-beam-testing.
Found: https://console.cloud.google.com/dataflow/jobsDetail/locations/us-central1/jobs/2019-07-15_07_24_18-10024277024804965442?project=apache-beam-testing.
Found: https://console.cloud.google.com/dataflow/jobsDetail/locations/us-central1/jobs/2019-07-15_07_32_25-15525257826850845685?project=apache-beam-testing.
Found: https://console.cloud.google.com/dataflow/jobsDetail/locations/us-central1/jobs/2019-07-15_07_24_21-11413472719791307056?project=apache-beam-testing.
Found: https://console.cloud.google.com/dataflow/jobsDetail/locations/us-central1/jobs/2019-07-15_07_24_20-10703847797313524570?project=apache-beam-testing.
Found: https://console.cloud.google.com/dataflow/jobsDetail/locations/us-central1/jobs/2019-07-15_07_33_01-967972461550235547?project=apache-beam-testing.

> Task :sdks:python:test-suites:dataflow:py37:validatesRunnerStreamingTests
Found: https://console.cloud.google.com/dataflow/jobsDetail/locations/us-central1/jobs/2019-07-15_07_28_15-8314512363550667847?project=apache-beam-testing.
Found: https://console.cloud.google.com/dataflow/jobsDetail/locations/us-central1/jobs/2019-07-15_07_38_11-2731749782328778674?project=apache-beam-testing.
Found: https://console.cloud.google.com/dataflow/jobsDetail/locations/us-central1/jobs/2019-07-15_07_28_22-13315009330493848559?project=apache-beam-testing.
Found: https://console.cloud.google.com/dataflow/jobsDetail/locations/us-central1/jobs/2019-07-15_07_37_23-6555172226548856711?project=apache-beam-testing.
Found: https://console.cloud.google.com/dataflow/jobsDetail/locations/us-central1/jobs/2019-07-15_07_28_20-17000721864287198711?project=apache-beam-testing.
Found: https://console.cloud.google.com/dataflow/jobsDetail/locations/us-central1/jobs/2019-07-15_07_37_30-11308508617119470856?project=apache-beam-testing.
Found: https://console.cloud.google.com/dataflow/jobsDetail/locations/us-central1/jobs/2019-07-15_07_28_24-16931533877621932530?project=apache-beam-testing.
Found: https://console.cloud.google.com/dataflow/jobsDetail/locations/us-central1/jobs/2019-07-15_07_37_43-4760528397498969079?project=apache-beam-testing.
Found: https://console.cloud.google.com/dataflow/jobsDetail/locations/us-central1/jobs/2019-07-15_07_28_23-17762376454944064997?project=apache-beam-testing.
Found: https://console.cloud.google.com/dataflow/jobsDetail/locations/us-central1/jobs/2019-07-15_07_37_33-1677363866024185909?project=apache-beam-testing.
Found: https://console.cloud.google.com/dataflow/jobsDetail/locations/us-central1/jobs/2019-07-15_07_28_24-14534113632466872686?project=apache-beam-testing.
Found: https://console.cloud.google.com/dataflow/jobsDetail/locations/us-central1/jobs/2019-07-15_07_28_21-3969288423540639878?project=apache-beam-testing.
Found: https://console.cloud.google.com/dataflow/jobsDetail/locations/us-central1/jobs/2019-07-15_07_37_21-1000846565622591073?project=apache-beam-testing.
Found: https://console.cloud.google.com/dataflow/jobsDetail/locations/us-central1/jobs/2019-07-15_07_28_20-12139575849742054972?project=apache-beam-testing.
Found: https://console.cloud.google.com/dataflow/jobsDetail/locations/us-central1/jobs/2019-07-15_07_37_41-8527350816248275298?project=apache-beam-testing.
test_as_dict_twice (apache_beam.transforms.sideinputs_test.SideInputsTest) ... ok
test_flatten_multiple_pcollections_having_multiple_consumers (apache_beam.transforms.ptransform_test.PTransformTest) ... ok
test_multiple_empty_outputs (apache_beam.transforms.ptransform_test.PTransformTest) ... ok
test_par_do_with_multiple_outputs_and_using_yield (apache_beam.transforms.ptransform_test.PTransformTest) ... ok
test_as_list_and_as_dict_side_inputs (apache_beam.transforms.sideinputs_test.SideInputsTest) ... ok
test_par_do_with_multiple_outputs_and_using_return (apache_beam.transforms.ptransform_test.PTransformTest) ... ok
test_dofn_lifecycle (apache_beam.transforms.dofn_lifecycle_test.DoFnLifecycleTest) ... ok
test_undeclared_outputs (apache_beam.transforms.ptransform_test.PTransformTest) ... ok
test_as_singleton_with_different_defaults (apache_beam.transforms.sideinputs_test.SideInputsTest) ... ok
test_as_list_twice (apache_beam.transforms.sideinputs_test.SideInputsTest) ... ok
test_as_singleton_without_unique_labels (apache_beam.transforms.sideinputs_test.SideInputsTest) ... ok
test_iterable_side_input (apache_beam.transforms.sideinputs_test.SideInputsTest) ... ok
test_default_value_singleton_side_input (apache_beam.transforms.sideinputs_test.SideInputsTest) ... ok
test_flattened_side_input (apache_beam.transforms.sideinputs_test.SideInputsTest) ... ok
test_empty_singleton_side_input (apache_beam.transforms.sideinputs_test.SideInputsTest) ... ok

----------------------------------------------------------------------
XML: <https://builds.apache.org/job/beam_PostCommit_Py_VR_Dataflow/ws/src/sdks/python/nosetests.xml>
----------------------------------------------------------------------
Ran 15 tests in 1266.151s

OK

FAILURE: Build completed with 5 failures.

1: Task failed with an exception.
-----------
* Where:
Build file '<https://builds.apache.org/job/beam_PostCommit_Py_VR_Dataflow/ws/src/sdks/python/test-suites/dataflow/py36/build.gradle'> line: 67

* What went wrong:
Execution failed for task ':sdks:python:test-suites:dataflow:py36:validatesRunnerBatchTests'.
> Process 'command 'sh'' finished with non-zero exit value 1

* Try:
Run with --stacktrace option to get the stack trace. Run with --info or --debug option to get more log output. Run with --scan to get full insights.
==============================================================================

2: Task failed with an exception.
-----------
* Where:
Build file '<https://builds.apache.org/job/beam_PostCommit_Py_VR_Dataflow/ws/src/sdks/python/test-suites/dataflow/py35/build.gradle'> line: 67

* What went wrong:
Execution failed for task ':sdks:python:test-suites:dataflow:py35:validatesRunnerBatchTests'.
> Process 'command 'sh'' finished with non-zero exit value 1

* Try:
Run with --stacktrace option to get the stack trace. Run with --info or --debug option to get more log output. Run with --scan to get full insights.
==============================================================================

3: Task failed with an exception.
-----------
* Where:
Build file '<https://builds.apache.org/job/beam_PostCommit_Py_VR_Dataflow/ws/src/sdks/python/test-suites/dataflow/py36/build.gradle'> line: 87

* What went wrong:
Execution failed for task ':sdks:python:test-suites:dataflow:py36:validatesRunnerStreamingTests'.
> Process 'command 'sh'' finished with non-zero exit value 1

* Try:
Run with --stacktrace option to get the stack trace. Run with --info or --debug option to get more log output. Run with --scan to get full insights.
==============================================================================

4: Task failed with an exception.
-----------
* Where:
Build file '<https://builds.apache.org/job/beam_PostCommit_Py_VR_Dataflow/ws/src/sdks/python/test-suites/dataflow/py35/build.gradle'> line: 87

* What went wrong:
Execution failed for task ':sdks:python:test-suites:dataflow:py35:validatesRunnerStreamingTests'.
> Process 'command 'sh'' finished with non-zero exit value 1

* Try:
Run with --stacktrace option to get the stack trace. Run with --info or --debug option to get more log output. Run with --scan to get full insights.
==============================================================================

5: Task failed with an exception.
-----------
* Where:
Build file '<https://builds.apache.org/job/beam_PostCommit_Py_VR_Dataflow/ws/src/sdks/python/test-suites/dataflow/py37/build.gradle'> line: 97

* What went wrong:
Execution failed for task ':sdks:python:test-suites:dataflow:py37:validatesRunnerBatchTests'.
> Process 'command 'sh'' finished with non-zero exit value 1

* Try:
Run with --stacktrace option to get the stack trace. Run with --info or --debug option to get more log output. Run with --scan to get full insights.
==============================================================================

* Get more help at https://help.gradle.org

Deprecated Gradle features were used in this build, making it incompatible with Gradle 6.0.
Use '--warning-mode all' to show the individual deprecation warnings.
See https://docs.gradle.org/5.2.1/userguide/command_line_interface.html#sec:command_line_warnings

BUILD FAILED in 49m 44s
76 actionable tasks: 59 executed, 17 from cache

Publishing build scan...
https://gradle.com/s/2osrl2pv22wmy

Build step 'Invoke Gradle script' changed build result to FAILURE
Build step 'Invoke Gradle script' marked build as failure

---------------------------------------------------------------------
To unsubscribe, e-mail: builds-unsubscribe@beam.apache.org
For additional commands, e-mail: builds-help@beam.apache.org


Build failed in Jenkins: beam_PostCommit_Py_VR_Dataflow #4020

Posted by Apache Jenkins Server <je...@builds.apache.org>.
See <https://builds.apache.org/job/beam_PostCommit_Py_VR_Dataflow/4020/display/redirect?page=changes>

Changes:

[github] Some trivial typos

[robertwb] [BEAM-7737] Fix microbenchmark scripts compiled check (#9066)

------------------------------------------
[...truncated 146.33 KB...]

> Task :sdks:python:validatesRunnerBatchTests
>>> RUNNING integration tests with pipeline options: --runner=TestDataflowRunner --project=apache-beam-testing --staging_location=gs://temp-storage-for-end-to-end-tests/staging-it --temp_location=gs://temp-storage-for-end-to-end-tests/temp-it --output=gs://temp-storage-for-end-to-end-tests/py-it-cloud/output --sdk_location=build/apache-beam.tar.gz --requirements_file=postcommit_requirements.txt --num_workers=1 --sleep_secs=20 --dataflow_worker_jar=<https://builds.apache.org/job/beam_PostCommit_Py_VR_Dataflow/ws/src/runners/google-cloud-dataflow-java/worker/build/libs/beam-runners-google-cloud-dataflow-java-fn-api-worker-2.15.0-SNAPSHOT.jar> --kms_key_name=projects/apache-beam-testing/locations/global/keyRings/beam-it/cryptoKeys/test --dataflow_kms_key=projects/apache-beam-testing/locations/global/keyRings/beam-it/cryptoKeys/test
>>>   test options: --nocapture --processes=8 --process-timeout=4500 --attr=ValidatesRunner
<https://builds.apache.org/job/beam_PostCommit_Py_VR_Dataflow/ws/src/build/gradleenv/1922375555/local/lib/python2.7/site-packages/setuptools/dist.py>:472: UserWarning: Normalizing '2.15.0.dev' to '2.15.0.dev0'
  normalized_version,
running nosetests
running egg_info
writing requirements to apache_beam.egg-info/requires.txt
writing apache_beam.egg-info/PKG-INFO
writing top-level names to apache_beam.egg-info/top_level.txt
writing dependency_links to apache_beam.egg-info/dependency_links.txt
writing entry points to apache_beam.egg-info/entry_points.txt
reading manifest file 'apache_beam.egg-info/SOURCES.txt'
reading manifest template 'MANIFEST.in'
warning: no files found matching 'README.md'
warning: no files found matching 'NOTICE'
warning: no files found matching 'LICENSE'
writing manifest file 'apache_beam.egg-info/SOURCES.txt'
test_as_dict_twice (apache_beam.transforms.sideinputs_test.SideInputsTest) ... ok
test_dofn_lifecycle (apache_beam.transforms.dofn_lifecycle_test.DoFnLifecycleTest) ... ok
test_read_metrics (apache_beam.transforms.ptransform_test.PTransformTest) ... ok
test_par_do_with_multiple_outputs_and_using_return (apache_beam.transforms.ptransform_test.PTransformTest) ... ok
test_par_do_with_multiple_outputs_and_using_yield (apache_beam.transforms.ptransform_test.PTransformTest) ... ok
test_flatten_multiple_pcollections_having_multiple_consumers (apache_beam.transforms.ptransform_test.PTransformTest) ... ok
test_undeclared_outputs (apache_beam.transforms.ptransform_test.PTransformTest) ... ok
test_multiple_empty_outputs (apache_beam.transforms.ptransform_test.PTransformTest) ... ok
test_as_singleton_without_unique_labels (apache_beam.transforms.sideinputs_test.SideInputsTest) ... ok
test_as_list_twice (apache_beam.transforms.sideinputs_test.SideInputsTest) ... ok
test_as_list_and_as_dict_side_inputs (apache_beam.transforms.sideinputs_test.SideInputsTest) ... ok
test_as_singleton_with_different_defaults (apache_beam.transforms.sideinputs_test.SideInputsTest) ... ok
test_iterable_side_input (apache_beam.transforms.sideinputs_test.SideInputsTest) ... ok
test_default_value_singleton_side_input (apache_beam.transforms.sideinputs_test.SideInputsTest) ... ok
test_flattened_side_input (apache_beam.transforms.sideinputs_test.SideInputsTest) ... ok
test_empty_singleton_side_input (apache_beam.transforms.sideinputs_test.SideInputsTest) ... ok

> Task :sdks:python:test-suites:dataflow:py36:validatesRunnerStreamingTests
Found: https://console.cloud.google.com/dataflow/jobsDetail/locations/us-central1/jobs/2019-07-15_06_01_50-10838342945433902216?project=apache-beam-testing.
Found: https://console.cloud.google.com/dataflow/jobsDetail/locations/us-central1/jobs/2019-07-15_06_01_51-2612516869510038225?project=apache-beam-testing.
Found: https://console.cloud.google.com/dataflow/jobsDetail/locations/us-central1/jobs/2019-07-15_06_11_41-17488683454105461574?project=apache-beam-testing.
Found: https://console.cloud.google.com/dataflow/jobsDetail/locations/us-central1/jobs/2019-07-15_06_01_51-3078251739899160268?project=apache-beam-testing.
Found: https://console.cloud.google.com/dataflow/jobsDetail/locations/us-central1/jobs/2019-07-15_06_11_41-15767431858085294039?project=apache-beam-testing.
Found: https://console.cloud.google.com/dataflow/jobsDetail/locations/us-central1/jobs/2019-07-15_06_01_52-7191965318506105999?project=apache-beam-testing.
Found: https://console.cloud.google.com/dataflow/jobsDetail/locations/us-central1/jobs/2019-07-15_06_11_46-8365719671795460502?project=apache-beam-testing.
Found: https://console.cloud.google.com/dataflow/jobsDetail/locations/us-central1/jobs/2019-07-15_06_01_53-15286271481519790025?project=apache-beam-testing.
Found: https://console.cloud.google.com/dataflow/jobsDetail/locations/us-central1/jobs/2019-07-15_06_11_42-7450993142853529672?project=apache-beam-testing.
Found: https://console.cloud.google.com/dataflow/jobsDetail/locations/us-central1/jobs/2019-07-15_06_02_23-10062907526682524016?project=apache-beam-testing.
Found: https://console.cloud.google.com/dataflow/jobsDetail/locations/us-central1/jobs/2019-07-15_06_12_19-2549897232429922778?project=apache-beam-testing.
Found: https://console.cloud.google.com/dataflow/jobsDetail/locations/us-central1/jobs/2019-07-15_06_01_51-4115941759894267709?project=apache-beam-testing.
Found: https://console.cloud.google.com/dataflow/jobsDetail/locations/us-central1/jobs/2019-07-15_06_11_17-7884627759075576524?project=apache-beam-testing.
Found: https://console.cloud.google.com/dataflow/jobsDetail/locations/us-central1/jobs/2019-07-15_06_01_51-8977764551524583417?project=apache-beam-testing.
Found: https://console.cloud.google.com/dataflow/jobsDetail/locations/us-central1/jobs/2019-07-15_06_11_52-9818553695677730094?project=apache-beam-testing.
test_as_dict_twice (apache_beam.transforms.sideinputs_test.SideInputsTest) ... ok
test_flatten_multiple_pcollections_having_multiple_consumers (apache_beam.transforms.ptransform_test.PTransformTest) ... ok
test_multiple_empty_outputs (apache_beam.transforms.ptransform_test.PTransformTest) ... ok
test_par_do_with_multiple_outputs_and_using_yield (apache_beam.transforms.ptransform_test.PTransformTest) ... ok
test_par_do_with_multiple_outputs_and_using_return (apache_beam.transforms.ptransform_test.PTransformTest) ... ok
test_as_list_and_as_dict_side_inputs (apache_beam.transforms.sideinputs_test.SideInputsTest) ... ok
test_undeclared_outputs (apache_beam.transforms.ptransform_test.PTransformTest) ... ok
test_dofn_lifecycle (apache_beam.transforms.dofn_lifecycle_test.DoFnLifecycleTest) ... ok
test_as_singleton_with_different_defaults (apache_beam.transforms.sideinputs_test.SideInputsTest) ... ok
test_empty_singleton_side_input (apache_beam.transforms.sideinputs_test.SideInputsTest) ... ok
test_as_list_twice (apache_beam.transforms.sideinputs_test.SideInputsTest) ... ok
test_as_singleton_without_unique_labels (apache_beam.transforms.sideinputs_test.SideInputsTest) ... ok
test_flattened_side_input (apache_beam.transforms.sideinputs_test.SideInputsTest) ... ok
test_default_value_singleton_side_input (apache_beam.transforms.sideinputs_test.SideInputsTest) ... ok
test_iterable_side_input (apache_beam.transforms.sideinputs_test.SideInputsTest) ... ok

----------------------------------------------------------------------
XML: <https://builds.apache.org/job/beam_PostCommit_Py_VR_Dataflow/ws/src/sdks/python/nosetests.xml>
----------------------------------------------------------------------
Ran 15 tests in 1205.759s

OK

> Task :sdks:python:test-suites:dataflow:py37:validatesRunnerStreamingTests
Found: https://console.cloud.google.com/dataflow/jobsDetail/locations/us-central1/jobs/2019-07-15_06_01_49-10289337681140598941?project=apache-beam-testing.
Found: https://console.cloud.google.com/dataflow/jobsDetail/locations/us-central1/jobs/2019-07-15_06_11_35-7312205877304745573?project=apache-beam-testing.
Found: https://console.cloud.google.com/dataflow/jobsDetail/locations/us-central1/jobs/2019-07-15_06_01_52-14208519385043459176?project=apache-beam-testing.
Found: https://console.cloud.google.com/dataflow/jobsDetail/locations/us-central1/jobs/2019-07-15_06_01_52-6217862273649595932?project=apache-beam-testing.
Found: https://console.cloud.google.com/dataflow/jobsDetail/locations/us-central1/jobs/2019-07-15_06_11_52-13658897768887050071?project=apache-beam-testing.
Found: https://console.cloud.google.com/dataflow/jobsDetail/locations/us-central1/jobs/2019-07-15_06_01_52-481793818767908859?project=apache-beam-testing.
Found: https://console.cloud.google.com/dataflow/jobsDetail/locations/us-central1/jobs/2019-07-15_06_11_57-3825083933382131499?project=apache-beam-testing.
Found: https://console.cloud.google.com/dataflow/jobsDetail/locations/us-central1/jobs/2019-07-15_06_01_52-14371578484527758971?project=apache-beam-testing.
Found: https://console.cloud.google.com/dataflow/jobsDetail/locations/us-central1/jobs/2019-07-15_06_11_46-13482329665034545163?project=apache-beam-testing.
Found: https://console.cloud.google.com/dataflow/jobsDetail/locations/us-central1/jobs/2019-07-15_06_01_52-765506879127884069?project=apache-beam-testing.
Found: https://console.cloud.google.com/dataflow/jobsDetail/locations/us-central1/jobs/2019-07-15_06_12_16-116391388976905871?project=apache-beam-testing.
Found: https://console.cloud.google.com/dataflow/jobsDetail/locations/us-central1/jobs/2019-07-15_06_01_53-8143602433999128491?project=apache-beam-testing.
Found: https://console.cloud.google.com/dataflow/jobsDetail/locations/us-central1/jobs/2019-07-15_06_11_44-16185443983050911104?project=apache-beam-testing.
Found: https://console.cloud.google.com/dataflow/jobsDetail/locations/us-central1/jobs/2019-07-15_06_01_53-12934047145780584652?project=apache-beam-testing.
Found: https://console.cloud.google.com/dataflow/jobsDetail/locations/us-central1/jobs/2019-07-15_06_11_42-2574343402597008963?project=apache-beam-testing.
test_dofn_lifecycle (apache_beam.transforms.dofn_lifecycle_test.DoFnLifecycleTest) ... ok
test_as_list_and_as_dict_side_inputs (apache_beam.transforms.sideinputs_test.SideInputsTest) ... ok
test_undeclared_outputs (apache_beam.transforms.ptransform_test.PTransformTest) ... ok
test_par_do_with_multiple_outputs_and_using_yield (apache_beam.transforms.ptransform_test.PTransformTest) ... ok
test_multiple_empty_outputs (apache_beam.transforms.ptransform_test.PTransformTest) ... ok
test_par_do_with_multiple_outputs_and_using_return (apache_beam.transforms.ptransform_test.PTransformTest) ... ok
test_as_dict_twice (apache_beam.transforms.sideinputs_test.SideInputsTest) ... ok
test_flatten_multiple_pcollections_having_multiple_consumers (apache_beam.transforms.ptransform_test.PTransformTest) ... ok
test_default_value_singleton_side_input (apache_beam.transforms.sideinputs_test.SideInputsTest) ... ok
test_as_singleton_with_different_defaults (apache_beam.transforms.sideinputs_test.SideInputsTest) ... ok
test_as_list_twice (apache_beam.transforms.sideinputs_test.SideInputsTest) ... ok
test_as_singleton_without_unique_labels (apache_beam.transforms.sideinputs_test.SideInputsTest) ... ok
test_flattened_side_input (apache_beam.transforms.sideinputs_test.SideInputsTest) ... ok
test_iterable_side_input (apache_beam.transforms.sideinputs_test.SideInputsTest) ... ok
test_empty_singleton_side_input (apache_beam.transforms.sideinputs_test.SideInputsTest) ... ok

----------------------------------------------------------------------
XML: <https://builds.apache.org/job/beam_PostCommit_Py_VR_Dataflow/ws/src/sdks/python/nosetests.xml>
----------------------------------------------------------------------
Ran 15 tests in 1213.924s

OK

> Task :sdks:python:validatesRunnerBatchTests
test_multi_valued_singleton_side_input (apache_beam.transforms.sideinputs_test.SideInputsTest) ... ok

----------------------------------------------------------------------
XML: <https://builds.apache.org/job/beam_PostCommit_Py_VR_Dataflow/ws/src/sdks/python/nosetests.xml>
----------------------------------------------------------------------
Ran 17 tests in 1461.074s

OK
Found: https://console.cloud.google.com/dataflow/jobsDetail/locations/us-central1/jobs/2019-07-15_06_01_51-12090227617799446211?project=apache-beam-testing.
Found: https://console.cloud.google.com/dataflow/jobsDetail/locations/us-central1/jobs/2019-07-15_06_10_45-11856162326489800364?project=apache-beam-testing.
Found: https://console.cloud.google.com/dataflow/jobsDetail/locations/us-central1/jobs/2019-07-15_06_17_24-6870680843298034471?project=apache-beam-testing.
Found: https://console.cloud.google.com/dataflow/jobsDetail/locations/us-central1/jobs/2019-07-15_06_02_10-2919244696930830584?project=apache-beam-testing.
Found: https://console.cloud.google.com/dataflow/jobsDetail/locations/us-central1/jobs/2019-07-15_06_10_19-5726724777221658765?project=apache-beam-testing.
Found: https://console.cloud.google.com/dataflow/jobsDetail/locations/us-central1/jobs/2019-07-15_06_01_50-14039473500485731352?project=apache-beam-testing.
Found: https://console.cloud.google.com/dataflow/jobsDetail/locations/us-central1/jobs/2019-07-15_06_11_16-9670033495084566358?project=apache-beam-testing.
Found: https://console.cloud.google.com/dataflow/jobsDetail/locations/us-central1/jobs/2019-07-15_06_01_51-9674791746975178377?project=apache-beam-testing.
Found: https://console.cloud.google.com/dataflow/jobsDetail/locations/us-central1/jobs/2019-07-15_06_11_45-1372923664926547492?project=apache-beam-testing.
Found: https://console.cloud.google.com/dataflow/jobsDetail/locations/us-central1/jobs/2019-07-15_06_01_52-3957513401687413746?project=apache-beam-testing.
Found: https://console.cloud.google.com/dataflow/jobsDetail/locations/us-central1/jobs/2019-07-15_06_11_06-3691190919965773552?project=apache-beam-testing.
Found: https://console.cloud.google.com/dataflow/jobsDetail/locations/us-central1/jobs/2019-07-15_06_01_50-6250910488732646480?project=apache-beam-testing.
Found: https://console.cloud.google.com/dataflow/jobsDetail/locations/us-central1/jobs/2019-07-15_06_10_39-13577399830718071172?project=apache-beam-testing.
Found: https://console.cloud.google.com/dataflow/jobsDetail/locations/us-central1/jobs/2019-07-15_06_01_52-6089829745158998385?project=apache-beam-testing.
Found: https://console.cloud.google.com/dataflow/jobsDetail/locations/us-central1/jobs/2019-07-15_06_11_41-5827212776694568082?project=apache-beam-testing.
Found: https://console.cloud.google.com/dataflow/jobsDetail/locations/us-central1/jobs/2019-07-15_06_01_50-4870691518659073595?project=apache-beam-testing.
Found: https://console.cloud.google.com/dataflow/jobsDetail/locations/us-central1/jobs/2019-07-15_06_10_14-4425623184664122452?project=apache-beam-testing.

> Task :sdks:python:validatesRunnerStreamingTests
>>> RUNNING integration tests with pipeline options: --runner=TestDataflowRunner --project=apache-beam-testing --staging_location=gs://temp-storage-for-end-to-end-tests/staging-it --temp_location=gs://temp-storage-for-end-to-end-tests/temp-it --output=gs://temp-storage-for-end-to-end-tests/py-it-cloud/output --sdk_location=build/apache-beam.tar.gz --requirements_file=postcommit_requirements.txt --num_workers=1 --sleep_secs=20 --streaming --dataflow_worker_jar=<https://builds.apache.org/job/beam_PostCommit_Py_VR_Dataflow/ws/src/runners/google-cloud-dataflow-java/worker/build/libs/beam-runners-google-cloud-dataflow-java-fn-api-worker-2.15.0-SNAPSHOT.jar> --kms_key_name=projects/apache-beam-testing/locations/global/keyRings/beam-it/cryptoKeys/test --dataflow_kms_key=projects/apache-beam-testing/locations/global/keyRings/beam-it/cryptoKeys/test
>>>   test options: --nocapture --processes=8 --process-timeout=4500 --attr=ValidatesRunner,!sickbay-streaming
<https://builds.apache.org/job/beam_PostCommit_Py_VR_Dataflow/ws/src/build/gradleenv/1922375555/local/lib/python2.7/site-packages/setuptools/dist.py>:472: UserWarning: Normalizing '2.15.0.dev' to '2.15.0.dev0'
  normalized_version,
running nosetests
running egg_info
writing requirements to apache_beam.egg-info/requires.txt
writing apache_beam.egg-info/PKG-INFO
writing top-level names to apache_beam.egg-info/top_level.txt
writing dependency_links to apache_beam.egg-info/dependency_links.txt
writing entry points to apache_beam.egg-info/entry_points.txt
reading manifest file 'apache_beam.egg-info/SOURCES.txt'
reading manifest template 'MANIFEST.in'
warning: no files found matching 'README.md'
warning: no files found matching 'NOTICE'
warning: no files found matching 'LICENSE'
writing manifest file 'apache_beam.egg-info/SOURCES.txt'
test_par_do_with_multiple_outputs_and_using_return (apache_beam.transforms.ptransform_test.PTransformTest) ... ok
test_dofn_lifecycle (apache_beam.transforms.dofn_lifecycle_test.DoFnLifecycleTest) ... ok
test_par_do_with_multiple_outputs_and_using_yield (apache_beam.transforms.ptransform_test.PTransformTest) ... ok
test_flatten_multiple_pcollections_having_multiple_consumers (apache_beam.transforms.ptransform_test.PTransformTest) ... ok
test_multiple_empty_outputs (apache_beam.transforms.ptransform_test.PTransformTest) ... ok
test_undeclared_outputs (apache_beam.transforms.ptransform_test.PTransformTest) ... ok
test_as_dict_twice (apache_beam.transforms.sideinputs_test.SideInputsTest) ... ok
test_as_list_and_as_dict_side_inputs (apache_beam.transforms.sideinputs_test.SideInputsTest) ... ok
test_as_list_twice (apache_beam.transforms.sideinputs_test.SideInputsTest) ... ok
test_default_value_singleton_side_input (apache_beam.transforms.sideinputs_test.SideInputsTest) ... ok
test_as_singleton_without_unique_labels (apache_beam.transforms.sideinputs_test.SideInputsTest) ... ok
test_iterable_side_input (apache_beam.transforms.sideinputs_test.SideInputsTest) ... ok
test_flattened_side_input (apache_beam.transforms.sideinputs_test.SideInputsTest) ... ok
test_empty_singleton_side_input (apache_beam.transforms.sideinputs_test.SideInputsTest) ... ok
test_as_singleton_with_different_defaults (apache_beam.transforms.sideinputs_test.SideInputsTest) ... ok

----------------------------------------------------------------------
XML: <https://builds.apache.org/job/beam_PostCommit_Py_VR_Dataflow/ws/src/sdks/python/nosetests.xml>
----------------------------------------------------------------------
Ran 15 tests in 1070.930s

OK
Found: https://console.cloud.google.com/dataflow/jobsDetail/locations/us-central1/jobs/2019-07-15_06_26_07-1374214114723540427?project=apache-beam-testing.
Found: https://console.cloud.google.com/dataflow/jobsDetail/locations/us-central1/jobs/2019-07-15_06_34_16-9539083986160363120?project=apache-beam-testing.
Found: https://console.cloud.google.com/dataflow/jobsDetail/locations/us-central1/jobs/2019-07-15_06_26_08-15396477314383112774?project=apache-beam-testing.
Found: https://console.cloud.google.com/dataflow/jobsDetail/locations/us-central1/jobs/2019-07-15_06_34_31-12563412235656642435?project=apache-beam-testing.
Found: https://console.cloud.google.com/dataflow/jobsDetail/locations/us-central1/jobs/2019-07-15_06_26_08-1121155025250898261?project=apache-beam-testing.
Found: https://console.cloud.google.com/dataflow/jobsDetail/locations/us-central1/jobs/2019-07-15_06_34_27-6764983715931732997?project=apache-beam-testing.
Found: https://console.cloud.google.com/dataflow/jobsDetail/locations/us-central1/jobs/2019-07-15_06_26_08-8149912040094483739?project=apache-beam-testing.
Found: https://console.cloud.google.com/dataflow/jobsDetail/locations/us-central1/jobs/2019-07-15_06_34_52-5368695432889468838?project=apache-beam-testing.
Found: https://console.cloud.google.com/dataflow/jobsDetail/locations/us-central1/jobs/2019-07-15_06_26_07-2578619034661901039?project=apache-beam-testing.
Found: https://console.cloud.google.com/dataflow/jobsDetail/locations/us-central1/jobs/2019-07-15_06_35_01-5187252764409266618?project=apache-beam-testing.
Found: https://console.cloud.google.com/dataflow/jobsDetail/locations/us-central1/jobs/2019-07-15_06_26_08-1551054048683583847?project=apache-beam-testing.
Found: https://console.cloud.google.com/dataflow/jobsDetail/locations/us-central1/jobs/2019-07-15_06_33_17-13221246115004687562?project=apache-beam-testing.
Found: https://console.cloud.google.com/dataflow/jobsDetail/locations/us-central1/jobs/2019-07-15_06_26_08-979470317169796546?project=apache-beam-testing.
Found: https://console.cloud.google.com/dataflow/jobsDetail/locations/us-central1/jobs/2019-07-15_06_34_22-10150388102760344437?project=apache-beam-testing.
Found: https://console.cloud.google.com/dataflow/jobsDetail/locations/us-central1/jobs/2019-07-15_06_26_08-11110036816547403961?project=apache-beam-testing.

FAILURE: Build completed with 3 failures.

1: Task failed with an exception.
-----------
* What went wrong:
Execution failed for task ':sdks:python:test-suites:dataflow:py35:installGcpTest'.
> Process 'command 'sh'' finished with non-zero exit value 1

* Try:
Run with --stacktrace option to get the stack trace. Run with --info or --debug option to get more log output. Run with --scan to get full insights.
==============================================================================

2: Task failed with an exception.
-----------
* Where:
Build file '<https://builds.apache.org/job/beam_PostCommit_Py_VR_Dataflow/ws/src/sdks/python/test-suites/dataflow/py36/build.gradle'> line: 67

* What went wrong:
Execution failed for task ':sdks:python:test-suites:dataflow:py36:validatesRunnerBatchTests'.
> Process 'command 'sh'' finished with non-zero exit value 1

* Try:
Run with --stacktrace option to get the stack trace. Run with --info or --debug option to get more log output. Run with --scan to get full insights.
==============================================================================

3: Task failed with an exception.
-----------
* Where:
Build file '<https://builds.apache.org/job/beam_PostCommit_Py_VR_Dataflow/ws/src/sdks/python/test-suites/dataflow/py37/build.gradle'> line: 97

* What went wrong:
Execution failed for task ':sdks:python:test-suites:dataflow:py37:validatesRunnerBatchTests'.
> Process 'command 'sh'' finished with non-zero exit value 1

* Try:
Run with --stacktrace option to get the stack trace. Run with --info or --debug option to get more log output. Run with --scan to get full insights.
==============================================================================

* Get more help at https://help.gradle.org

Deprecated Gradle features were used in this build, making it incompatible with Gradle 6.0.
Use '--warning-mode all' to show the individual deprecation warnings.
See https://docs.gradle.org/5.2.1/userguide/command_line_interface.html#sec:command_line_warnings

BUILD FAILED in 43m 7s
74 actionable tasks: 57 executed, 17 from cache

Publishing build scan...
https://gradle.com/s/mgfq47fn4on46

Build step 'Invoke Gradle script' changed build result to FAILURE
Build step 'Invoke Gradle script' marked build as failure

---------------------------------------------------------------------
To unsubscribe, e-mail: builds-unsubscribe@beam.apache.org
For additional commands, e-mail: builds-help@beam.apache.org


Build failed in Jenkins: beam_PostCommit_Py_VR_Dataflow #4019

Posted by Apache Jenkins Server <je...@builds.apache.org>.
See <https://builds.apache.org/job/beam_PostCommit_Py_VR_Dataflow/4019/display/redirect>

------------------------------------------
[...truncated 167.17 KB...]
> Task :sdks:python:validatesRunnerBatchTests
test_multi_valued_singleton_side_input (apache_beam.transforms.sideinputs_test.SideInputsTest) ... ok

----------------------------------------------------------------------
XML: <https://builds.apache.org/job/beam_PostCommit_Py_VR_Dataflow/ws/src/sdks/python/nosetests.xml>
----------------------------------------------------------------------
Ran 17 tests in 1425.364s

OK
Found: https://console.cloud.google.com/dataflow/jobsDetail/locations/us-central1/jobs/2019-07-15_05_01_30-2502340536849596249?project=apache-beam-testing.
Found: https://console.cloud.google.com/dataflow/jobsDetail/locations/us-central1/jobs/2019-07-15_05_09_55-10443944412281542606?project=apache-beam-testing.
Found: https://console.cloud.google.com/dataflow/jobsDetail/locations/us-central1/jobs/2019-07-15_05_17_35-7234654612301362376?project=apache-beam-testing.
Found: https://console.cloud.google.com/dataflow/jobsDetail/locations/us-central1/jobs/2019-07-15_05_01_28-3781869861513272812?project=apache-beam-testing.
Found: https://console.cloud.google.com/dataflow/jobsDetail/locations/us-central1/jobs/2019-07-15_05_11_03-5038603723408006164?project=apache-beam-testing.
Found: https://console.cloud.google.com/dataflow/jobsDetail/locations/us-central1/jobs/2019-07-15_05_01_31-1819694857102876856?project=apache-beam-testing.
Found: https://console.cloud.google.com/dataflow/jobsDetail/locations/us-central1/jobs/2019-07-15_05_11_20-15053380955273217202?project=apache-beam-testing.
Found: https://console.cloud.google.com/dataflow/jobsDetail/locations/us-central1/jobs/2019-07-15_05_01_30-5613486361672831794?project=apache-beam-testing.
Found: https://console.cloud.google.com/dataflow/jobsDetail/locations/us-central1/jobs/2019-07-15_05_10_55-3907556935613468715?project=apache-beam-testing.
Found: https://console.cloud.google.com/dataflow/jobsDetail/locations/us-central1/jobs/2019-07-15_05_01_30-16644205305001541736?project=apache-beam-testing.
Found: https://console.cloud.google.com/dataflow/jobsDetail/locations/us-central1/jobs/2019-07-15_05_11_20-17452486966422162039?project=apache-beam-testing.
Found: https://console.cloud.google.com/dataflow/jobsDetail/locations/us-central1/jobs/2019-07-15_05_01_30-9401952845671889640?project=apache-beam-testing.
Found: https://console.cloud.google.com/dataflow/jobsDetail/locations/us-central1/jobs/2019-07-15_05_11_26-7452173438042881970?project=apache-beam-testing.
Found: https://console.cloud.google.com/dataflow/jobsDetail/locations/us-central1/jobs/2019-07-15_05_01_30-12616631655765988432?project=apache-beam-testing.
Found: https://console.cloud.google.com/dataflow/jobsDetail/locations/us-central1/jobs/2019-07-15_05_10_24-14244616831325600445?project=apache-beam-testing.
Found: https://console.cloud.google.com/dataflow/jobsDetail/locations/us-central1/jobs/2019-07-15_05_01_30-12147692634338965045?project=apache-beam-testing.
Found: https://console.cloud.google.com/dataflow/jobsDetail/locations/us-central1/jobs/2019-07-15_05_12_40-8782169916115829280?project=apache-beam-testing.

> Task :sdks:python:validatesRunnerStreamingTests
>>> RUNNING integration tests with pipeline options: --runner=TestDataflowRunner --project=apache-beam-testing --staging_location=gs://temp-storage-for-end-to-end-tests/staging-it --temp_location=gs://temp-storage-for-end-to-end-tests/temp-it --output=gs://temp-storage-for-end-to-end-tests/py-it-cloud/output --sdk_location=build/apache-beam.tar.gz --requirements_file=postcommit_requirements.txt --num_workers=1 --sleep_secs=20 --streaming --dataflow_worker_jar=<https://builds.apache.org/job/beam_PostCommit_Py_VR_Dataflow/ws/src/runners/google-cloud-dataflow-java/worker/build/libs/beam-runners-google-cloud-dataflow-java-fn-api-worker-2.15.0-SNAPSHOT.jar> --kms_key_name=projects/apache-beam-testing/locations/global/keyRings/beam-it/cryptoKeys/test --dataflow_kms_key=projects/apache-beam-testing/locations/global/keyRings/beam-it/cryptoKeys/test
>>>   test options: --nocapture --processes=8 --process-timeout=4500 --attr=ValidatesRunner,!sickbay-streaming
<https://builds.apache.org/job/beam_PostCommit_Py_VR_Dataflow/ws/src/build/gradleenv/1922375555/local/lib/python2.7/site-packages/setuptools/dist.py>:472: UserWarning: Normalizing '2.15.0.dev' to '2.15.0.dev0'
  normalized_version,
running nosetests
running egg_info
writing requirements to apache_beam.egg-info/requires.txt
writing apache_beam.egg-info/PKG-INFO
writing top-level names to apache_beam.egg-info/top_level.txt
writing dependency_links to apache_beam.egg-info/dependency_links.txt
writing entry points to apache_beam.egg-info/entry_points.txt
reading manifest file 'apache_beam.egg-info/SOURCES.txt'
reading manifest template 'MANIFEST.in'
warning: no files found matching 'README.md'
warning: no files found matching 'NOTICE'
warning: no files found matching 'LICENSE'
writing manifest file 'apache_beam.egg-info/SOURCES.txt'

> Task :sdks:python:test-suites:dataflow:py37:validatesRunnerBatchTests
Found: https://console.cloud.google.com/dataflow/jobsDetail/locations/us-central1/jobs/2019-07-15_05_01_28-11137357715319461730?project=apache-beam-testing.
Found: https://console.cloud.google.com/dataflow/jobsDetail/locations/us-central1/jobs/2019-07-15_05_11_58-7118769991326849092?project=apache-beam-testing.
Found: https://console.cloud.google.com/dataflow/jobsDetail/locations/us-central1/jobs/2019-07-15_05_01_30-10223680277481674397?project=apache-beam-testing.
Found: https://console.cloud.google.com/dataflow/jobsDetail/locations/us-central1/jobs/2019-07-15_05_11_56-2589699298124913730?project=apache-beam-testing.
Found: https://console.cloud.google.com/dataflow/jobsDetail/locations/us-central1/jobs/2019-07-15_05_01_30-8393817572414479557?project=apache-beam-testing.
Found: https://console.cloud.google.com/dataflow/jobsDetail/locations/us-central1/jobs/2019-07-15_05_11_21-4672436911568374502?project=apache-beam-testing.
Found: https://console.cloud.google.com/dataflow/jobsDetail/locations/us-central1/jobs/2019-07-15_05_01_30-11829125518228223976?project=apache-beam-testing.
Found: https://console.cloud.google.com/dataflow/jobsDetail/locations/us-central1/jobs/2019-07-15_05_12_00-17392644241697481107?project=apache-beam-testing.
Found: https://console.cloud.google.com/dataflow/jobsDetail/locations/us-central1/jobs/2019-07-15_05_01_30-7955171535245263263?project=apache-beam-testing.
Found: https://console.cloud.google.com/dataflow/jobsDetail/locations/us-central1/jobs/2019-07-15_05_11_31-17309506936738445080?project=apache-beam-testing.
Found: https://console.cloud.google.com/dataflow/jobsDetail/locations/us-central1/jobs/2019-07-15_05_01_28-12736411646121128495?project=apache-beam-testing.
Found: https://console.cloud.google.com/dataflow/jobsDetail/locations/us-central1/jobs/2019-07-15_05_10_53-6543853095107655820?project=apache-beam-testing.
Found: https://console.cloud.google.com/dataflow/jobsDetail/locations/us-central1/jobs/2019-07-15_05_19_28-3988889847741065096?project=apache-beam-testing.
Found: https://console.cloud.google.com/dataflow/jobsDetail/locations/us-central1/jobs/2019-07-15_05_01_30-16982867558752073098?project=apache-beam-testing.
Found: https://console.cloud.google.com/dataflow/jobsDetail/locations/us-central1/jobs/2019-07-15_05_12_30-6721218174381344193?project=apache-beam-testing.
Found: https://console.cloud.google.com/dataflow/jobsDetail/locations/us-central1/jobs/2019-07-15_05_01_29-2762093561434671843?project=apache-beam-testing.
Found: https://console.cloud.google.com/dataflow/jobsDetail/locations/us-central1/jobs/2019-07-15_05_10_59-4296756442874446377?project=apache-beam-testing.
test_read_metrics (apache_beam.transforms.ptransform_test.PTransformTest) ... ok
test_as_dict_twice (apache_beam.transforms.sideinputs_test.SideInputsTest) ... ok
test_multiple_empty_outputs (apache_beam.transforms.ptransform_test.PTransformTest) ... ok
test_par_do_with_multiple_outputs_and_using_yield (apache_beam.transforms.ptransform_test.PTransformTest) ... ok
test_flatten_multiple_pcollections_having_multiple_consumers (apache_beam.transforms.ptransform_test.PTransformTest) ... ok
test_dofn_lifecycle (apache_beam.transforms.dofn_lifecycle_test.DoFnLifecycleTest) ... ok
test_par_do_with_multiple_outputs_and_using_return (apache_beam.transforms.ptransform_test.PTransformTest) ... ok
test_undeclared_outputs (apache_beam.transforms.ptransform_test.PTransformTest) ... ok
test_as_list_and_as_dict_side_inputs (apache_beam.transforms.sideinputs_test.SideInputsTest) ... ok
test_as_list_twice (apache_beam.transforms.sideinputs_test.SideInputsTest) ... ok
test_empty_singleton_side_input (apache_beam.transforms.sideinputs_test.SideInputsTest) ... ok
test_as_singleton_with_different_defaults (apache_beam.transforms.sideinputs_test.SideInputsTest) ... ok
test_as_singleton_without_unique_labels (apache_beam.transforms.sideinputs_test.SideInputsTest) ... ok
test_default_value_singleton_side_input (apache_beam.transforms.sideinputs_test.SideInputsTest) ... ok
test_flattened_side_input (apache_beam.transforms.sideinputs_test.SideInputsTest) ... ok
test_iterable_side_input (apache_beam.transforms.sideinputs_test.SideInputsTest) ... ok
test_multi_valued_singleton_side_input (apache_beam.transforms.sideinputs_test.SideInputsTest) ... ok

----------------------------------------------------------------------
XML: <https://builds.apache.org/job/beam_PostCommit_Py_VR_Dataflow/ws/src/sdks/python/nosetests.xml>
----------------------------------------------------------------------
Ran 17 tests in 1589.676s

OK

> Task :sdks:python:test-suites:dataflow:py37:validatesRunnerStreamingTests
>>> RUNNING integration tests with pipeline options: --runner=TestDataflowRunner --project=apache-beam-testing --staging_location=gs://temp-storage-for-end-to-end-tests/staging-it --temp_location=gs://temp-storage-for-end-to-end-tests/temp-it --output=gs://temp-storage-for-end-to-end-tests/py-it-cloud/output --sdk_location=<https://builds.apache.org/job/beam_PostCommit_Py_VR_Dataflow/ws/src/sdks/python/test-suites/dataflow/py37/build/apache-beam.tar.gz> --requirements_file=postcommit_requirements.txt --num_workers=1 --sleep_secs=20 --streaming --dataflow_worker_jar=<https://builds.apache.org/job/beam_PostCommit_Py_VR_Dataflow/ws/src/runners/google-cloud-dataflow-java/worker/build/libs/beam-runners-google-cloud-dataflow-java-fn-api-worker-2.15.0-SNAPSHOT.jar> --kms_key_name=projects/apache-beam-testing/locations/global/keyRings/beam-it/cryptoKeys/test --dataflow_kms_key=projects/apache-beam-testing/locations/global/keyRings/beam-it/cryptoKeys/test
>>>   test options: --nocapture --processes=8 --process-timeout=4500 --attr=ValidatesRunner,!sickbay-streaming
running nosetests
running egg_info
writing apache_beam.egg-info/PKG-INFO
writing dependency_links to apache_beam.egg-info/dependency_links.txt
writing entry points to apache_beam.egg-info/entry_points.txt
writing requirements to apache_beam.egg-info/requires.txt
writing top-level names to apache_beam.egg-info/top_level.txt
reading manifest file 'apache_beam.egg-info/SOURCES.txt'
reading manifest template 'MANIFEST.in'
setup.py:177: UserWarning: Some syntactic constructs of Python 3 are not yet fully supported by Apache Beam.
  'Some syntactic constructs of Python 3 are not yet fully supported by '
<https://builds.apache.org/job/beam_PostCommit_Py_VR_Dataflow/ws/src/build/gradleenv/-1734967052/lib/python3.7/site-packages/setuptools/dist.py>:472: UserWarning: Normalizing '2.15.0.dev' to '2.15.0.dev0'
  normalized_version,
warning: no files found matching 'README.md'
warning: no files found matching 'NOTICE'
warning: no files found matching 'LICENSE'
writing manifest file 'apache_beam.egg-info/SOURCES.txt'
<https://builds.apache.org/job/beam_PostCommit_Py_VR_Dataflow/ws/src/sdks/python/apache_beam/__init__.py>:84: UserWarning: Some syntactic constructs of Python 3 are not yet fully supported by Apache Beam.
  'Some syntactic constructs of Python 3 are not yet fully supported by '
<https://builds.apache.org/job/beam_PostCommit_Py_VR_Dataflow/ws/src/sdks/python/apache_beam/io/gcp/datastore/v1/datastoreio.py>:59: UserWarning: Datastore IO will support Python 3 after replacing googledatastore by google-cloud-datastore, see: BEAM-4543.
  warnings.warn('Datastore IO will support Python 3 after replacing '
<https://builds.apache.org/job/beam_PostCommit_Py_VR_Dataflow/ws/src/sdks/python/apache_beam/io/vcfio.py>:47: UserWarning: VCF IO will support Python 3 after migration to Nucleus, see: BEAM-5628.
  warnings.warn("VCF IO will support Python 3 after migration to Nucleus, "

> Task :sdks:python:validatesRunnerStreamingTests
test_dofn_lifecycle (apache_beam.transforms.dofn_lifecycle_test.DoFnLifecycleTest) ... ok
test_multiple_empty_outputs (apache_beam.transforms.ptransform_test.PTransformTest) ... ok
test_as_dict_twice (apache_beam.transforms.sideinputs_test.SideInputsTest) ... ok
test_as_list_and_as_dict_side_inputs (apache_beam.transforms.sideinputs_test.SideInputsTest) ... ok
test_par_do_with_multiple_outputs_and_using_return (apache_beam.transforms.ptransform_test.PTransformTest) ... ok
test_flatten_multiple_pcollections_having_multiple_consumers (apache_beam.transforms.ptransform_test.PTransformTest) ... ok
test_par_do_with_multiple_outputs_and_using_yield (apache_beam.transforms.ptransform_test.PTransformTest) ... ok
test_undeclared_outputs (apache_beam.transforms.ptransform_test.PTransformTest) ... ok
test_as_singleton_without_unique_labels (apache_beam.transforms.sideinputs_test.SideInputsTest) ... ok
test_default_value_singleton_side_input (apache_beam.transforms.sideinputs_test.SideInputsTest) ... ok
test_as_list_twice (apache_beam.transforms.sideinputs_test.SideInputsTest) ... ok
test_flattened_side_input (apache_beam.transforms.sideinputs_test.SideInputsTest) ... ok
test_as_singleton_with_different_defaults (apache_beam.transforms.sideinputs_test.SideInputsTest) ... ok
test_empty_singleton_side_input (apache_beam.transforms.sideinputs_test.SideInputsTest) ... ok
test_iterable_side_input (apache_beam.transforms.sideinputs_test.SideInputsTest) ... ok

----------------------------------------------------------------------
XML: <https://builds.apache.org/job/beam_PostCommit_Py_VR_Dataflow/ws/src/sdks/python/nosetests.xml>
----------------------------------------------------------------------
Ran 15 tests in 1127.088s

OK
Found: https://console.cloud.google.com/dataflow/jobsDetail/locations/us-central1/jobs/2019-07-15_05_25_08-6863328432583043259?project=apache-beam-testing.
Found: https://console.cloud.google.com/dataflow/jobsDetail/locations/us-central1/jobs/2019-07-15_05_32_42-14014551883859830416?project=apache-beam-testing.
Found: https://console.cloud.google.com/dataflow/jobsDetail/locations/us-central1/jobs/2019-07-15_05_25_10-688767436561422355?project=apache-beam-testing.
Found: https://console.cloud.google.com/dataflow/jobsDetail/locations/us-central1/jobs/2019-07-15_05_33_49-12781093124753295319?project=apache-beam-testing.
Found: https://console.cloud.google.com/dataflow/jobsDetail/locations/us-central1/jobs/2019-07-15_05_25_09-7948454287513545684?project=apache-beam-testing.
Found: https://console.cloud.google.com/dataflow/jobsDetail/locations/us-central1/jobs/2019-07-15_05_33_44-6041598592417591664?project=apache-beam-testing.
Found: https://console.cloud.google.com/dataflow/jobsDetail/locations/us-central1/jobs/2019-07-15_05_25_09-13150854464777168311?project=apache-beam-testing.
Found: https://console.cloud.google.com/dataflow/jobsDetail/locations/us-central1/jobs/2019-07-15_05_32_48-16224061885088342901?project=apache-beam-testing.
Found: https://console.cloud.google.com/dataflow/jobsDetail/locations/us-central1/jobs/2019-07-15_05_25_11-3713630796225370641?project=apache-beam-testing.
Found: https://console.cloud.google.com/dataflow/jobsDetail/locations/us-central1/jobs/2019-07-15_05_34_08-3311690111777729159?project=apache-beam-testing.
Found: https://console.cloud.google.com/dataflow/jobsDetail/locations/us-central1/jobs/2019-07-15_05_25_09-11535005262991119372?project=apache-beam-testing.
Found: https://console.cloud.google.com/dataflow/jobsDetail/locations/us-central1/jobs/2019-07-15_05_25_08-9773983155809139560?project=apache-beam-testing.
Found: https://console.cloud.google.com/dataflow/jobsDetail/locations/us-central1/jobs/2019-07-15_05_33_08-8123737620410479922?project=apache-beam-testing.
Found: https://console.cloud.google.com/dataflow/jobsDetail/locations/us-central1/jobs/2019-07-15_05_25_10-9676127960480553226?project=apache-beam-testing.
Found: https://console.cloud.google.com/dataflow/jobsDetail/locations/us-central1/jobs/2019-07-15_05_33_16-3587324150027820469?project=apache-beam-testing.

> Task :sdks:python:test-suites:dataflow:py37:validatesRunnerStreamingTests
Found: https://console.cloud.google.com/dataflow/jobsDetail/locations/us-central1/jobs/2019-07-15_05_27_52-15751568930405281862?project=apache-beam-testing.
Found: https://console.cloud.google.com/dataflow/jobsDetail/locations/us-central1/jobs/2019-07-15_05_37_17-14682308508754208915?project=apache-beam-testing.
Found: https://console.cloud.google.com/dataflow/jobsDetail/locations/us-central1/jobs/2019-07-15_05_27_53-7837181685418788200?project=apache-beam-testing.
Found: https://console.cloud.google.com/dataflow/jobsDetail/locations/us-central1/jobs/2019-07-15_05_37_18-12428345209879246274?project=apache-beam-testing.
Found: https://console.cloud.google.com/dataflow/jobsDetail/locations/us-central1/jobs/2019-07-15_05_27_53-15865061068351249689?project=apache-beam-testing.
Found: https://console.cloud.google.com/dataflow/jobsDetail/locations/us-central1/jobs/2019-07-15_05_27_53-6913084949794740720?project=apache-beam-testing.
Found: https://console.cloud.google.com/dataflow/jobsDetail/locations/us-central1/jobs/2019-07-15_05_36_58-8867935035972835744?project=apache-beam-testing.
Found: https://console.cloud.google.com/dataflow/jobsDetail/locations/us-central1/jobs/2019-07-15_05_27_55-2887834132153027523?project=apache-beam-testing.
Found: https://console.cloud.google.com/dataflow/jobsDetail/locations/us-central1/jobs/2019-07-15_05_37_01-10999409269477621741?project=apache-beam-testing.
Found: https://console.cloud.google.com/dataflow/jobsDetail/locations/us-central1/jobs/2019-07-15_05_27_53-12365690636200839076?project=apache-beam-testing.
Found: https://console.cloud.google.com/dataflow/jobsDetail/locations/us-central1/jobs/2019-07-15_05_37_08-12152785969074024669?project=apache-beam-testing.
Found: https://console.cloud.google.com/dataflow/jobsDetail/locations/us-central1/jobs/2019-07-15_05_27_53-539132255257590402?project=apache-beam-testing.
Found: https://console.cloud.google.com/dataflow/jobsDetail/locations/us-central1/jobs/2019-07-15_05_37_03-461189742385128855?project=apache-beam-testing.
Found: https://console.cloud.google.com/dataflow/jobsDetail/locations/us-central1/jobs/2019-07-15_05_27_53-16375431193932328417?project=apache-beam-testing.
Found: https://console.cloud.google.com/dataflow/jobsDetail/locations/us-central1/jobs/2019-07-15_05_37_04-11147386896569284034?project=apache-beam-testing.
test_par_do_with_multiple_outputs_and_using_return (apache_beam.transforms.ptransform_test.PTransformTest) ... ok
test_par_do_with_multiple_outputs_and_using_yield (apache_beam.transforms.ptransform_test.PTransformTest) ... ok
test_as_dict_twice (apache_beam.transforms.sideinputs_test.SideInputsTest) ... ok
test_as_list_and_as_dict_side_inputs (apache_beam.transforms.sideinputs_test.SideInputsTest) ... ok
test_undeclared_outputs (apache_beam.transforms.ptransform_test.PTransformTest) ... ok
test_dofn_lifecycle (apache_beam.transforms.dofn_lifecycle_test.DoFnLifecycleTest) ... ok
test_flatten_multiple_pcollections_having_multiple_consumers (apache_beam.transforms.ptransform_test.PTransformTest) ... ok
test_multiple_empty_outputs (apache_beam.transforms.ptransform_test.PTransformTest) ... ok
test_default_value_singleton_side_input (apache_beam.transforms.sideinputs_test.SideInputsTest) ... ok
test_flattened_side_input (apache_beam.transforms.sideinputs_test.SideInputsTest) ... ok
test_iterable_side_input (apache_beam.transforms.sideinputs_test.SideInputsTest) ... ok
test_as_singleton_without_unique_labels (apache_beam.transforms.sideinputs_test.SideInputsTest) ... ok
test_empty_singleton_side_input (apache_beam.transforms.sideinputs_test.SideInputsTest) ... ok
test_as_list_twice (apache_beam.transforms.sideinputs_test.SideInputsTest) ... ok
test_as_singleton_with_different_defaults (apache_beam.transforms.sideinputs_test.SideInputsTest) ... ok

----------------------------------------------------------------------
XML: <https://builds.apache.org/job/beam_PostCommit_Py_VR_Dataflow/ws/src/sdks/python/nosetests.xml>
----------------------------------------------------------------------
Ran 15 tests in 1161.435s

OK

FAILURE: Build completed with 3 failures.

1: Task failed with an exception.
-----------
* Where:
Build file '<https://builds.apache.org/job/beam_PostCommit_Py_VR_Dataflow/ws/src/sdks/python/test-suites/dataflow/py36/build.gradle'> line: 67

* What went wrong:
Execution failed for task ':sdks:python:test-suites:dataflow:py36:validatesRunnerBatchTests'.
> Process 'command 'sh'' finished with non-zero exit value 1

* Try:
Run with --stacktrace option to get the stack trace. Run with --info or --debug option to get more log output. Run with --scan to get full insights.
==============================================================================

2: Task failed with an exception.
-----------
* Where:
Build file '<https://builds.apache.org/job/beam_PostCommit_Py_VR_Dataflow/ws/src/sdks/python/test-suites/dataflow/py35/build.gradle'> line: 67

* What went wrong:
Execution failed for task ':sdks:python:test-suites:dataflow:py35:validatesRunnerBatchTests'.
> Process 'command 'sh'' finished with non-zero exit value 1

* Try:
Run with --stacktrace option to get the stack trace. Run with --info or --debug option to get more log output. Run with --scan to get full insights.
==============================================================================

3: Task failed with an exception.
-----------
* Where:
Build file '<https://builds.apache.org/job/beam_PostCommit_Py_VR_Dataflow/ws/src/sdks/python/test-suites/dataflow/py36/build.gradle'> line: 87

* What went wrong:
Execution failed for task ':sdks:python:test-suites:dataflow:py36:validatesRunnerStreamingTests'.
> Process 'command 'sh'' finished with non-zero exit value 1

* Try:
Run with --stacktrace option to get the stack trace. Run with --info or --debug option to get more log output. Run with --scan to get full insights.
==============================================================================

* Get more help at https://help.gradle.org

Deprecated Gradle features were used in this build, making it incompatible with Gradle 6.0.
Use '--warning-mode all' to show the individual deprecation warnings.
See https://docs.gradle.org/5.2.1/userguide/command_line_interface.html#sec:command_line_warnings

BUILD FAILED in 46m 53s
76 actionable tasks: 59 executed, 17 from cache

Publishing build scan...
https://gradle.com/s/5kyhx3phdg2vq

Build step 'Invoke Gradle script' changed build result to FAILURE
Build step 'Invoke Gradle script' marked build as failure

---------------------------------------------------------------------
To unsubscribe, e-mail: builds-unsubscribe@beam.apache.org
For additional commands, e-mail: builds-help@beam.apache.org


Build failed in Jenkins: beam_PostCommit_Py_VR_Dataflow #4018

Posted by Apache Jenkins Server <je...@builds.apache.org>.
See <https://builds.apache.org/job/beam_PostCommit_Py_VR_Dataflow/4018/display/redirect>

------------------------------------------
[...truncated 166.44 KB...]
> Task :sdks:python:validatesRunnerBatchTests
test_multi_valued_singleton_side_input (apache_beam.transforms.sideinputs_test.SideInputsTest) ... ok

----------------------------------------------------------------------
XML: <https://builds.apache.org/job/beam_PostCommit_Py_VR_Dataflow/ws/src/sdks/python/nosetests.xml>
----------------------------------------------------------------------
Ran 17 tests in 1344.792s

OK
Found: https://console.cloud.google.com/dataflow/jobsDetail/locations/us-central1/jobs/2019-07-14_23_01_28-10149049084641384505?project=apache-beam-testing.
Found: https://console.cloud.google.com/dataflow/jobsDetail/locations/us-central1/jobs/2019-07-14_23_08_38-12494675144501712131?project=apache-beam-testing.
Found: https://console.cloud.google.com/dataflow/jobsDetail/locations/us-central1/jobs/2019-07-14_23_16_18-11826139512530191670?project=apache-beam-testing.
Found: https://console.cloud.google.com/dataflow/jobsDetail/locations/us-central1/jobs/2019-07-14_23_01_25-16576144461738754090?project=apache-beam-testing.
Found: https://console.cloud.google.com/dataflow/jobsDetail/locations/us-central1/jobs/2019-07-14_23_08_35-7590452408303162340?project=apache-beam-testing.
Found: https://console.cloud.google.com/dataflow/jobsDetail/locations/us-central1/jobs/2019-07-14_23_01_27-12442582711912763138?project=apache-beam-testing.
Found: https://console.cloud.google.com/dataflow/jobsDetail/locations/us-central1/jobs/2019-07-14_23_10_57-15813656792419795698?project=apache-beam-testing.
Found: https://console.cloud.google.com/dataflow/jobsDetail/locations/us-central1/jobs/2019-07-14_23_01_28-4397127701779518434?project=apache-beam-testing.
Found: https://console.cloud.google.com/dataflow/jobsDetail/locations/us-central1/jobs/2019-07-14_23_09_33-17290831791020481028?project=apache-beam-testing.
Found: https://console.cloud.google.com/dataflow/jobsDetail/locations/us-central1/jobs/2019-07-14_23_01_28-11632973803556542315?project=apache-beam-testing.
Found: https://console.cloud.google.com/dataflow/jobsDetail/locations/us-central1/jobs/2019-07-14_23_11_01-2299661191449904623?project=apache-beam-testing.
Found: https://console.cloud.google.com/dataflow/jobsDetail/locations/us-central1/jobs/2019-07-14_23_01_28-18271305651783866998?project=apache-beam-testing.
Found: https://console.cloud.google.com/dataflow/jobsDetail/locations/us-central1/jobs/2019-07-14_23_09_34-16759676730103901017?project=apache-beam-testing.
Found: https://console.cloud.google.com/dataflow/jobsDetail/locations/us-central1/jobs/2019-07-14_23_01_27-4560957684686057479?project=apache-beam-testing.
Found: https://console.cloud.google.com/dataflow/jobsDetail/locations/us-central1/jobs/2019-07-14_23_09_41-13443150000539561410?project=apache-beam-testing.
Found: https://console.cloud.google.com/dataflow/jobsDetail/locations/us-central1/jobs/2019-07-14_23_01_29-2378550311809303891?project=apache-beam-testing.
Found: https://console.cloud.google.com/dataflow/jobsDetail/locations/us-central1/jobs/2019-07-14_23_09_34-3189654438669136544?project=apache-beam-testing.

> Task :sdks:python:validatesRunnerStreamingTests
>>> RUNNING integration tests with pipeline options: --runner=TestDataflowRunner --project=apache-beam-testing --staging_location=gs://temp-storage-for-end-to-end-tests/staging-it --temp_location=gs://temp-storage-for-end-to-end-tests/temp-it --output=gs://temp-storage-for-end-to-end-tests/py-it-cloud/output --sdk_location=build/apache-beam.tar.gz --requirements_file=postcommit_requirements.txt --num_workers=1 --sleep_secs=20 --streaming --dataflow_worker_jar=<https://builds.apache.org/job/beam_PostCommit_Py_VR_Dataflow/ws/src/runners/google-cloud-dataflow-java/worker/build/libs/beam-runners-google-cloud-dataflow-java-fn-api-worker-2.15.0-SNAPSHOT.jar> --kms_key_name=projects/apache-beam-testing/locations/global/keyRings/beam-it/cryptoKeys/test --dataflow_kms_key=projects/apache-beam-testing/locations/global/keyRings/beam-it/cryptoKeys/test
>>>   test options: --nocapture --processes=8 --process-timeout=4500 --attr=ValidatesRunner,!sickbay-streaming
<https://builds.apache.org/job/beam_PostCommit_Py_VR_Dataflow/ws/src/build/gradleenv/1922375555/local/lib/python2.7/site-packages/setuptools/dist.py>:472: UserWarning: Normalizing '2.15.0.dev' to '2.15.0.dev0'
  normalized_version,
running nosetests
running egg_info
writing requirements to apache_beam.egg-info/requires.txt
writing apache_beam.egg-info/PKG-INFO
writing top-level names to apache_beam.egg-info/top_level.txt
writing dependency_links to apache_beam.egg-info/dependency_links.txt
writing entry points to apache_beam.egg-info/entry_points.txt
reading manifest file 'apache_beam.egg-info/SOURCES.txt'
reading manifest template 'MANIFEST.in'
warning: no files found matching 'README.md'
warning: no files found matching 'NOTICE'
warning: no files found matching 'LICENSE'
writing manifest file 'apache_beam.egg-info/SOURCES.txt'

> Task :sdks:python:test-suites:dataflow:py37:validatesRunnerBatchTests
Found: https://console.cloud.google.com/dataflow/jobsDetail/locations/us-central1/jobs/2019-07-14_23_01_26-17438188586436928222?project=apache-beam-testing.
Found: https://console.cloud.google.com/dataflow/jobsDetail/locations/us-central1/jobs/2019-07-14_23_09_32-17759282690270130747?project=apache-beam-testing.
Found: https://console.cloud.google.com/dataflow/jobsDetail/locations/us-central1/jobs/2019-07-14_23_01_27-5783121953813118973?project=apache-beam-testing.
Found: https://console.cloud.google.com/dataflow/jobsDetail/locations/us-central1/jobs/2019-07-14_23_11_14-12998367001617241731?project=apache-beam-testing.
Found: https://console.cloud.google.com/dataflow/jobsDetail/locations/us-central1/jobs/2019-07-14_23_01_28-4067165764499285473?project=apache-beam-testing.
Found: https://console.cloud.google.com/dataflow/jobsDetail/locations/us-central1/jobs/2019-07-14_23_11_02-6882113335055588990?project=apache-beam-testing.
Found: https://console.cloud.google.com/dataflow/jobsDetail/locations/us-central1/jobs/2019-07-14_23_01_27-2268813078922613935?project=apache-beam-testing.
Found: https://console.cloud.google.com/dataflow/jobsDetail/locations/us-central1/jobs/2019-07-14_23_10_23-1880908031700760967?project=apache-beam-testing.
Found: https://console.cloud.google.com/dataflow/jobsDetail/locations/us-central1/jobs/2019-07-14_23_01_28-7607395361062607311?project=apache-beam-testing.
Found: https://console.cloud.google.com/dataflow/jobsDetail/locations/us-central1/jobs/2019-07-14_23_11_28-15570045299987147461?project=apache-beam-testing.
Found: https://console.cloud.google.com/dataflow/jobsDetail/locations/us-central1/jobs/2019-07-14_23_01_25-10969200444409331718?project=apache-beam-testing.
Found: https://console.cloud.google.com/dataflow/jobsDetail/locations/us-central1/jobs/2019-07-14_23_11_00-4978155453139653224?project=apache-beam-testing.
Found: https://console.cloud.google.com/dataflow/jobsDetail/locations/us-central1/jobs/2019-07-14_23_19_05-6979746520444781614?project=apache-beam-testing.
Found: https://console.cloud.google.com/dataflow/jobsDetail/locations/us-central1/jobs/2019-07-14_23_01_27-1715393220526800364?project=apache-beam-testing.
Found: https://console.cloud.google.com/dataflow/jobsDetail/locations/us-central1/jobs/2019-07-14_23_11_27-12652614528601854812?project=apache-beam-testing.
Found: https://console.cloud.google.com/dataflow/jobsDetail/locations/us-central1/jobs/2019-07-14_23_01_27-3328086437061930651?project=apache-beam-testing.
Found: https://console.cloud.google.com/dataflow/jobsDetail/locations/us-central1/jobs/2019-07-14_23_09_27-13572593598775386301?project=apache-beam-testing.
test_as_dict_twice (apache_beam.transforms.sideinputs_test.SideInputsTest) ... ok
test_dofn_lifecycle (apache_beam.transforms.dofn_lifecycle_test.DoFnLifecycleTest) ... ok
test_par_do_with_multiple_outputs_and_using_return (apache_beam.transforms.ptransform_test.PTransformTest) ... ok
test_read_metrics (apache_beam.transforms.ptransform_test.PTransformTest) ... ok
test_multiple_empty_outputs (apache_beam.transforms.ptransform_test.PTransformTest) ... ok
test_flatten_multiple_pcollections_having_multiple_consumers (apache_beam.transforms.ptransform_test.PTransformTest) ... ok
test_undeclared_outputs (apache_beam.transforms.ptransform_test.PTransformTest) ... ok
test_par_do_with_multiple_outputs_and_using_yield (apache_beam.transforms.ptransform_test.PTransformTest) ... ok
test_as_singleton_without_unique_labels (apache_beam.transforms.sideinputs_test.SideInputsTest) ... ok
test_as_singleton_with_different_defaults (apache_beam.transforms.sideinputs_test.SideInputsTest) ... ok
test_as_list_and_as_dict_side_inputs (apache_beam.transforms.sideinputs_test.SideInputsTest) ... ok
test_default_value_singleton_side_input (apache_beam.transforms.sideinputs_test.SideInputsTest) ... ok
test_as_list_twice (apache_beam.transforms.sideinputs_test.SideInputsTest) ... ok
test_flattened_side_input (apache_beam.transforms.sideinputs_test.SideInputsTest) ... ok
test_iterable_side_input (apache_beam.transforms.sideinputs_test.SideInputsTest) ... ok
test_empty_singleton_side_input (apache_beam.transforms.sideinputs_test.SideInputsTest) ... ok
test_multi_valued_singleton_side_input (apache_beam.transforms.sideinputs_test.SideInputsTest) ... ok

----------------------------------------------------------------------
XML: <https://builds.apache.org/job/beam_PostCommit_Py_VR_Dataflow/ws/src/sdks/python/nosetests.xml>
----------------------------------------------------------------------
Ran 17 tests in 1673.097s

OK

> Task :sdks:python:test-suites:dataflow:py37:validatesRunnerStreamingTests
>>> RUNNING integration tests with pipeline options: --runner=TestDataflowRunner --project=apache-beam-testing --staging_location=gs://temp-storage-for-end-to-end-tests/staging-it --temp_location=gs://temp-storage-for-end-to-end-tests/temp-it --output=gs://temp-storage-for-end-to-end-tests/py-it-cloud/output --sdk_location=<https://builds.apache.org/job/beam_PostCommit_Py_VR_Dataflow/ws/src/sdks/python/test-suites/dataflow/py37/build/apache-beam.tar.gz> --requirements_file=postcommit_requirements.txt --num_workers=1 --sleep_secs=20 --streaming --dataflow_worker_jar=<https://builds.apache.org/job/beam_PostCommit_Py_VR_Dataflow/ws/src/runners/google-cloud-dataflow-java/worker/build/libs/beam-runners-google-cloud-dataflow-java-fn-api-worker-2.15.0-SNAPSHOT.jar> --kms_key_name=projects/apache-beam-testing/locations/global/keyRings/beam-it/cryptoKeys/test --dataflow_kms_key=projects/apache-beam-testing/locations/global/keyRings/beam-it/cryptoKeys/test
>>>   test options: --nocapture --processes=8 --process-timeout=4500 --attr=ValidatesRunner,!sickbay-streaming
running nosetests
running egg_info
writing apache_beam.egg-info/PKG-INFO
writing dependency_links to apache_beam.egg-info/dependency_links.txt
writing entry points to apache_beam.egg-info/entry_points.txt
writing requirements to apache_beam.egg-info/requires.txt
writing top-level names to apache_beam.egg-info/top_level.txt
reading manifest file 'apache_beam.egg-info/SOURCES.txt'
reading manifest template 'MANIFEST.in'
setup.py:177: UserWarning: Some syntactic constructs of Python 3 are not yet fully supported by Apache Beam.
  'Some syntactic constructs of Python 3 are not yet fully supported by '
<https://builds.apache.org/job/beam_PostCommit_Py_VR_Dataflow/ws/src/build/gradleenv/-1734967052/lib/python3.7/site-packages/setuptools/dist.py>:472: UserWarning: Normalizing '2.15.0.dev' to '2.15.0.dev0'
  normalized_version,
warning: no files found matching 'README.md'
warning: no files found matching 'NOTICE'
warning: no files found matching 'LICENSE'
writing manifest file 'apache_beam.egg-info/SOURCES.txt'
<https://builds.apache.org/job/beam_PostCommit_Py_VR_Dataflow/ws/src/sdks/python/apache_beam/__init__.py>:84: UserWarning: Some syntactic constructs of Python 3 are not yet fully supported by Apache Beam.
  'Some syntactic constructs of Python 3 are not yet fully supported by '
<https://builds.apache.org/job/beam_PostCommit_Py_VR_Dataflow/ws/src/sdks/python/apache_beam/io/gcp/datastore/v1/datastoreio.py>:59: UserWarning: Datastore IO will support Python 3 after replacing googledatastore by google-cloud-datastore, see: BEAM-4543.
  warnings.warn('Datastore IO will support Python 3 after replacing '
<https://builds.apache.org/job/beam_PostCommit_Py_VR_Dataflow/ws/src/sdks/python/apache_beam/io/vcfio.py>:47: UserWarning: VCF IO will support Python 3 after migration to Nucleus, see: BEAM-5628.
  warnings.warn("VCF IO will support Python 3 after migration to Nucleus, "

> Task :sdks:python:validatesRunnerStreamingTests
test_dofn_lifecycle (apache_beam.transforms.dofn_lifecycle_test.DoFnLifecycleTest) ... ok
test_multiple_empty_outputs (apache_beam.transforms.ptransform_test.PTransformTest) ... ok
test_as_dict_twice (apache_beam.transforms.sideinputs_test.SideInputsTest) ... ok
test_par_do_with_multiple_outputs_and_using_return (apache_beam.transforms.ptransform_test.PTransformTest) ... ok
test_undeclared_outputs (apache_beam.transforms.ptransform_test.PTransformTest) ... ok
test_par_do_with_multiple_outputs_and_using_yield (apache_beam.transforms.ptransform_test.PTransformTest) ... ok
test_as_list_and_as_dict_side_inputs (apache_beam.transforms.sideinputs_test.SideInputsTest) ... ok
test_flatten_multiple_pcollections_having_multiple_consumers (apache_beam.transforms.ptransform_test.PTransformTest) ... ok
test_as_list_twice (apache_beam.transforms.sideinputs_test.SideInputsTest) ... ok
test_as_singleton_with_different_defaults (apache_beam.transforms.sideinputs_test.SideInputsTest) ... ok
test_empty_singleton_side_input (apache_beam.transforms.sideinputs_test.SideInputsTest) ... ok
test_iterable_side_input (apache_beam.transforms.sideinputs_test.SideInputsTest) ... ok
test_default_value_singleton_side_input (apache_beam.transforms.sideinputs_test.SideInputsTest) ... ok
test_as_singleton_without_unique_labels (apache_beam.transforms.sideinputs_test.SideInputsTest) ... ok
test_flattened_side_input (apache_beam.transforms.sideinputs_test.SideInputsTest) ... ok

----------------------------------------------------------------------
XML: <https://builds.apache.org/job/beam_PostCommit_Py_VR_Dataflow/ws/src/sdks/python/nosetests.xml>
----------------------------------------------------------------------
Ran 15 tests in 1038.092s

OK
Found: https://console.cloud.google.com/dataflow/jobsDetail/locations/us-central1/jobs/2019-07-14_23_23_47-11153928153763131353?project=apache-beam-testing.
Found: https://console.cloud.google.com/dataflow/jobsDetail/locations/us-central1/jobs/2019-07-14_23_23_46-7047032483908420331?project=apache-beam-testing.
Found: https://console.cloud.google.com/dataflow/jobsDetail/locations/us-central1/jobs/2019-07-14_23_31_20-10516001840846778357?project=apache-beam-testing.
Found: https://console.cloud.google.com/dataflow/jobsDetail/locations/us-central1/jobs/2019-07-14_23_23_47-4978155453139656106?project=apache-beam-testing.
Found: https://console.cloud.google.com/dataflow/jobsDetail/locations/us-central1/jobs/2019-07-14_23_31_22-11889051986872741836?project=apache-beam-testing.
Found: https://console.cloud.google.com/dataflow/jobsDetail/locations/us-central1/jobs/2019-07-14_23_23_47-2283444807124387987?project=apache-beam-testing.
Found: https://console.cloud.google.com/dataflow/jobsDetail/locations/us-central1/jobs/2019-07-14_23_32_17-12718056756569059827?project=apache-beam-testing.
Found: https://console.cloud.google.com/dataflow/jobsDetail/locations/us-central1/jobs/2019-07-14_23_23_46-3079144754630455531?project=apache-beam-testing.
Found: https://console.cloud.google.com/dataflow/jobsDetail/locations/us-central1/jobs/2019-07-14_23_31_31-608663736791372982?project=apache-beam-testing.
Found: https://console.cloud.google.com/dataflow/jobsDetail/locations/us-central1/jobs/2019-07-14_23_23_47-12938405019155884382?project=apache-beam-testing.
Found: https://console.cloud.google.com/dataflow/jobsDetail/locations/us-central1/jobs/2019-07-14_23_31_41-12086034244170455275?project=apache-beam-testing.
Found: https://console.cloud.google.com/dataflow/jobsDetail/locations/us-central1/jobs/2019-07-14_23_23_46-7126212196954089180?project=apache-beam-testing.
Found: https://console.cloud.google.com/dataflow/jobsDetail/locations/us-central1/jobs/2019-07-14_23_32_21-2884050031770764798?project=apache-beam-testing.
Found: https://console.cloud.google.com/dataflow/jobsDetail/locations/us-central1/jobs/2019-07-14_23_23_47-9956252071826770124?project=apache-beam-testing.
Found: https://console.cloud.google.com/dataflow/jobsDetail/locations/us-central1/jobs/2019-07-14_23_31_41-13031907249172129448?project=apache-beam-testing.

> Task :sdks:python:test-suites:dataflow:py37:validatesRunnerStreamingTests
Found: https://console.cloud.google.com/dataflow/jobsDetail/locations/us-central1/jobs/2019-07-14_23_29_14-14377263729241448137?project=apache-beam-testing.
Found: https://console.cloud.google.com/dataflow/jobsDetail/locations/us-central1/jobs/2019-07-14_23_37_09-13860764739391235158?project=apache-beam-testing.
Found: https://console.cloud.google.com/dataflow/jobsDetail/locations/us-central1/jobs/2019-07-14_23_29_15-11691510371840273651?project=apache-beam-testing.
Found: https://console.cloud.google.com/dataflow/jobsDetail/locations/us-central1/jobs/2019-07-14_23_38_26-2678918227624250068?project=apache-beam-testing.
Found: https://console.cloud.google.com/dataflow/jobsDetail/locations/us-central1/jobs/2019-07-14_23_29_15-8091025878599335463?project=apache-beam-testing.
Found: https://console.cloud.google.com/dataflow/jobsDetail/locations/us-central1/jobs/2019-07-14_23_38_00-2987711105246785406?project=apache-beam-testing.
Found: https://console.cloud.google.com/dataflow/jobsDetail/locations/us-central1/jobs/2019-07-14_23_29_15-5734485823131277399?project=apache-beam-testing.
Found: https://console.cloud.google.com/dataflow/jobsDetail/locations/us-central1/jobs/2019-07-14_23_38_26-4393472297487497831?project=apache-beam-testing.
Found: https://console.cloud.google.com/dataflow/jobsDetail/locations/us-central1/jobs/2019-07-14_23_29_15-7653892484386371080?project=apache-beam-testing.
Found: https://console.cloud.google.com/dataflow/jobsDetail/locations/us-central1/jobs/2019-07-14_23_38_06-16386583717343096085?project=apache-beam-testing.
Found: https://console.cloud.google.com/dataflow/jobsDetail/locations/us-central1/jobs/2019-07-14_23_29_16-13450421026133017057?project=apache-beam-testing.
Found: https://console.cloud.google.com/dataflow/jobsDetail/locations/us-central1/jobs/2019-07-14_23_29_15-4309734816307206289?project=apache-beam-testing.
Found: https://console.cloud.google.com/dataflow/jobsDetail/locations/us-central1/jobs/2019-07-14_23_37_35-15850423723771051373?project=apache-beam-testing.
Found: https://console.cloud.google.com/dataflow/jobsDetail/locations/us-central1/jobs/2019-07-14_23_29_15-14843813739297839242?project=apache-beam-testing.
Found: https://console.cloud.google.com/dataflow/jobsDetail/locations/us-central1/jobs/2019-07-14_23_38_31-6752551822175840181?project=apache-beam-testing.
test_dofn_lifecycle (apache_beam.transforms.dofn_lifecycle_test.DoFnLifecycleTest) ... ok
test_as_dict_twice (apache_beam.transforms.sideinputs_test.SideInputsTest) ... ok
test_multiple_empty_outputs (apache_beam.transforms.ptransform_test.PTransformTest) ... ok
test_par_do_with_multiple_outputs_and_using_yield (apache_beam.transforms.ptransform_test.PTransformTest) ... ok
test_par_do_with_multiple_outputs_and_using_return (apache_beam.transforms.ptransform_test.PTransformTest) ... ok
test_flatten_multiple_pcollections_having_multiple_consumers (apache_beam.transforms.ptransform_test.PTransformTest) ... ok
test_as_list_and_as_dict_side_inputs (apache_beam.transforms.sideinputs_test.SideInputsTest) ... ok
test_undeclared_outputs (apache_beam.transforms.ptransform_test.PTransformTest) ... ok
test_as_list_twice (apache_beam.transforms.sideinputs_test.SideInputsTest) ... ok
test_as_singleton_with_different_defaults (apache_beam.transforms.sideinputs_test.SideInputsTest) ... ok
test_as_singleton_without_unique_labels (apache_beam.transforms.sideinputs_test.SideInputsTest) ... ok
test_default_value_singleton_side_input (apache_beam.transforms.sideinputs_test.SideInputsTest) ... ok
test_empty_singleton_side_input (apache_beam.transforms.sideinputs_test.SideInputsTest) ... ok
test_iterable_side_input (apache_beam.transforms.sideinputs_test.SideInputsTest) ... ok
test_flattened_side_input (apache_beam.transforms.sideinputs_test.SideInputsTest) ... ok

----------------------------------------------------------------------
XML: <https://builds.apache.org/job/beam_PostCommit_Py_VR_Dataflow/ws/src/sdks/python/nosetests.xml>
----------------------------------------------------------------------
Ran 15 tests in 1119.771s

OK

FAILURE: Build completed with 3 failures.

1: Task failed with an exception.
-----------
* Where:
Build file '<https://builds.apache.org/job/beam_PostCommit_Py_VR_Dataflow/ws/src/sdks/python/test-suites/dataflow/py36/build.gradle'> line: 67

* What went wrong:
Execution failed for task ':sdks:python:test-suites:dataflow:py36:validatesRunnerBatchTests'.
> Process 'command 'sh'' finished with non-zero exit value 1

* Try:
Run with --stacktrace option to get the stack trace. Run with --info or --debug option to get more log output. Run with --scan to get full insights.
==============================================================================

2: Task failed with an exception.
-----------
* Where:
Build file '<https://builds.apache.org/job/beam_PostCommit_Py_VR_Dataflow/ws/src/sdks/python/test-suites/dataflow/py35/build.gradle'> line: 67

* What went wrong:
Execution failed for task ':sdks:python:test-suites:dataflow:py35:validatesRunnerBatchTests'.
> Process 'command 'sh'' finished with non-zero exit value 1

* Try:
Run with --stacktrace option to get the stack trace. Run with --info or --debug option to get more log output. Run with --scan to get full insights.
==============================================================================

3: Task failed with an exception.
-----------
* Where:
Build file '<https://builds.apache.org/job/beam_PostCommit_Py_VR_Dataflow/ws/src/sdks/python/test-suites/dataflow/py36/build.gradle'> line: 87

* What went wrong:
Execution failed for task ':sdks:python:test-suites:dataflow:py36:validatesRunnerStreamingTests'.
> Process 'command 'sh'' finished with non-zero exit value 1

* Try:
Run with --stacktrace option to get the stack trace. Run with --info or --debug option to get more log output. Run with --scan to get full insights.
==============================================================================

* Get more help at https://help.gradle.org

Deprecated Gradle features were used in this build, making it incompatible with Gradle 6.0.
Use '--warning-mode all' to show the individual deprecation warnings.
See https://docs.gradle.org/5.2.1/userguide/command_line_interface.html#sec:command_line_warnings

BUILD FAILED in 47m 34s
76 actionable tasks: 59 executed, 17 from cache

Publishing build scan...
https://gradle.com/s/b2mktrmyiuvkg

Build step 'Invoke Gradle script' changed build result to FAILURE
Build step 'Invoke Gradle script' marked build as failure

---------------------------------------------------------------------
To unsubscribe, e-mail: builds-unsubscribe@beam.apache.org
For additional commands, e-mail: builds-help@beam.apache.org


Build failed in Jenkins: beam_PostCommit_Py_VR_Dataflow #4017

Posted by Apache Jenkins Server <je...@builds.apache.org>.
See <https://builds.apache.org/job/beam_PostCommit_Py_VR_Dataflow/4017/display/redirect>

------------------------------------------
[...truncated 251.24 KB...]
            "key": "fn", 
            "label": "Transform Function", 
            "namespace": "apache_beam.transforms.core.ParDo", 
            "shortValue": "CallableWrapperDoFn", 
            "type": "STRING", 
            "value": "apache_beam.transforms.core.CallableWrapperDoFn"
          }
        ], 
        "non_parallel_inputs": {}, 
        "output_info": [
          {
            "encoding": {
              "@type": "kind:windowed_value", 
              "component_encodings": [
                {
                  "@type": "kind:pair", 
                  "component_encodings": [
                    {
                      "@type": "kind:bytes"
                    }, 
                    {
                      "@type": "kind:pair", 
                      "component_encodings": [
                        {
                          "@type": "kind:bytes"
                        }, 
                        {
                          "@type": "kind:varint"
                        }
                      ], 
                      "is_pair_like": true
                    }
                  ], 
                  "is_pair_like": true
                }, 
                {
                  "@type": "kind:global_window"
                }
              ], 
              "is_wrapper": true
            }, 
            "output_name": "out", 
            "user_name": "Map(<lambda at sideinputs_test.py:283>)/MapToVoidKey1.out"
          }
        ], 
        "parallel_input": {
          "@type": "OutputReference", 
          "output_name": "out", 
          "step_name": "s4"
        }, 
        "serialized_fn": "ref_AppliedPTransform_Map(<lambda at sideinputs_test.py:283>)/MapToVoidKey1_24", 
        "user_name": "Map(<lambda at sideinputs_test.py:283>)/MapToVoidKey1"
      }
    }
  ], 
  "type": "JOB_TYPE_STREAMING"
}
root: INFO: Create job: <Job
 createTime: u'2019-07-15T00:22:05.148419Z'
 currentStateTime: u'1970-01-01T00:00:00Z'
 id: u'2019-07-14_17_22_03-1101551641865835493'
 location: u'us-central1'
 name: u'beamapp-jenkins-0715002155-608886'
 projectId: u'apache-beam-testing'
 stageStates: []
 startTime: u'2019-07-15T00:22:05.148419Z'
 steps: []
 tempFiles: []
 type: TypeValueValuesEnum(JOB_TYPE_STREAMING, 2)>
root: INFO: Created job with id: [2019-07-14_17_22_03-1101551641865835493]
root: INFO: To access the Dataflow monitoring console, please navigate to https://console.cloud.google.com/dataflow/jobsDetail/locations/us-central1/jobs/2019-07-14_17_22_03-1101551641865835493?project=apache-beam-testing
root: WARNING: Waiting indefinitely for streaming job.
root: INFO: Job 2019-07-14_17_22_03-1101551641865835493 is in state JOB_STATE_RUNNING
root: INFO: 2019-07-15T00:22:07.939Z: JOB_MESSAGE_DETAILED: Checking permissions granted to controller Service Account.
root: INFO: 2019-07-15T00:22:08.586Z: JOB_MESSAGE_BASIC: Worker configuration: n1-standard-4 in us-central1-a.
root: INFO: 2019-07-15T00:22:09.103Z: JOB_MESSAGE_DETAILED: Expanding SplittableParDo operations into optimizable parts.
root: INFO: 2019-07-15T00:22:09.106Z: JOB_MESSAGE_DETAILED: Expanding CollectionToSingleton operations into optimizable parts.
root: INFO: 2019-07-15T00:22:09.116Z: JOB_MESSAGE_DETAILED: Expanding CoGroupByKey operations into optimizable parts.
root: INFO: 2019-07-15T00:22:09.125Z: JOB_MESSAGE_DEBUG: Combiner lifting skipped for step Map(<lambda at sideinputs_test.py:283>)/_UnpickledSideInput(MapToVoidKey1.out.0)/GroupByKey: GroupByKey not followed by a combiner.
root: INFO: 2019-07-15T00:22:09.130Z: JOB_MESSAGE_DEBUG: Combiner lifting skipped for step Map(<lambda at sideinputs_test.py:283>)/_UnpickledSideInput(MapToVoidKey0.out.0)/GroupByKey: GroupByKey not followed by a combiner.
root: INFO: 2019-07-15T00:22:09.134Z: JOB_MESSAGE_DETAILED: Expanding SplittableProcessKeyed operations into optimizable parts.
root: INFO: 2019-07-15T00:22:09.139Z: JOB_MESSAGE_DETAILED: Expanding GroupByKey operations into streaming Read/Write steps
root: INFO: 2019-07-15T00:22:09.157Z: JOB_MESSAGE_DEBUG: Annotating graph with Autotuner information.
root: INFO: 2019-07-15T00:22:09.182Z: JOB_MESSAGE_DETAILED: Fusing adjacent ParDo, Read, Write, and Flatten operations
root: INFO: 2019-07-15T00:22:09.187Z: JOB_MESSAGE_DETAILED: Fusing consumer Map(<lambda at sideinputs_test.py:283>)/MapToVoidKey0 into side kvs/Decode Values
root: INFO: 2019-07-15T00:22:09.189Z: JOB_MESSAGE_DETAILED: Fusing consumer Map(<lambda at sideinputs_test.py:283>)/MapToVoidKey1 into side kvs/Decode Values
root: INFO: 2019-07-15T00:22:09.192Z: JOB_MESSAGE_DETAILED: Fusing consumer Map(<lambda at sideinputs_test.py:283>)/MapToVoidKey0 into side kvs/Decode Values
root: INFO: 2019-07-15T00:22:09.195Z: JOB_MESSAGE_DETAILED: Fusing consumer Map(<lambda at sideinputs_test.py:283>)/MapToVoidKey1 into side kvs/Decode Values
root: INFO: 2019-07-15T00:22:09.197Z: JOB_MESSAGE_DETAILED: Unzipping flatten s16 for input s14.out
root: INFO: 2019-07-15T00:22:09.200Z: JOB_MESSAGE_DETAILED: Fusing unzipped copy of assert_that/Group/GroupByKey/WriteStream, through flatten assert_that/Group/Flatten, into producer assert_that/Group/pair_with_0
root: INFO: 2019-07-15T00:22:09.202Z: JOB_MESSAGE_DETAILED: Fusing consumer assert_that/Group/GroupByKey/WriteStream into assert_that/Group/pair_with_1
root: INFO: 2019-07-15T00:22:09.205Z: JOB_MESSAGE_DETAILED: Fusing consumer Map(<lambda at sideinputs_test.py:283>)/_UnpickledSideInput(MapToVoidKey0.out.0)/StreamingPCollectionViewWriter into Map(<lambda at sideinputs_test.py:283>)/_UnpickledSideInput(MapToVoidKey0.out.0)/Values
root: INFO: 2019-07-15T00:22:09.208Z: JOB_MESSAGE_DETAILED: Fusing consumer main input/Decode Values into main input/Impulse
root: INFO: 2019-07-15T00:22:09.211Z: JOB_MESSAGE_DETAILED: Fusing consumer assert_that/Match into assert_that/Unkey
root: INFO: 2019-07-15T00:22:09.214Z: JOB_MESSAGE_DETAILED: Fusing consumer Map(<lambda at sideinputs_test.py:283>)/_UnpickledSideInput(MapToVoidKey0.out.0)/PairWithVoidKey into Map(<lambda at sideinputs_test.py:283>)/MapToVoidKey0
root: INFO: 2019-07-15T00:22:09.217Z: JOB_MESSAGE_DETAILED: Fusing consumer Map(<lambda at sideinputs_test.py:283>)/_UnpickledSideInput(MapToVoidKey1.out.0)/StreamingPCollectionViewWriter into Map(<lambda at sideinputs_test.py:283>)/_UnpickledSideInput(MapToVoidKey1.out.0)/Values
root: INFO: 2019-07-15T00:22:09.220Z: JOB_MESSAGE_DETAILED: Fusing consumer assert_that/Group/Map(_merge_tagged_vals_under_key) into assert_that/Group/GroupByKey/MergeBuckets
root: INFO: 2019-07-15T00:22:09.223Z: JOB_MESSAGE_DETAILED: Fusing consumer assert_that/Unkey into assert_that/Group/Map(_merge_tagged_vals_under_key)
root: INFO: 2019-07-15T00:22:09.227Z: JOB_MESSAGE_DETAILED: Fusing consumer assert_that/Group/GroupByKey/MergeBuckets into assert_that/Group/GroupByKey/ReadStream
root: INFO: 2019-07-15T00:22:09.230Z: JOB_MESSAGE_DETAILED: Fusing consumer Map(<lambda at sideinputs_test.py:283>)/_UnpickledSideInput(MapToVoidKey1.out.0)/Values into Map(<lambda at sideinputs_test.py:283>)/_UnpickledSideInput(MapToVoidKey1.out.0)/GroupByKey/MergeBuckets
root: INFO: 2019-07-15T00:22:09.232Z: JOB_MESSAGE_DETAILED: Fusing consumer assert_that/Group/pair_with_1 into assert_that/ToVoidKey
root: INFO: 2019-07-15T00:22:09.235Z: JOB_MESSAGE_DETAILED: Fusing consumer assert_that/ToVoidKey into assert_that/WindowInto(WindowIntoFn)
root: INFO: 2019-07-15T00:22:09.237Z: JOB_MESSAGE_DETAILED: Fusing consumer assert_that/WindowInto(WindowIntoFn) into Map(<lambda at sideinputs_test.py:283>)/Map(<lambda at sideinputs_test.py:283>)
root: INFO: 2019-07-15T00:22:09.240Z: JOB_MESSAGE_DETAILED: Fusing consumer Map(<lambda at sideinputs_test.py:283>)/Map(<lambda at sideinputs_test.py:283>) into main input/Decode Values
root: INFO: 2019-07-15T00:22:09.244Z: JOB_MESSAGE_DETAILED: Fusing consumer assert_that/Group/pair_with_0 into assert_that/Create/Decode Values
root: INFO: 2019-07-15T00:22:09.248Z: JOB_MESSAGE_DETAILED: Fusing consumer assert_that/Create/Decode Values into assert_that/Create/Impulse
root: INFO: 2019-07-15T00:22:09.250Z: JOB_MESSAGE_DETAILED: Fusing consumer Map(<lambda at sideinputs_test.py:283>)/_UnpickledSideInput(MapToVoidKey0.out.0)/Values into Map(<lambda at sideinputs_test.py:283>)/_UnpickledSideInput(MapToVoidKey0.out.0)/GroupByKey/MergeBuckets
root: INFO: 2019-07-15T00:22:09.252Z: JOB_MESSAGE_DETAILED: Fusing consumer side kvs/Decode Values into side kvs/Impulse
root: INFO: 2019-07-15T00:22:09.255Z: JOB_MESSAGE_DETAILED: Fusing consumer Map(<lambda at sideinputs_test.py:283>)/_UnpickledSideInput(MapToVoidKey0.out.0)/GroupByKey/MergeBuckets into Map(<lambda at sideinputs_test.py:283>)/_UnpickledSideInput(MapToVoidKey0.out.0)/GroupByKey/ReadStream
root: INFO: 2019-07-15T00:22:09.257Z: JOB_MESSAGE_DETAILED: Fusing consumer Map(<lambda at sideinputs_test.py:283>)/_UnpickledSideInput(MapToVoidKey1.out.0)/GroupByKey/WriteStream into Map(<lambda at sideinputs_test.py:283>)/_UnpickledSideInput(MapToVoidKey1.out.0)/PairWithVoidKey
root: INFO: 2019-07-15T00:22:09.260Z: JOB_MESSAGE_DETAILED: Fusing consumer Map(<lambda at sideinputs_test.py:283>)/_UnpickledSideInput(MapToVoidKey1.out.0)/GroupByKey/MergeBuckets into Map(<lambda at sideinputs_test.py:283>)/_UnpickledSideInput(MapToVoidKey1.out.0)/GroupByKey/ReadStream
root: INFO: 2019-07-15T00:22:09.262Z: JOB_MESSAGE_DETAILED: Fusing consumer Map(<lambda at sideinputs_test.py:283>)/_UnpickledSideInput(MapToVoidKey1.out.0)/PairWithVoidKey into Map(<lambda at sideinputs_test.py:283>)/MapToVoidKey1
root: INFO: 2019-07-15T00:22:09.264Z: JOB_MESSAGE_DETAILED: Fusing consumer Map(<lambda at sideinputs_test.py:283>)/_UnpickledSideInput(MapToVoidKey0.out.0)/GroupByKey/WriteStream into Map(<lambda at sideinputs_test.py:283>)/_UnpickledSideInput(MapToVoidKey0.out.0)/PairWithVoidKey
root: INFO: 2019-07-15T00:22:09.279Z: JOB_MESSAGE_DEBUG: Adding StepResource setup and teardown to workflow graph.
root: INFO: 2019-07-15T00:22:09.322Z: JOB_MESSAGE_DEBUG: Adding workflow start and stop steps.
root: INFO: 2019-07-15T00:22:09.373Z: JOB_MESSAGE_DEBUG: Assigning stage ids.
root: INFO: 2019-07-15T00:22:09.580Z: JOB_MESSAGE_DEBUG: Executing wait step start2
root: INFO: 2019-07-15T00:22:09.596Z: JOB_MESSAGE_DEBUG: Starting worker pool setup.
root: INFO: 2019-07-15T00:22:09.602Z: JOB_MESSAGE_BASIC: Starting 1 workers...
root: INFO: 2019-07-15T00:22:13.201Z: JOB_MESSAGE_BASIC: Executing operation Map(<lambda at sideinputs_test.py:283>)/_UnpickledSideInput(MapToVoidKey0.out.0)/GroupByKey/ReadStream+Map(<lambda at sideinputs_test.py:283>)/_UnpickledSideInput(MapToVoidKey0.out.0)/GroupByKey/MergeBuckets+Map(<lambda at sideinputs_test.py:283>)/_UnpickledSideInput(MapToVoidKey0.out.0)/Values+Map(<lambda at sideinputs_test.py:283>)/_UnpickledSideInput(MapToVoidKey0.out.0)/StreamingPCollectionViewWriter
root: INFO: 2019-07-15T00:22:13.204Z: JOB_MESSAGE_BASIC: Executing operation assert_that/Create/Impulse+assert_that/Create/Decode Values+assert_that/Group/pair_with_0+assert_that/Group/GroupByKey/WriteStream
root: INFO: 2019-07-15T00:22:13.204Z: JOB_MESSAGE_BASIC: Executing operation assert_that/Group/GroupByKey/ReadStream+assert_that/Group/GroupByKey/MergeBuckets+assert_that/Group/Map(_merge_tagged_vals_under_key)+assert_that/Unkey+assert_that/Match
root: INFO: 2019-07-15T00:22:13.204Z: JOB_MESSAGE_BASIC: Executing operation Map(<lambda at sideinputs_test.py:283>)/_UnpickledSideInput(MapToVoidKey1.out.0)/GroupByKey/ReadStream+Map(<lambda at sideinputs_test.py:283>)/_UnpickledSideInput(MapToVoidKey1.out.0)/GroupByKey/MergeBuckets+Map(<lambda at sideinputs_test.py:283>)/_UnpickledSideInput(MapToVoidKey1.out.0)/Values+Map(<lambda at sideinputs_test.py:283>)/_UnpickledSideInput(MapToVoidKey1.out.0)/StreamingPCollectionViewWriter
root: INFO: 2019-07-15T00:22:13.206Z: JOB_MESSAGE_BASIC: Executing operation main input/Impulse+main input/Decode Values+Map(<lambda at sideinputs_test.py:283>)/Map(<lambda at sideinputs_test.py:283>)+assert_that/WindowInto(WindowIntoFn)+assert_that/ToVoidKey+assert_that/Group/pair_with_1+assert_that/Group/GroupByKey/WriteStream
root: INFO: 2019-07-15T00:22:13.223Z: JOB_MESSAGE_BASIC: Executing operation side kvs/Impulse+side kvs/Decode Values+Map(<lambda at sideinputs_test.py:283>)/MapToVoidKey0+Map(<lambda at sideinputs_test.py:283>)/MapToVoidKey1+Map(<lambda at sideinputs_test.py:283>)/MapToVoidKey0+Map(<lambda at sideinputs_test.py:283>)/MapToVoidKey1+Map(<lambda at sideinputs_test.py:283>)/_UnpickledSideInput(MapToVoidKey0.out.0)/PairWithVoidKey+Map(<lambda at sideinputs_test.py:283>)/_UnpickledSideInput(MapToVoidKey1.out.0)/PairWithVoidKey+Map(<lambda at sideinputs_test.py:283>)/_UnpickledSideInput(MapToVoidKey1.out.0)/GroupByKey/WriteStream+Map(<lambda at sideinputs_test.py:283>)/_UnpickledSideInput(MapToVoidKey0.out.0)/GroupByKey/WriteStream
root: INFO: 2019-07-15T00:23:05.959Z: JOB_MESSAGE_DETAILED: Workers have started successfully.
root: INFO: 2019-07-15T00:23:08.960Z: JOB_MESSAGE_DEBUG: Executing input step topology_init_attach_disk_input_step
root: INFO: 2019-07-15T00:23:09.246Z: JOB_MESSAGE_DETAILED: Checking permissions granted to controller Service Account.
root: INFO: 2019-07-15T00:23:09.775Z: JOB_MESSAGE_BASIC: Worker configuration: n1-standard-4 in us-central1-a.
--------------------- >> end captured logging << ---------------------

----------------------------------------------------------------------
XML: <https://builds.apache.org/job/beam_PostCommit_Py_VR_Dataflow/ws/src/sdks/python/nosetests.xml>
----------------------------------------------------------------------
Ran 15 tests in 1037.825s

FAILED (failures=1)
Found: https://console.cloud.google.com/dataflow/jobsDetail/locations/us-central1/jobs/2019-07-14_17_22_03-11215560571317670729?project=apache-beam-testing.
Found: https://console.cloud.google.com/dataflow/jobsDetail/locations/us-central1/jobs/2019-07-14_17_30_43-14151758970858356996?project=apache-beam-testing.
Found: https://console.cloud.google.com/dataflow/jobsDetail/locations/us-central1/jobs/2019-07-14_17_22_04-2222494084542326740?project=apache-beam-testing.
Found: https://console.cloud.google.com/dataflow/jobsDetail/locations/us-central1/jobs/2019-07-14_17_29_44-10978299321840552815?project=apache-beam-testing.
Found: https://console.cloud.google.com/dataflow/jobsDetail/locations/us-central1/jobs/2019-07-14_17_22_04-15249828339139198671?project=apache-beam-testing.
Found: https://console.cloud.google.com/dataflow/jobsDetail/locations/us-central1/jobs/2019-07-14_17_30_39-10044333922454689481?project=apache-beam-testing.
Found: https://console.cloud.google.com/dataflow/jobsDetail/locations/us-central1/jobs/2019-07-14_17_22_04-7037342300405497533?project=apache-beam-testing.
Found: https://console.cloud.google.com/dataflow/jobsDetail/locations/us-central1/jobs/2019-07-14_17_29_43-17484738889696303712?project=apache-beam-testing.
Found: https://console.cloud.google.com/dataflow/jobsDetail/locations/us-central1/jobs/2019-07-14_17_22_04-15745486927497291590?project=apache-beam-testing.
Found: https://console.cloud.google.com/dataflow/jobsDetail/locations/us-central1/jobs/2019-07-14_17_29_54-15941252502895168917?project=apache-beam-testing.
Found: https://console.cloud.google.com/dataflow/jobsDetail/locations/us-central1/jobs/2019-07-14_17_22_04-8712585032471724809?project=apache-beam-testing.
Found: https://console.cloud.google.com/dataflow/jobsDetail/locations/us-central1/jobs/2019-07-14_17_29_38-6938160065219923316?project=apache-beam-testing.
Found: https://console.cloud.google.com/dataflow/jobsDetail/locations/us-central1/jobs/2019-07-14_17_22_03-1101551641865835493?project=apache-beam-testing.
Found: https://console.cloud.google.com/dataflow/jobsDetail/locations/us-central1/jobs/2019-07-14_17_30_10-7696701834069279074?project=apache-beam-testing.
Found: https://console.cloud.google.com/dataflow/jobsDetail/locations/us-central1/jobs/2019-07-14_17_22_04-8226765310336221419?project=apache-beam-testing.

> Task :sdks:python:validatesRunnerStreamingTests FAILED

FAILURE: Build completed with 6 failures.

1: Task failed with an exception.
-----------
* Where:
Build file '<https://builds.apache.org/job/beam_PostCommit_Py_VR_Dataflow/ws/src/sdks/python/test-suites/dataflow/py36/build.gradle'> line: 67

* What went wrong:
Execution failed for task ':sdks:python:test-suites:dataflow:py36:validatesRunnerBatchTests'.
> Process 'command 'sh'' finished with non-zero exit value 1

* Try:
Run with --stacktrace option to get the stack trace. Run with --info or --debug option to get more log output. Run with --scan to get full insights.
==============================================================================

2: Task failed with an exception.
-----------
* Where:
Build file '<https://builds.apache.org/job/beam_PostCommit_Py_VR_Dataflow/ws/src/sdks/python/test-suites/dataflow/py35/build.gradle'> line: 67

* What went wrong:
Execution failed for task ':sdks:python:test-suites:dataflow:py35:validatesRunnerBatchTests'.
> Process 'command 'sh'' finished with non-zero exit value 1

* Try:
Run with --stacktrace option to get the stack trace. Run with --info or --debug option to get more log output. Run with --scan to get full insights.
==============================================================================

3: Task failed with an exception.
-----------
* Where:
Build file '<https://builds.apache.org/job/beam_PostCommit_Py_VR_Dataflow/ws/src/sdks/python/test-suites/dataflow/py36/build.gradle'> line: 87

* What went wrong:
Execution failed for task ':sdks:python:test-suites:dataflow:py36:validatesRunnerStreamingTests'.
> Process 'command 'sh'' finished with non-zero exit value 1

* Try:
Run with --stacktrace option to get the stack trace. Run with --info or --debug option to get more log output. Run with --scan to get full insights.
==============================================================================

4: Task failed with an exception.
-----------
* Where:
Build file '<https://builds.apache.org/job/beam_PostCommit_Py_VR_Dataflow/ws/src/sdks/python/test-suites/dataflow/py35/build.gradle'> line: 87

* What went wrong:
Execution failed for task ':sdks:python:test-suites:dataflow:py35:validatesRunnerStreamingTests'.
> Process 'command 'sh'' finished with non-zero exit value 1

* Try:
Run with --stacktrace option to get the stack trace. Run with --info or --debug option to get more log output. Run with --scan to get full insights.
==============================================================================

5: Task failed with an exception.
-----------
* Where:
Build file '<https://builds.apache.org/job/beam_PostCommit_Py_VR_Dataflow/ws/src/sdks/python/test-suites/dataflow/py37/build.gradle'> line: 97

* What went wrong:
Execution failed for task ':sdks:python:test-suites:dataflow:py37:validatesRunnerBatchTests'.
> Process 'command 'sh'' finished with non-zero exit value 1

* Try:
Run with --stacktrace option to get the stack trace. Run with --info or --debug option to get more log output. Run with --scan to get full insights.
==============================================================================

6: Task failed with an exception.
-----------
* Where:
Build file '<https://builds.apache.org/job/beam_PostCommit_Py_VR_Dataflow/ws/src/sdks/python/build.gradle'> line: 216

* What went wrong:
Execution failed for task ':sdks:python:validatesRunnerStreamingTests'.
> Process 'command 'sh'' finished with non-zero exit value 1

* Try:
Run with --stacktrace option to get the stack trace. Run with --info or --debug option to get more log output. Run with --scan to get full insights.
==============================================================================

* Get more help at https://help.gradle.org

Deprecated Gradle features were used in this build, making it incompatible with Gradle 6.0.
Use '--warning-mode all' to show the individual deprecation warnings.
See https://docs.gradle.org/5.2.1/userguide/command_line_interface.html#sec:command_line_warnings

BUILD FAILED in 39m 0s
76 actionable tasks: 59 executed, 17 from cache

Publishing build scan...
https://gradle.com/s/6knbc7xqhz6z4

Build step 'Invoke Gradle script' changed build result to FAILURE
Build step 'Invoke Gradle script' marked build as failure

---------------------------------------------------------------------
To unsubscribe, e-mail: builds-unsubscribe@beam.apache.org
For additional commands, e-mail: builds-help@beam.apache.org