You are viewing a plain text version of this content. The canonical link for it is here.
Posted to builds@lucene.apache.org by Apache Jenkins Server <je...@builds.apache.org> on 2026/08/02 14:53:23 UTC
[JENKINS] Lucene » Lucene-Coverage-main - Build # 1856 - Still Unstable!
Build: https://ci-builds.apache.org/job/Lucene/job/Lucene-Coverage-main/1856/
2 tests failed.
FAILED: org.apache.lucene.expressions.js.TestJavascriptCompiler.testRecursionDepth1a()
Error Message:
java.lang.AssertionError: expected:<1024> but was:<-1>
Stack Trace:
java.lang.AssertionError: expected:<1024> but was:<-1>
at __randomizedtesting.SeedChain.seed([F16CE8563C2E6DE1:BDC3976FE3E31CF:85C0831AD119ECA4])
at junit@4.13.2/org.junit.Assert.fail(Assert.java:89)
at junit@4.13.2/org.junit.Assert.failNotEquals(Assert.java:835)
at junit@4.13.2/org.junit.Assert.assertEquals(Assert.java:647)
at junit@4.13.2/org.junit.Assert.assertEquals(Assert.java:633)
at org.apache.lucene.expressions.js.TestJavascriptCompiler.testRecursionDepth1a(TestJavascriptCompiler.java:286)
FAILED: org.apache.lucene.expressions.js.TestJavascriptCompiler.testRecursionDepth2()
Error Message:
java.lang.AssertionError: expected:<1024> but was:<-1>
Stack Trace:
java.lang.AssertionError: expected:<1024> but was:<-1>
at __randomizedtesting.SeedChain.seed([F16CE8563C2E6DE1:BDC3976FE3E31CF:F0BCBF296FEB9793])
at junit@4.13.2/org.junit.Assert.fail(Assert.java:89)
at junit@4.13.2/org.junit.Assert.failNotEquals(Assert.java:835)
at junit@4.13.2/org.junit.Assert.assertEquals(Assert.java:647)
at junit@4.13.2/org.junit.Assert.assertEquals(Assert.java:633)
at org.apache.lucene.expressions.js.TestJavascriptCompiler.testRecursionDepth2(TestJavascriptCompiler.java:292)
Build Log:
[...truncated 1161 lines...]
ERROR: 2 tests have failed:
- org.apache.lucene.expressions.js.TestJavascriptCompiler.testRecursionDepth1a (:lucene:expressions)
Test output: /home/jenkins/jenkins-agent/workspace/Lucene/Lucene-Coverage-main/lucene/expressions/build/test-results/test/outputs/OUTPUT-org.apache.lucene.expressions.js.TestJavascriptCompiler.txt
Reproduce with: gradlew :lucene:expressions:test --tests "org.apache.lucene.expressions.js.TestJavascriptCompiler.testRecursionDepth1a" -Ptests.asserts=true -Ptests.coverage=true -Ptests.file.encoding=US-ASCII -Ptests.gui=true -Ptests.haltonfailure=false -Ptests.jvmargs= -Ptests.jvms=4 -Ptests.multiplier=2 -Ptests.seed=F16CE8563C2E6DE1 -Ptests.vectorsize=256
- org.apache.lucene.expressions.js.TestJavascriptCompiler.testRecursionDepth2 (:lucene:expressions)
Test output: /home/jenkins/jenkins-agent/workspace/Lucene/Lucene-Coverage-main/lucene/expressions/build/test-results/test/outputs/OUTPUT-org.apache.lucene.expressions.js.TestJavascriptCompiler.txt
Reproduce with: gradlew :lucene:expressions:test --tests "org.apache.lucene.expressions.js.TestJavascriptCompiler.testRecursionDepth2" -Ptests.asserts=true -Ptests.coverage=true -Ptests.file.encoding=US-ASCII -Ptests.gui=true -Ptests.haltonfailure=false -Ptests.jvmargs= -Ptests.jvms=4 -Ptests.multiplier=2 -Ptests.seed=F16CE8563C2E6DE1 -Ptests.vectorsize=256
The slowest tests during this run:
17.90s TestTermOrdValComparatorAdaptiveSkipping.testAdaptiveDisablingFiresForInterleavedData (:lucene:core)
8.36s TestRangeOnRangeFacetCounts.testRandomMultiDimDoubles (:lucene:facet)
6.91s TestLatLonMultiPolygonShapeQueries.testRandomMedium (:lucene:core)
6.11s TestRangeOnRangeFacetCounts.testRandomMultiDimLongs (:lucene:facet)
6.08s TestLucene90DocValuesFormatMergeInstance.testSparseDocValuesVsStoredFields (:lucene:core)
5.76s TestStressAdvance.testStressAdvance (:lucene:core)
5.71s TestDuelingCodecs.testCrazyReaderEquals (:lucene:core)
4.28s TestAssertingNormsFormat.testSparseOutliers (:lucene:test-framework)
4.08s TestTessellator.testComplexPolygon47 (:lucene:core)
3.98s TestSortedSetDocValuesFacets.testRandom (:lucene:facet)
The slowest suites during this run:
25.58s TestLucene90DocValuesFormatMergeInstance (:lucene:core)
24.12s TestBasicBackwardsCompatibility (:lucene:backward-codecs)
23.12s TestLucene90DocValuesFormat (:lucene:core)
21.55s TestTermOrdValComparatorAdaptiveSkipping (:lucene:core)
18.20s TestLucene90DocValuesFormatVariableSkipInterval (:lucene:core)
18.19s TestAssertingDocValuesFormat (:lucene:test-framework)
16.02s TestRangeOnRangeFacetCounts (:lucene:facet)
16.00s TestSimpleTextDocValuesFormat (:lucene:codecs)
15.03s TestIndexSortBackwardsCompatibility (:lucene:backward-codecs)
13.50s TestAssertingNormsFormat (:lucene:test-framework)
[Incubating] Problems report is available at: file:///home/jenkins/jenkins-agent/workspace/Lucene/Lucene-Coverage-main/build/reports/problems/problems-report.html
Deprecated Gradle features were used in this build, making it incompatible with Gradle 10.
You can use '--warning-mode all' to show the individual deprecation warnings and determine if they come from your own scripts or plugins.
For more on this, please refer to https://docs.gradle.org/9.6.1/userguide/command_line_interface.html#sec:command_line_warnings in the Gradle documentation.
BUILD SUCCESSFUL in 13m 29s
373 actionable tasks: 293 executed, 80 up-to-date
Consider enabling configuration cache to speed up this build: https://docs.gradle.org/9.6.1/userguide/configuration_cache_enabling.html
Build step 'Invoke Gradle script' changed build result to SUCCESS
Archiving artifacts
‘**/build*/**/tests-cwd/*.hprof’ doesn’t match anything: ‘**’ exists but not ‘**/build*/**/tests-cwd/*.hprof’
No artifacts found that match the file pattern "**/build*/**/tests-cwd/*.hprof,**/*_pid*.log". Configuration error?
Recording test results
[Checks API] No suitable checks publisher found.
Build step 'Publish JUnit test result report' changed build result to UNSTABLE
Email was triggered for: Unstable (Test Failures)
Sending email for trigger: Unstable (Test Failures)
[JENKINS] Lucene » Lucene-Coverage-main - Build # 1878 - Still Unstable!
Posted by Apache Jenkins Server <je...@builds.apache.org>.
Build: https://ci-builds.apache.org/job/Lucene/job/Lucene-Coverage-main/1878/
3 tests failed.
FAILED: org.apache.lucene.expressions.js.TestJavascriptCompiler.testRecursionDepth2()
Error Message:
java.lang.AssertionError: expected:<1024> but was:<-1>
Stack Trace:
java.lang.AssertionError: expected:<1024> but was:<-1>
at __randomizedtesting.SeedChain.seed([ACE8F3B424CAAF51:56582294E6DAF37F:AD38A4CB770F5523])
at junit@4.13.2/org.junit.Assert.fail(Assert.java:89)
at junit@4.13.2/org.junit.Assert.failNotEquals(Assert.java:835)
at junit@4.13.2/org.junit.Assert.assertEquals(Assert.java:647)
at junit@4.13.2/org.junit.Assert.assertEquals(Assert.java:633)
at org.apache.lucene.expressions.js.TestJavascriptCompiler.testRecursionDepth2(TestJavascriptCompiler.java:292)
FAILED: org.apache.lucene.expressions.js.TestJavascriptCompiler.testRecursionDepth1()
Error Message:
java.lang.AssertionError: expected:<1024> but was:<-1>
Stack Trace:
java.lang.AssertionError: expected:<1024> but was:<-1>
at __randomizedtesting.SeedChain.seed([ACE8F3B424CAAF51:56582294E6DAF37F:1D67637DCD30A88F])
at junit@4.13.2/org.junit.Assert.fail(Assert.java:89)
at junit@4.13.2/org.junit.Assert.failNotEquals(Assert.java:835)
at junit@4.13.2/org.junit.Assert.assertEquals(Assert.java:647)
at junit@4.13.2/org.junit.Assert.assertEquals(Assert.java:633)
at org.apache.lucene.expressions.js.TestJavascriptCompiler.testRecursionDepth1(TestJavascriptCompiler.java:279)
FAILED: org.apache.lucene.expressions.js.TestJavascriptCompiler.testRecursionDepth1a()
Error Message:
java.lang.AssertionError: expected:<1024> but was:<-1>
Stack Trace:
java.lang.AssertionError: expected:<1024> but was:<-1>
at __randomizedtesting.SeedChain.seed([ACE8F3B424CAAF51:56582294E6DAF37F:D84498F8C9FD2E14])
at junit@4.13.2/org.junit.Assert.fail(Assert.java:89)
at junit@4.13.2/org.junit.Assert.failNotEquals(Assert.java:835)
at junit@4.13.2/org.junit.Assert.assertEquals(Assert.java:647)
at junit@4.13.2/org.junit.Assert.assertEquals(Assert.java:633)
at org.apache.lucene.expressions.js.TestJavascriptCompiler.testRecursionDepth1a(TestJavascriptCompiler.java:286)
Build Log:
[...truncated 1176 lines...]
ERROR: 3 tests have failed:
- org.apache.lucene.expressions.js.TestJavascriptCompiler.testRecursionDepth1a (:lucene:expressions)
Test output: /home/jenkins/jenkins-agent/workspace/Lucene/Lucene-Coverage-main/lucene/expressions/build/test-results/test/outputs/OUTPUT-org.apache.lucene.expressions.js.TestJavascriptCompiler.txt
Reproduce with: gradlew :lucene:expressions:test --tests "org.apache.lucene.expressions.js.TestJavascriptCompiler.testRecursionDepth1a" -Ptests.asserts=true -Ptests.coverage=true -Ptests.file.encoding=ISO-8859-1 -Ptests.gui=true -Ptests.haltonfailure=false -Ptests.jvmargs= -Ptests.jvms=4 -Ptests.multiplier=2 -Ptests.seed=ACE8F3B424CAAF51 -Ptests.vectorsize=128
- org.apache.lucene.expressions.js.TestJavascriptCompiler.testRecursionDepth1 (:lucene:expressions)
Test output: /home/jenkins/jenkins-agent/workspace/Lucene/Lucene-Coverage-main/lucene/expressions/build/test-results/test/outputs/OUTPUT-org.apache.lucene.expressions.js.TestJavascriptCompiler.txt
Reproduce with: gradlew :lucene:expressions:test --tests "org.apache.lucene.expressions.js.TestJavascriptCompiler.testRecursionDepth1" -Ptests.asserts=true -Ptests.coverage=true -Ptests.file.encoding=ISO-8859-1 -Ptests.gui=true -Ptests.haltonfailure=false -Ptests.jvmargs= -Ptests.jvms=4 -Ptests.multiplier=2 -Ptests.seed=ACE8F3B424CAAF51 -Ptests.vectorsize=128
- org.apache.lucene.expressions.js.TestJavascriptCompiler.testRecursionDepth2 (:lucene:expressions)
Test output: /home/jenkins/jenkins-agent/workspace/Lucene/Lucene-Coverage-main/lucene/expressions/build/test-results/test/outputs/OUTPUT-org.apache.lucene.expressions.js.TestJavascriptCompiler.txt
Reproduce with: gradlew :lucene:expressions:test --tests "org.apache.lucene.expressions.js.TestJavascriptCompiler.testRecursionDepth2" -Ptests.asserts=true -Ptests.coverage=true -Ptests.file.encoding=ISO-8859-1 -Ptests.gui=true -Ptests.haltonfailure=false -Ptests.jvmargs= -Ptests.jvms=4 -Ptests.multiplier=2 -Ptests.seed=ACE8F3B424CAAF51 -Ptests.vectorsize=128
The slowest tests during this run:
12.58s TestSimpleTextNormsFormat.testThreads (:lucene:codecs)
7.96s TestRangeFacetCounts.testRandomLongsMultiValued (:lucene:facet)
6.03s TestIndexSorting.testRandom3 (:lucene:core)
4.95s TestSimpleTextPointsFormat.testOneDimTwoValues (:lucene:codecs)
4.85s TestFixedGapPostingsFormat.testDocsAndFreqsAndPositionsAndOffsetsAndPayloads (:lucene:codecs)
4.72s TestVarGapFixedIntervalPostingsFormat.testDocsAndFreqsAndPositionsAndOffsetsAndPayloads (:lucene:codecs)
4.49s TestSortedSetDocValuesFacets.testRandom (:lucene:facet)
4.41s TestAssertingNormsFormat.testSparseShortRange (:lucene:test-framework)
4.38s TestAssertingPostingsFormat.testDocsAndFreqsAndPositionsAndOffsetsAndPayloads (:lucene:test-framework)
3.96s TestOrdsBlockTree.testDocsAndFreqsAndPositionsAndOffsetsAndPayloads (:lucene:codecs)
The slowest suites during this run:
29.19s TestBasicBackwardsCompatibility (:lucene:backward-codecs)
29.12s TestLucene90DocValuesFormat (:lucene:core)
25.84s TestLucene90DocValuesFormatMergeInstance (:lucene:core)
24.94s TestLucene90DocValuesFormatVariableSkipInterval (:lucene:core)
22.31s TestSimpleTextNormsFormat (:lucene:codecs)
21.68s TestAssertingDocValuesFormat (:lucene:test-framework)
19.18s TestSimpleTextDocValuesFormat (:lucene:codecs)
18.16s TestFixedGapPostingsFormat (:lucene:codecs)
17.99s TestVarGapFixedIntervalPostingsFormat (:lucene:codecs)
16.40s TestAssertingPostingsFormat (:lucene:test-framework)
[Incubating] Problems report is available at: file:///home/jenkins/jenkins-agent/workspace/Lucene/Lucene-Coverage-main/build/reports/problems/problems-report.html
Deprecated Gradle features were used in this build, making it incompatible with Gradle 10.
You can use '--warning-mode all' to show the individual deprecation warnings and determine if they come from your own scripts or plugins.
For more on this, please refer to https://docs.gradle.org/9.7.0/userguide/command_line_interface.html#sec:command_line_warnings in the Gradle documentation.
BUILD SUCCESSFUL in 13m 45s
373 actionable tasks: 293 executed, 80 up-to-date
Consider enabling configuration cache to speed up this build: https://docs.gradle.org/9.7.0/userguide/configuration_cache_enabling.html
Build step 'Invoke Gradle script' changed build result to SUCCESS
Archiving artifacts
‘**/build*/**/tests-cwd/*.hprof’ doesn’t match anything: ‘**’ exists but not ‘**/build*/**/tests-cwd/*.hprof’
No artifacts found that match the file pattern "**/build*/**/tests-cwd/*.hprof,**/*_pid*.log". Configuration error?
Recording test results
[Checks API] No suitable checks publisher found.
Build step 'Publish JUnit test result report' changed build result to UNSTABLE
Email was triggered for: Unstable (Test Failures)
Sending email for trigger: Unstable (Test Failures)
[JENKINS] Lucene » Lucene-Coverage-main - Build # 1877 - Still Unstable!
Posted by Apache Jenkins Server <je...@builds.apache.org>.
Build: https://ci-builds.apache.org/job/Lucene/job/Lucene-Coverage-main/1877/
2 tests failed.
FAILED: org.apache.lucene.expressions.js.TestJavascriptCompiler.testRecursionDepth1()
Error Message:
java.lang.AssertionError: expected:<1024> but was:<-1>
Stack Trace:
java.lang.AssertionError: expected:<1024> but was:<-1>
at __randomizedtesting.SeedChain.seed([15FB22174E972B51:EF4BF3378C87777F:A474B2DEA76D2C8F])
at junit@4.13.2/org.junit.Assert.fail(Assert.java:89)
at junit@4.13.2/org.junit.Assert.failNotEquals(Assert.java:835)
at junit@4.13.2/org.junit.Assert.assertEquals(Assert.java:647)
at junit@4.13.2/org.junit.Assert.assertEquals(Assert.java:633)
at org.apache.lucene.expressions.js.TestJavascriptCompiler.testRecursionDepth1(TestJavascriptCompiler.java:279)
FAILED: org.apache.lucene.expressions.js.TestJavascriptCompiler.testRecursionDepth1a()
Error Message:
java.lang.AssertionError: expected:<1024> but was:<-1>
Stack Trace:
java.lang.AssertionError: expected:<1024> but was:<-1>
at __randomizedtesting.SeedChain.seed([15FB22174E972B51:EF4BF3378C87777F:6157495BA3A0AA14])
at junit@4.13.2/org.junit.Assert.fail(Assert.java:89)
at junit@4.13.2/org.junit.Assert.failNotEquals(Assert.java:835)
at junit@4.13.2/org.junit.Assert.assertEquals(Assert.java:647)
at junit@4.13.2/org.junit.Assert.assertEquals(Assert.java:633)
at org.apache.lucene.expressions.js.TestJavascriptCompiler.testRecursionDepth1a(TestJavascriptCompiler.java:286)
Build Log:
[...truncated 1159 lines...]
ERROR: 2 tests have failed:
- org.apache.lucene.expressions.js.TestJavascriptCompiler.testRecursionDepth1 (:lucene:expressions)
Test output: /home/jenkins/jenkins-agent/workspace/Lucene/Lucene-Coverage-main/lucene/expressions/build/test-results/test/outputs/OUTPUT-org.apache.lucene.expressions.js.TestJavascriptCompiler.txt
Reproduce with: gradlew :lucene:expressions:test --tests "org.apache.lucene.expressions.js.TestJavascriptCompiler.testRecursionDepth1" -Ptests.asserts=false -Ptests.coverage=true -Ptests.file.encoding=ISO-8859-1 -Ptests.gui=true -Ptests.haltonfailure=false -Ptests.jvmargs= -Ptests.jvms=4 -Ptests.multiplier=2 -Ptests.seed=15FB22174E972B51 -Ptests.vectorsize=128
- org.apache.lucene.expressions.js.TestJavascriptCompiler.testRecursionDepth1a (:lucene:expressions)
Test output: /home/jenkins/jenkins-agent/workspace/Lucene/Lucene-Coverage-main/lucene/expressions/build/test-results/test/outputs/OUTPUT-org.apache.lucene.expressions.js.TestJavascriptCompiler.txt
Reproduce with: gradlew :lucene:expressions:test --tests "org.apache.lucene.expressions.js.TestJavascriptCompiler.testRecursionDepth1a" -Ptests.asserts=false -Ptests.coverage=true -Ptests.file.encoding=ISO-8859-1 -Ptests.gui=true -Ptests.haltonfailure=false -Ptests.jvmargs= -Ptests.jvms=4 -Ptests.multiplier=2 -Ptests.seed=15FB22174E972B51 -Ptests.vectorsize=128
The slowest tests during this run:
7.49s TestAllGroupHeadsCollector.testRandom (:lucene:grouping)
6.56s TestLatLonMultiPolygonShapeQueries.testRandomMedium (:lucene:core)
6.53s TestLucene90DocValuesFormatMergeInstance.testSparseDocValuesVsStoredFields (:lucene:core)
6.14s TestSimpleTextNormsFormat.testThreads (:lucene:codecs)
5.68s TestAssertingNormsFormat.testSparseOutliers2 (:lucene:test-framework)
5.53s TestAssertingDocValuesFormat.testLongNumericsVsStoredFields (:lucene:test-framework)
4.83s TestRangeFacetCounts.testRandomLongsMultiValued (:lucene:facet)
4.56s TestLongValueFacetCounts.testRandomMultiValued (:lucene:facet)
4.27s TestBooleanOr.testBooleanScorerMax (:lucene:core)
4.08s TestLongValueFacet.testRandomSingleValued (:lucene:sandbox)
The slowest suites during this run:
29.68s TestLucene90DocValuesFormatMergeInstance (:lucene:core)
27.37s TestLucene90DocValuesFormat (:lucene:core)
26.16s TestBasicBackwardsCompatibility (:lucene:backward-codecs)
22.81s TestLucene90DocValuesFormatVariableSkipInterval (:lucene:core)
22.10s TestAssertingDocValuesFormat (:lucene:test-framework)
18.92s TestSimpleTextDocValuesFormat (:lucene:codecs)
17.05s TestAssertingNormsFormat (:lucene:test-framework)
16.99s TestSimpleTextNormsFormat (:lucene:codecs)
16.54s TestPerFieldDocValuesFormat (:lucene:core)
15.50s TestFixedGapPostingsFormat (:lucene:codecs)
[Incubating] Problems report is available at: file:///home/jenkins/jenkins-agent/workspace/Lucene/Lucene-Coverage-main/build/reports/problems/problems-report.html
Deprecated Gradle features were used in this build, making it incompatible with Gradle 10.
You can use '--warning-mode all' to show the individual deprecation warnings and determine if they come from your own scripts or plugins.
For more on this, please refer to https://docs.gradle.org/9.7.0/userguide/command_line_interface.html#sec:command_line_warnings in the Gradle documentation.
BUILD SUCCESSFUL in 13m 29s
373 actionable tasks: 293 executed, 80 up-to-date
Consider enabling configuration cache to speed up this build: https://docs.gradle.org/9.7.0/userguide/configuration_cache_enabling.html
Build step 'Invoke Gradle script' changed build result to SUCCESS
Archiving artifacts
‘**/build*/**/tests-cwd/*.hprof’ doesn’t match anything: ‘**’ exists but not ‘**/build*/**/tests-cwd/*.hprof’
No artifacts found that match the file pattern "**/build*/**/tests-cwd/*.hprof,**/*_pid*.log". Configuration error?
Recording test results
[Checks API] No suitable checks publisher found.
Build step 'Publish JUnit test result report' changed build result to UNSTABLE
Email was triggered for: Unstable (Test Failures)
Sending email for trigger: Unstable (Test Failures)
[JENKINS] Lucene » Lucene-Coverage-main - Build # 1876 - Still Unstable!
Posted by Apache Jenkins Server <je...@builds.apache.org>.
Build: https://ci-builds.apache.org/job/Lucene/job/Lucene-Coverage-main/1876/
2 tests failed.
FAILED: org.apache.lucene.expressions.js.TestJavascriptCompiler.testRecursionDepth1a()
Error Message:
java.lang.AssertionError: expected:<1024> but was:<-1>
Stack Trace:
java.lang.AssertionError: expected:<1024> but was:<-1>
at __randomizedtesting.SeedChain.seed([4457E271F779388D:BEE73351356964A3:30FB893D1A4EB9C8])
at junit@4.13.2/org.junit.Assert.fail(Assert.java:89)
at junit@4.13.2/org.junit.Assert.failNotEquals(Assert.java:835)
at junit@4.13.2/org.junit.Assert.assertEquals(Assert.java:647)
at junit@4.13.2/org.junit.Assert.assertEquals(Assert.java:633)
at org.apache.lucene.expressions.js.TestJavascriptCompiler.testRecursionDepth1a(TestJavascriptCompiler.java:286)
FAILED: org.apache.lucene.expressions.js.TestJavascriptCompiler.testRecursionDepth2()
Error Message:
java.lang.AssertionError: expected:<1024> but was:<-1>
Stack Trace:
java.lang.AssertionError: expected:<1024> but was:<-1>
at __randomizedtesting.SeedChain.seed([4457E271F779388D:BEE73351356964A3:4587B50EA4BCC2FF])
at junit@4.13.2/org.junit.Assert.fail(Assert.java:89)
at junit@4.13.2/org.junit.Assert.failNotEquals(Assert.java:835)
at junit@4.13.2/org.junit.Assert.assertEquals(Assert.java:647)
at junit@4.13.2/org.junit.Assert.assertEquals(Assert.java:633)
at org.apache.lucene.expressions.js.TestJavascriptCompiler.testRecursionDepth2(TestJavascriptCompiler.java:292)
Build Log:
[...truncated 1159 lines...]
ERROR: 2 tests have failed:
- org.apache.lucene.expressions.js.TestJavascriptCompiler.testRecursionDepth1a (:lucene:expressions)
Test output: /home/jenkins/jenkins-agent/workspace/Lucene/Lucene-Coverage-main/lucene/expressions/build/test-results/test/outputs/OUTPUT-org.apache.lucene.expressions.js.TestJavascriptCompiler.txt
Reproduce with: gradlew :lucene:expressions:test --tests "org.apache.lucene.expressions.js.TestJavascriptCompiler.testRecursionDepth1a" -Ptests.asserts=true -Ptests.coverage=true -Ptests.file.encoding=ISO-8859-1 -Ptests.gui=true -Ptests.haltonfailure=false -Ptests.jvmargs= -Ptests.jvms=4 -Ptests.multiplier=2 -Ptests.seed=4457E271F779388D -Ptests.vectorsize=512
- org.apache.lucene.expressions.js.TestJavascriptCompiler.testRecursionDepth2 (:lucene:expressions)
Test output: /home/jenkins/jenkins-agent/workspace/Lucene/Lucene-Coverage-main/lucene/expressions/build/test-results/test/outputs/OUTPUT-org.apache.lucene.expressions.js.TestJavascriptCompiler.txt
Reproduce with: gradlew :lucene:expressions:test --tests "org.apache.lucene.expressions.js.TestJavascriptCompiler.testRecursionDepth2" -Ptests.asserts=true -Ptests.coverage=true -Ptests.file.encoding=ISO-8859-1 -Ptests.gui=true -Ptests.haltonfailure=false -Ptests.jvmargs= -Ptests.jvms=4 -Ptests.multiplier=2 -Ptests.seed=4457E271F779388D -Ptests.vectorsize=512
The slowest tests during this run:
11.35s TestRangeOnRangeFacetCounts.testRandomMultiDimLongs (:lucene:facet)
6.24s TestLongValueFacetCounts.testRandomMultiValued (:lucene:facet)
6.22s TestBooleanOr.testBooleanScorerMax (:lucene:core)
5.70s TestAllGroupHeadsCollector.testRandom (:lucene:grouping)
4.71s TestLazyDocument.testLazy (:lucene:misc)
4.39s TestCompressingTermVectorsFormat.testMergeStability (:lucene:core)
4.38s TestAssertingNormsFormat.testFewLargeValues (:lucene:test-framework)
4.29s TestSortedSetDocValuesFacets.testRandom (:lucene:facet)
4.19s TestICUCollationDocValuesField.testRanges (:lucene:analysis:icu)
4.14s TestTessellator.testComplexPolygon47 (:lucene:core)
The slowest suites during this run:
26.90s TestBasicBackwardsCompatibility (:lucene:backward-codecs)
26.42s TestLucene90DocValuesFormat (:lucene:core)
24.52s TestLucene90DocValuesFormatMergeInstance (:lucene:core)
21.75s TestLucene90DocValuesFormatVariableSkipInterval (:lucene:core)
19.21s TestAssertingDocValuesFormat (:lucene:test-framework)
17.62s TestRangeOnRangeFacetCounts (:lucene:facet)
16.25s TestAssertingPostingsFormat (:lucene:test-framework)
15.92s TestSimpleTextDocValuesFormat (:lucene:codecs)
15.08s TestAssertingNormsFormat (:lucene:test-framework)
14.22s TestPerFieldDocValuesFormat (:lucene:core)
[Incubating] Problems report is available at: file:///home/jenkins/jenkins-agent/workspace/Lucene/Lucene-Coverage-main/build/reports/problems/problems-report.html
Deprecated Gradle features were used in this build, making it incompatible with Gradle 10.
You can use '--warning-mode all' to show the individual deprecation warnings and determine if they come from your own scripts or plugins.
For more on this, please refer to https://docs.gradle.org/9.7.0/userguide/command_line_interface.html#sec:command_line_warnings in the Gradle documentation.
BUILD SUCCESSFUL in 13m 42s
373 actionable tasks: 293 executed, 80 up-to-date
Consider enabling configuration cache to speed up this build: https://docs.gradle.org/9.7.0/userguide/configuration_cache_enabling.html
Build step 'Invoke Gradle script' changed build result to SUCCESS
Archiving artifacts
‘**/build*/**/tests-cwd/*.hprof’ doesn’t match anything: ‘**’ exists but not ‘**/build*/**/tests-cwd/*.hprof’
No artifacts found that match the file pattern "**/build*/**/tests-cwd/*.hprof,**/*_pid*.log". Configuration error?
Recording test results
[Checks API] No suitable checks publisher found.
Build step 'Publish JUnit test result report' changed build result to UNSTABLE
Email was triggered for: Unstable (Test Failures)
Sending email for trigger: Unstable (Test Failures)
[JENKINS] Lucene » Lucene-Coverage-main - Build # 1875 - Still Unstable!
Posted by Apache Jenkins Server <je...@builds.apache.org>.
Build: https://ci-builds.apache.org/job/Lucene/job/Lucene-Coverage-main/1875/
2 tests failed.
FAILED: org.apache.lucene.expressions.js.TestJavascriptCompiler.testRecursionDepth2()
Error Message:
java.lang.AssertionError: expected:<1024> but was:<-1>
Stack Trace:
java.lang.AssertionError: expected:<1024> but was:<-1>
at __randomizedtesting.SeedChain.seed([C0A16E27B37E4AF9:3A11BF07716E16D7:C1713958E0BBB08B])
at junit@4.13.2/org.junit.Assert.fail(Assert.java:89)
at junit@4.13.2/org.junit.Assert.failNotEquals(Assert.java:835)
at junit@4.13.2/org.junit.Assert.assertEquals(Assert.java:647)
at junit@4.13.2/org.junit.Assert.assertEquals(Assert.java:633)
at org.apache.lucene.expressions.js.TestJavascriptCompiler.testRecursionDepth2(TestJavascriptCompiler.java:292)
FAILED: org.apache.lucene.expressions.js.TestJavascriptCompiler.testRecursionDepth1()
Error Message:
java.lang.AssertionError: expected:<1024> but was:<-1>
Stack Trace:
java.lang.AssertionError: expected:<1024> but was:<-1>
at __randomizedtesting.SeedChain.seed([C0A16E27B37E4AF9:3A11BF07716E16D7:712EFEEE5A844D27])
at junit@4.13.2/org.junit.Assert.fail(Assert.java:89)
at junit@4.13.2/org.junit.Assert.failNotEquals(Assert.java:835)
at junit@4.13.2/org.junit.Assert.assertEquals(Assert.java:647)
at junit@4.13.2/org.junit.Assert.assertEquals(Assert.java:633)
at org.apache.lucene.expressions.js.TestJavascriptCompiler.testRecursionDepth1(TestJavascriptCompiler.java:279)
Build Log:
[...truncated 1159 lines...]
ERROR: 2 tests have failed:
- org.apache.lucene.expressions.js.TestJavascriptCompiler.testRecursionDepth2 (:lucene:expressions)
Test output: /home/jenkins/jenkins-agent/workspace/Lucene/Lucene-Coverage-main/lucene/expressions/build/test-results/test/outputs/OUTPUT-org.apache.lucene.expressions.js.TestJavascriptCompiler.txt
Reproduce with: gradlew :lucene:expressions:test --tests "org.apache.lucene.expressions.js.TestJavascriptCompiler.testRecursionDepth2" -Ptests.asserts=true -Ptests.coverage=true -Ptests.file.encoding=ISO-8859-1 -Ptests.gui=true -Ptests.haltonfailure=false -Ptests.jvmargs= -Ptests.jvms=4 -Ptests.multiplier=2 -Ptests.seed=C0A16E27B37E4AF9 -Ptests.vectorsize=512
- org.apache.lucene.expressions.js.TestJavascriptCompiler.testRecursionDepth1 (:lucene:expressions)
Test output: /home/jenkins/jenkins-agent/workspace/Lucene/Lucene-Coverage-main/lucene/expressions/build/test-results/test/outputs/OUTPUT-org.apache.lucene.expressions.js.TestJavascriptCompiler.txt
Reproduce with: gradlew :lucene:expressions:test --tests "org.apache.lucene.expressions.js.TestJavascriptCompiler.testRecursionDepth1" -Ptests.asserts=true -Ptests.coverage=true -Ptests.file.encoding=ISO-8859-1 -Ptests.gui=true -Ptests.haltonfailure=false -Ptests.jvmargs= -Ptests.jvms=4 -Ptests.multiplier=2 -Ptests.seed=C0A16E27B37E4AF9 -Ptests.vectorsize=512
The slowest tests during this run:
12.79s TestNeverDelete.testIndexing (:lucene:core)
5.31s TestLucene90DocValuesFormat.testSparseDocValuesVsStoredFields (:lucene:core)
5.26s TestSortOptimization.testSortOptimizationOnSortedNumericField (:lucene:core)
5.13s TestLucene90DocValuesFormatMergeInstance.testSparseDocValuesVsStoredFields (:lucene:core)
5.10s TestSimpleTextStoredFieldsFormat.testRandomStoredFieldsWithIndexSort (:lucene:codecs)
4.95s TestTessellator.testComplexPolygon47 (:lucene:core)
4.75s TestAssertingNormsFormat.testOutliers (:lucene:test-framework)
4.45s TestRangeFacetCounts.testRandomLongsMultiValued (:lucene:facet)
3.88s TestCommonTermsQuery.testRandomIndex (:lucene:queries)
3.78s TestLatLonPolygonShapeQueries.testRandomMedium (:lucene:core)
The slowest suites during this run:
30.21s TestBasicBackwardsCompatibility (:lucene:backward-codecs)
27.78s TestLucene90DocValuesFormat (:lucene:core)
24.95s TestLucene90DocValuesFormatMergeInstance (:lucene:core)
20.44s TestAssertingDocValuesFormat (:lucene:test-framework)
19.02s TestSimpleTextDocValuesFormat (:lucene:codecs)
18.11s TestLucene90DocValuesFormatVariableSkipInterval (:lucene:core)
16.36s TestPerFieldDocValuesFormat (:lucene:core)
15.64s TestAssertingNormsFormat (:lucene:test-framework)
14.58s TestDefaultCodecParallelizesIO (:lucene:core)
14.45s TestFixedGapPostingsFormat (:lucene:codecs)
[Incubating] Problems report is available at: file:///home/jenkins/jenkins-agent/workspace/Lucene/Lucene-Coverage-main/build/reports/problems/problems-report.html
Deprecated Gradle features were used in this build, making it incompatible with Gradle 10.
You can use '--warning-mode all' to show the individual deprecation warnings and determine if they come from your own scripts or plugins.
For more on this, please refer to https://docs.gradle.org/9.7.0/userguide/command_line_interface.html#sec:command_line_warnings in the Gradle documentation.
BUILD SUCCESSFUL in 14m 34s
373 actionable tasks: 293 executed, 80 up-to-date
Consider enabling configuration cache to speed up this build: https://docs.gradle.org/9.7.0/userguide/configuration_cache_enabling.html
Build step 'Invoke Gradle script' changed build result to SUCCESS
Archiving artifacts
‘**/build*/**/tests-cwd/*.hprof’ doesn’t match anything: ‘**’ exists but not ‘**/build*/**/tests-cwd/*.hprof’
No artifacts found that match the file pattern "**/build*/**/tests-cwd/*.hprof,**/*_pid*.log". Configuration error?
Recording test results
[Checks API] No suitable checks publisher found.
Build step 'Publish JUnit test result report' changed build result to UNSTABLE
Email was triggered for: Unstable (Test Failures)
Sending email for trigger: Unstable (Test Failures)
[JENKINS] Lucene » Lucene-Coverage-main - Build # 1874 - Still Unstable!
Posted by Apache Jenkins Server <je...@builds.apache.org>.
Build: https://ci-builds.apache.org/job/Lucene/job/Lucene-Coverage-main/1874/
2 tests failed.
FAILED: org.apache.lucene.expressions.js.TestJavascriptCompiler.testRecursionDepth1()
Error Message:
java.lang.AssertionError: expected:<1024> but was:<-1>
Stack Trace:
java.lang.AssertionError: expected:<1024> but was:<-1>
at __randomizedtesting.SeedChain.seed([C9D6617253C24BC9:3366B05291D217E7:7859F1BBBA384C17])
at junit@4.13.2/org.junit.Assert.fail(Assert.java:89)
at junit@4.13.2/org.junit.Assert.failNotEquals(Assert.java:835)
at junit@4.13.2/org.junit.Assert.assertEquals(Assert.java:647)
at junit@4.13.2/org.junit.Assert.assertEquals(Assert.java:633)
at org.apache.lucene.expressions.js.TestJavascriptCompiler.testRecursionDepth1(TestJavascriptCompiler.java:279)
FAILED: org.apache.lucene.expressions.js.TestJavascriptCompiler.testRecursionDepth1a()
Error Message:
java.lang.AssertionError: expected:<1024> but was:<-1>
Stack Trace:
java.lang.AssertionError: expected:<1024> but was:<-1>
at __randomizedtesting.SeedChain.seed([C9D6617253C24BC9:3366B05291D217E7:BD7A0A3EBEF5CA8C])
at junit@4.13.2/org.junit.Assert.fail(Assert.java:89)
at junit@4.13.2/org.junit.Assert.failNotEquals(Assert.java:835)
at junit@4.13.2/org.junit.Assert.assertEquals(Assert.java:647)
at junit@4.13.2/org.junit.Assert.assertEquals(Assert.java:633)
at org.apache.lucene.expressions.js.TestJavascriptCompiler.testRecursionDepth1a(TestJavascriptCompiler.java:286)
Build Log:
[...truncated 1159 lines...]
ERROR: 2 tests have failed:
- org.apache.lucene.expressions.js.TestJavascriptCompiler.testRecursionDepth1a (:lucene:expressions)
Test output: /home/jenkins/jenkins-agent/workspace/Lucene/Lucene-Coverage-main/lucene/expressions/build/test-results/test/outputs/OUTPUT-org.apache.lucene.expressions.js.TestJavascriptCompiler.txt
Reproduce with: gradlew :lucene:expressions:test --tests "org.apache.lucene.expressions.js.TestJavascriptCompiler.testRecursionDepth1a" -Ptests.asserts=true -Ptests.coverage=true -Ptests.file.encoding=UTF-8 -Ptests.gui=true -Ptests.haltonfailure=false -Ptests.jvmargs= -Ptests.jvms=4 -Ptests.multiplier=2 -Ptests.seed=C9D6617253C24BC9 -Ptests.vectorsize=128
- org.apache.lucene.expressions.js.TestJavascriptCompiler.testRecursionDepth1 (:lucene:expressions)
Test output: /home/jenkins/jenkins-agent/workspace/Lucene/Lucene-Coverage-main/lucene/expressions/build/test-results/test/outputs/OUTPUT-org.apache.lucene.expressions.js.TestJavascriptCompiler.txt
Reproduce with: gradlew :lucene:expressions:test --tests "org.apache.lucene.expressions.js.TestJavascriptCompiler.testRecursionDepth1" -Ptests.asserts=true -Ptests.coverage=true -Ptests.file.encoding=UTF-8 -Ptests.gui=true -Ptests.haltonfailure=false -Ptests.jvmargs= -Ptests.jvms=4 -Ptests.multiplier=2 -Ptests.seed=C9D6617253C24BC9 -Ptests.vectorsize=128
The slowest tests during this run:
6.90s TestBooleanOr.testBooleanScorerMax (:lucene:core)
5.72s TestLucene90DocValuesFormat.testSparseDocValuesVsStoredFields (:lucene:core)
5.65s TestDirectIODirectory.testRandomShort (:lucene:misc)
4.83s TestSortOptimization.testSortOptimizationOnSortedNumericField (:lucene:core)
4.66s TestAssertingNormsFormat.testMostZeros (:lucene:test-framework)
4.57s TestRangeOnRangeFacetCounts.testRandomMultiDimDoubles (:lucene:facet)
4.42s TestLucene90DocValuesFormatMergeInstance.testSparseDocValuesVsStoredFields (:lucene:core)
4.17s TestDirectIODirectory.testRandomInt (:lucene:misc)
3.86s TestAllGroupHeadsCollector.testRandom (:lucene:grouping)
3.77s TestTessellator.testComplexPolygon47 (:lucene:core)
The slowest suites during this run:
27.20s TestBasicBackwardsCompatibility (:lucene:backward-codecs)
25.88s TestLucene90DocValuesFormat (:lucene:core)
19.90s TestLucene90DocValuesFormatMergeInstance (:lucene:core)
19.00s TestSimpleTextDocValuesFormat (:lucene:codecs)
18.86s TestAssertingDocValuesFormat (:lucene:test-framework)
18.35s TestLucene90DocValuesFormatVariableSkipInterval (:lucene:core)
16.05s TestDirectIODirectory (:lucene:misc)
14.84s TestAssertingNormsFormat (:lucene:test-framework)
14.59s TestVarGapDocFreqIntervalPostingsFormat (:lucene:codecs)
14.56s TestVarGapFixedIntervalPostingsFormat (:lucene:codecs)
[Incubating] Problems report is available at: file:///home/jenkins/jenkins-agent/workspace/Lucene/Lucene-Coverage-main/build/reports/problems/problems-report.html
Deprecated Gradle features were used in this build, making it incompatible with Gradle 10.
You can use '--warning-mode all' to show the individual deprecation warnings and determine if they come from your own scripts or plugins.
For more on this, please refer to https://docs.gradle.org/9.7.0/userguide/command_line_interface.html#sec:command_line_warnings in the Gradle documentation.
BUILD SUCCESSFUL in 14m 2s
373 actionable tasks: 293 executed, 80 up-to-date
Consider enabling configuration cache to speed up this build: https://docs.gradle.org/9.7.0/userguide/configuration_cache_enabling.html
Build step 'Invoke Gradle script' changed build result to SUCCESS
Archiving artifacts
‘**/build*/**/tests-cwd/*.hprof’ doesn’t match anything: ‘**’ exists but not ‘**/build*/**/tests-cwd/*.hprof’
No artifacts found that match the file pattern "**/build*/**/tests-cwd/*.hprof,**/*_pid*.log". Configuration error?
Recording test results
[Checks API] No suitable checks publisher found.
Build step 'Publish JUnit test result report' changed build result to UNSTABLE
Email was triggered for: Unstable (Test Failures)
Sending email for trigger: Unstable (Test Failures)
[JENKINS] Lucene » Lucene-Coverage-main - Build # 1873 - Still Unstable!
Posted by Apache Jenkins Server <je...@builds.apache.org>.
Build: https://ci-builds.apache.org/job/Lucene/job/Lucene-Coverage-main/1873/
2 tests failed.
FAILED: org.apache.lucene.expressions.js.TestJavascriptCompiler.testRecursionDepth1a()
Error Message:
java.lang.AssertionError: expected:<1024> but was:<-1>
Stack Trace:
java.lang.AssertionError: expected:<1024> but was:<-1>
at __randomizedtesting.SeedChain.seed([5D639C569A59FC64:A7D34D765849A04A:29CFF71A776E7D21])
at junit@4.13.2/org.junit.Assert.fail(Assert.java:89)
at junit@4.13.2/org.junit.Assert.failNotEquals(Assert.java:835)
at junit@4.13.2/org.junit.Assert.assertEquals(Assert.java:647)
at junit@4.13.2/org.junit.Assert.assertEquals(Assert.java:633)
at org.apache.lucene.expressions.js.TestJavascriptCompiler.testRecursionDepth1a(TestJavascriptCompiler.java:286)
FAILED: org.apache.lucene.expressions.js.TestJavascriptCompiler.testRecursionDepth2()
Error Message:
java.lang.AssertionError: expected:<1024> but was:<-1>
Stack Trace:
java.lang.AssertionError: expected:<1024> but was:<-1>
at __randomizedtesting.SeedChain.seed([5D639C569A59FC64:A7D34D765849A04A:5CB3CB29C99C0616])
at junit@4.13.2/org.junit.Assert.fail(Assert.java:89)
at junit@4.13.2/org.junit.Assert.failNotEquals(Assert.java:835)
at junit@4.13.2/org.junit.Assert.assertEquals(Assert.java:647)
at junit@4.13.2/org.junit.Assert.assertEquals(Assert.java:633)
at org.apache.lucene.expressions.js.TestJavascriptCompiler.testRecursionDepth2(TestJavascriptCompiler.java:292)
Build Log:
[...truncated 1162 lines...]
ERROR: 2 tests have failed:
- org.apache.lucene.expressions.js.TestJavascriptCompiler.testRecursionDepth2 (:lucene:expressions)
Test output: /home/jenkins/jenkins-agent/workspace/Lucene/Lucene-Coverage-main/lucene/expressions/build/test-results/test/outputs/OUTPUT-org.apache.lucene.expressions.js.TestJavascriptCompiler.txt
Reproduce with: gradlew :lucene:expressions:test --tests "org.apache.lucene.expressions.js.TestJavascriptCompiler.testRecursionDepth2" -Ptests.asserts=true -Ptests.coverage=true -Ptests.file.encoding=UTF-8 -Ptests.gui=true -Ptests.haltonfailure=false -Ptests.jvmargs= -Ptests.jvms=4 -Ptests.multiplier=2 -Ptests.seed=5D639C569A59FC64 -Ptests.vectorsize=default
- org.apache.lucene.expressions.js.TestJavascriptCompiler.testRecursionDepth1a (:lucene:expressions)
Test output: /home/jenkins/jenkins-agent/workspace/Lucene/Lucene-Coverage-main/lucene/expressions/build/test-results/test/outputs/OUTPUT-org.apache.lucene.expressions.js.TestJavascriptCompiler.txt
Reproduce with: gradlew :lucene:expressions:test --tests "org.apache.lucene.expressions.js.TestJavascriptCompiler.testRecursionDepth1a" -Ptests.asserts=true -Ptests.coverage=true -Ptests.file.encoding=UTF-8 -Ptests.gui=true -Ptests.haltonfailure=false -Ptests.jvmargs= -Ptests.jvms=4 -Ptests.multiplier=2 -Ptests.seed=5D639C569A59FC64 -Ptests.vectorsize=default
The slowest tests during this run:
9.66s TestNeverDelete.testIndexing (:lucene:core)
9.45s TestDocValuesRewriteMethod.testRegexps (:lucene:core)
7.08s TestRangeOnRangeFacetCounts.testRandomMultiDimLongs (:lucene:facet)
6.57s TestRangeOnRangeFacetCounts.testRandomMultiDimDoubles (:lucene:facet)
6.53s TestLucene90DocValuesFormatMergeInstance.testSparseDocValuesVsStoredFields (:lucene:core)
4.83s TestCommonTermsQuery.testRandomIndex (:lucene:queries)
4.73s TestUnifiedHighlighterRanking.testRanking (:lucene:highlighter)
4.34s TestAssertingDocValuesFormat.testSortedNumericsSingleValuedVsStoredFields (:lucene:test-framework)
4.31s TestSimpleTextNormsFormat.testThreads (:lucene:codecs)
3.77s TestBooleanMinShouldMatch.testRandomQueries (:lucene:core)
The slowest suites during this run:
26.95s TestLucene90DocValuesFormatMergeInstance (:lucene:core)
25.46s TestBasicBackwardsCompatibility (:lucene:backward-codecs)
24.74s TestLucene90DocValuesFormat (:lucene:core)
20.48s TestAssertingDocValuesFormat (:lucene:test-framework)
18.65s TestLucene90DocValuesFormatVariableSkipInterval (:lucene:core)
18.33s TestSimpleTextDocValuesFormat (:lucene:codecs)
15.90s TestAssertingNormsFormat (:lucene:test-framework)
14.82s TestRangeOnRangeFacetCounts (:lucene:facet)
14.08s TestIndexSortBackwardsCompatibility (:lucene:backward-codecs)
14.04s TestPerFieldDocValuesFormat (:lucene:core)
[Incubating] Problems report is available at: file:///home/jenkins/jenkins-agent/workspace/Lucene/Lucene-Coverage-main/build/reports/problems/problems-report.html
Deprecated Gradle features were used in this build, making it incompatible with Gradle 10.
You can use '--warning-mode all' to show the individual deprecation warnings and determine if they come from your own scripts or plugins.
For more on this, please refer to https://docs.gradle.org/9.6.1/userguide/command_line_interface.html#sec:command_line_warnings in the Gradle documentation.
BUILD SUCCESSFUL in 13m 12s
373 actionable tasks: 293 executed, 80 up-to-date
Consider enabling configuration cache to speed up this build: https://docs.gradle.org/9.6.1/userguide/configuration_cache_enabling.html
Build step 'Invoke Gradle script' changed build result to SUCCESS
Archiving artifacts
‘**/build*/**/tests-cwd/*.hprof’ doesn’t match anything: ‘**’ exists but not ‘**/build*/**/tests-cwd/*.hprof’
No artifacts found that match the file pattern "**/build*/**/tests-cwd/*.hprof,**/*_pid*.log". Configuration error?
Recording test results
[Checks API] No suitable checks publisher found.
Build step 'Publish JUnit test result report' changed build result to UNSTABLE
Email was triggered for: Unstable (Test Failures)
Sending email for trigger: Unstable (Test Failures)
[JENKINS] Lucene » Lucene-Coverage-main - Build # 1872 - Still Unstable!
Posted by Apache Jenkins Server <je...@builds.apache.org>.
Build: https://ci-builds.apache.org/job/Lucene/job/Lucene-Coverage-main/1872/
1 tests failed.
FAILED: org.apache.lucene.expressions.js.TestJavascriptCompiler.testRecursionDepth2()
Error Message:
java.lang.AssertionError: expected:<1024> but was:<-1>
Stack Trace:
java.lang.AssertionError: expected:<1024> but was:<-1>
at __randomizedtesting.SeedChain.seed([9185380375A55B1D:6B35E923B7B50733:90556F7C2660A16F])
at junit@4.13.2/org.junit.Assert.fail(Assert.java:89)
at junit@4.13.2/org.junit.Assert.failNotEquals(Assert.java:835)
at junit@4.13.2/org.junit.Assert.assertEquals(Assert.java:647)
at junit@4.13.2/org.junit.Assert.assertEquals(Assert.java:633)
at org.apache.lucene.expressions.js.TestJavascriptCompiler.testRecursionDepth2(TestJavascriptCompiler.java:292)
Build Log:
[...truncated 1146 lines...]
ERROR: 1 test has failed:
- org.apache.lucene.expressions.js.TestJavascriptCompiler.testRecursionDepth2 (:lucene:expressions)
Test output: /home/jenkins/jenkins-agent/workspace/Lucene/Lucene-Coverage-main/lucene/expressions/build/test-results/test/outputs/OUTPUT-org.apache.lucene.expressions.js.TestJavascriptCompiler.txt
Reproduce with: gradlew :lucene:expressions:test --tests "org.apache.lucene.expressions.js.TestJavascriptCompiler.testRecursionDepth2" -Ptests.asserts=true -Ptests.coverage=true -Ptests.file.encoding=UTF-8 -Ptests.gui=true -Ptests.haltonfailure=false -Ptests.jvmargs= -Ptests.jvms=4 -Ptests.multiplier=2 -Ptests.seed=9185380375A55B1D -Ptests.vectorsize=default
The slowest tests during this run:
28.88s TestRangeFacetCounts.testRandomLongsMultiValued (:lucene:facet)
10.80s TestLongValueFacet.testRandomMultiValued (:lucene:sandbox)
9.66s TestSimpleTextNormsFormat.testThreads (:lucene:codecs)
8.57s TestLongValueFacetCounts.testRandomMultiValued (:lucene:facet)
7.01s TestMultiRangeQueries.testOneDimensionCount (:lucene:sandbox)
4.79s TestNeverDelete.testIndexing (:lucene:core)
4.78s TestLucene90DocValuesFormatMergeInstance.testSparseDocValuesVsStoredFields (:lucene:core)
4.77s TestLongPostings.testLongPostingsNoPositions (:lucene:core)
4.52s TestAssertingNormsFormat.testSparseOutliers (:lucene:test-framework)
3.89s TestLazyDocument.testLazy (:lucene:misc)
The slowest suites during this run:
31.22s TestRangeFacetCounts (:lucene:facet)
27.72s TestBasicBackwardsCompatibility (:lucene:backward-codecs)
24.33s TestLucene90DocValuesFormatMergeInstance (:lucene:core)
24.08s TestLucene90DocValuesFormat (:lucene:core)
19.65s TestSimpleTextNormsFormat (:lucene:codecs)
19.29s TestAssertingDocValuesFormat (:lucene:test-framework)
18.80s TestLucene90DocValuesFormatVariableSkipInterval (:lucene:core)
17.47s TestIndexSortBackwardsCompatibility (:lucene:backward-codecs)
16.71s TestSimpleTextDocValuesFormat (:lucene:codecs)
16.46s TestFixedGapPostingsFormat (:lucene:codecs)
[Incubating] Problems report is available at: file:///home/jenkins/jenkins-agent/workspace/Lucene/Lucene-Coverage-main/build/reports/problems/problems-report.html
Deprecated Gradle features were used in this build, making it incompatible with Gradle 10.
You can use '--warning-mode all' to show the individual deprecation warnings and determine if they come from your own scripts or plugins.
For more on this, please refer to https://docs.gradle.org/9.6.1/userguide/command_line_interface.html#sec:command_line_warnings in the Gradle documentation.
BUILD SUCCESSFUL in 13m 58s
373 actionable tasks: 293 executed, 80 up-to-date
Consider enabling configuration cache to speed up this build: https://docs.gradle.org/9.6.1/userguide/configuration_cache_enabling.html
Build step 'Invoke Gradle script' changed build result to SUCCESS
Archiving artifacts
‘**/build*/**/tests-cwd/*.hprof’ doesn’t match anything: ‘**’ exists but not ‘**/build*/**/tests-cwd/*.hprof’
No artifacts found that match the file pattern "**/build*/**/tests-cwd/*.hprof,**/*_pid*.log". Configuration error?
Recording test results
[Checks API] No suitable checks publisher found.
Build step 'Publish JUnit test result report' changed build result to UNSTABLE
Email was triggered for: Unstable (Test Failures)
Sending email for trigger: Unstable (Test Failures)
[JENKINS] Lucene » Lucene-Coverage-main - Build # 1871 - Still Unstable!
Posted by Apache Jenkins Server <je...@builds.apache.org>.
Build: https://ci-builds.apache.org/job/Lucene/job/Lucene-Coverage-main/1871/
1 tests failed.
FAILED: org.apache.lucene.expressions.js.TestJavascriptCompiler.testRecursionDepth1()
Error Message:
java.lang.AssertionError: expected:<1024> but was:<-1>
Stack Trace:
java.lang.AssertionError: expected:<1024> but was:<-1>
at __randomizedtesting.SeedChain.seed([30BE38C62FED249F:CA0EE9E6EDFD78B1:8131A80FC6172341])
at junit@4.13.2/org.junit.Assert.fail(Assert.java:89)
at junit@4.13.2/org.junit.Assert.failNotEquals(Assert.java:835)
at junit@4.13.2/org.junit.Assert.assertEquals(Assert.java:647)
at junit@4.13.2/org.junit.Assert.assertEquals(Assert.java:633)
at org.apache.lucene.expressions.js.TestJavascriptCompiler.testRecursionDepth1(TestJavascriptCompiler.java:279)
Build Log:
[...truncated 1145 lines...]
ERROR: 1 test has failed:
- org.apache.lucene.expressions.js.TestJavascriptCompiler.testRecursionDepth1 (:lucene:expressions)
Test output: /home/jenkins/jenkins-agent/workspace/Lucene/Lucene-Coverage-main/lucene/expressions/build/test-results/test/outputs/OUTPUT-org.apache.lucene.expressions.js.TestJavascriptCompiler.txt
Reproduce with: gradlew :lucene:expressions:test --tests "org.apache.lucene.expressions.js.TestJavascriptCompiler.testRecursionDepth1" -Ptests.asserts=true -Ptests.coverage=true -Ptests.file.encoding=US-ASCII -Ptests.gui=true -Ptests.haltonfailure=false -Ptests.jvmargs= -Ptests.jvms=4 -Ptests.multiplier=2 -Ptests.seed=30BE38C62FED249F -Ptests.vectorsize=default
The slowest tests during this run:
12.55s TestNeverDelete.testIndexing (:lucene:core)
7.14s TestSimpleTextNormsFormat.testThreads (:lucene:codecs)
6.90s TestAssertingNormsFormat.testSparseOutliers (:lucene:test-framework)
6.63s TestLongValueFacet.testRandomMultiValued (:lucene:sandbox)
6.49s TestLongValueFacetCounts.testRandomMultiValued (:lucene:facet)
5.04s TestCompressingTermVectorsFormat.testMergeStability (:lucene:core)
4.86s TestSortedSetDocValuesFacets.testRandom (:lucene:facet)
4.65s TestLucene90DocValuesFormat.testSparseDocValuesVsStoredFields (:lucene:core)
4.41s TestLucene90DocValuesFormatMergeInstance.testSparseDocValuesVsStoredFields (:lucene:core)
4.29s TestLazyDocument.testLazy (:lucene:misc)
The slowest suites during this run:
28.19s TestLucene90DocValuesFormat (:lucene:core)
26.21s TestBasicBackwardsCompatibility (:lucene:backward-codecs)
23.46s TestLucene90DocValuesFormatMergeInstance (:lucene:core)
21.30s TestAssertingDocValuesFormat (:lucene:test-framework)
18.62s TestLucene90DocValuesFormatVariableSkipInterval (:lucene:core)
17.52s TestSimpleTextDocValuesFormat (:lucene:codecs)
17.32s TestAssertingNormsFormat (:lucene:test-framework)
15.73s TestSimpleTextNormsFormat (:lucene:codecs)
14.41s TestVarGapDocFreqIntervalPostingsFormat (:lucene:codecs)
13.20s TestPerFieldDocValuesFormat (:lucene:core)
[Incubating] Problems report is available at: file:///home/jenkins/jenkins-agent/workspace/Lucene/Lucene-Coverage-main/build/reports/problems/problems-report.html
Deprecated Gradle features were used in this build, making it incompatible with Gradle 10.
You can use '--warning-mode all' to show the individual deprecation warnings and determine if they come from your own scripts or plugins.
For more on this, please refer to https://docs.gradle.org/9.6.1/userguide/command_line_interface.html#sec:command_line_warnings in the Gradle documentation.
BUILD SUCCESSFUL in 13m 32s
373 actionable tasks: 293 executed, 80 up-to-date
Consider enabling configuration cache to speed up this build: https://docs.gradle.org/9.6.1/userguide/configuration_cache_enabling.html
Build step 'Invoke Gradle script' changed build result to SUCCESS
Archiving artifacts
‘**/build*/**/tests-cwd/*.hprof’ doesn’t match anything: ‘**’ exists but not ‘**/build*/**/tests-cwd/*.hprof’
No artifacts found that match the file pattern "**/build*/**/tests-cwd/*.hprof,**/*_pid*.log". Configuration error?
Recording test results
[Checks API] No suitable checks publisher found.
Build step 'Publish JUnit test result report' changed build result to UNSTABLE
Email was triggered for: Unstable (Test Failures)
Sending email for trigger: Unstable (Test Failures)
[JENKINS] Lucene » Lucene-Coverage-main - Build # 1870 - Still Unstable!
Posted by Apache Jenkins Server <je...@builds.apache.org>.
Build: https://ci-builds.apache.org/job/Lucene/job/Lucene-Coverage-main/1870/
3 tests failed.
FAILED: org.apache.lucene.expressions.js.TestJavascriptCompiler.testRecursionDepth1()
Error Message:
java.lang.AssertionError: expected:<1024> but was:<-1>
Stack Trace:
java.lang.AssertionError: expected:<1024> but was:<-1>
at __randomizedtesting.SeedChain.seed([8EF4CF613F449C7A:74441E41FD54C054:3F7B5FA8D6BE9BA4])
at junit@4.13.2/org.junit.Assert.fail(Assert.java:89)
at junit@4.13.2/org.junit.Assert.failNotEquals(Assert.java:835)
at junit@4.13.2/org.junit.Assert.assertEquals(Assert.java:647)
at junit@4.13.2/org.junit.Assert.assertEquals(Assert.java:633)
at org.apache.lucene.expressions.js.TestJavascriptCompiler.testRecursionDepth1(TestJavascriptCompiler.java:279)
FAILED: org.apache.lucene.expressions.js.TestJavascriptCompiler.testRecursionDepth2()
Error Message:
java.lang.AssertionError: expected:<1024> but was:<-1>
Stack Trace:
java.lang.AssertionError: expected:<1024> but was:<-1>
at __randomizedtesting.SeedChain.seed([8EF4CF613F449C7A:74441E41FD54C054:8F24981E6C816608])
at junit@4.13.2/org.junit.Assert.fail(Assert.java:89)
at junit@4.13.2/org.junit.Assert.failNotEquals(Assert.java:835)
at junit@4.13.2/org.junit.Assert.assertEquals(Assert.java:647)
at junit@4.13.2/org.junit.Assert.assertEquals(Assert.java:633)
at org.apache.lucene.expressions.js.TestJavascriptCompiler.testRecursionDepth2(TestJavascriptCompiler.java:292)
FAILED: org.apache.lucene.expressions.js.TestJavascriptCompiler.testRecursionDepth1a()
Error Message:
java.lang.AssertionError: expected:<1024> but was:<-1>
Stack Trace:
java.lang.AssertionError: expected:<1024> but was:<-1>
at __randomizedtesting.SeedChain.seed([8EF4CF613F449C7A:74441E41FD54C054:FA58A42DD2731D3F])
at junit@4.13.2/org.junit.Assert.fail(Assert.java:89)
at junit@4.13.2/org.junit.Assert.failNotEquals(Assert.java:835)
at junit@4.13.2/org.junit.Assert.assertEquals(Assert.java:647)
at junit@4.13.2/org.junit.Assert.assertEquals(Assert.java:633)
at org.apache.lucene.expressions.js.TestJavascriptCompiler.testRecursionDepth1a(TestJavascriptCompiler.java:286)
Build Log:
[...truncated 1177 lines...]
ERROR: 3 tests have failed:
- org.apache.lucene.expressions.js.TestJavascriptCompiler.testRecursionDepth1a (:lucene:expressions)
Test output: /home/jenkins/jenkins-agent/workspace/Lucene/Lucene-Coverage-main/lucene/expressions/build/test-results/test/outputs/OUTPUT-org.apache.lucene.expressions.js.TestJavascriptCompiler.txt
Reproduce with: gradlew :lucene:expressions:test --tests "org.apache.lucene.expressions.js.TestJavascriptCompiler.testRecursionDepth1a" -Ptests.asserts=true -Ptests.coverage=true -Ptests.file.encoding=ISO-8859-1 -Ptests.gui=true -Ptests.haltonfailure=false -Ptests.jvmargs= -Ptests.jvms=4 -Ptests.multiplier=2 -Ptests.seed=8EF4CF613F449C7A -Ptests.vectorsize=256
- org.apache.lucene.expressions.js.TestJavascriptCompiler.testRecursionDepth1 (:lucene:expressions)
Test output: /home/jenkins/jenkins-agent/workspace/Lucene/Lucene-Coverage-main/lucene/expressions/build/test-results/test/outputs/OUTPUT-org.apache.lucene.expressions.js.TestJavascriptCompiler.txt
Reproduce with: gradlew :lucene:expressions:test --tests "org.apache.lucene.expressions.js.TestJavascriptCompiler.testRecursionDepth1" -Ptests.asserts=true -Ptests.coverage=true -Ptests.file.encoding=ISO-8859-1 -Ptests.gui=true -Ptests.haltonfailure=false -Ptests.jvmargs= -Ptests.jvms=4 -Ptests.multiplier=2 -Ptests.seed=8EF4CF613F449C7A -Ptests.vectorsize=256
- org.apache.lucene.expressions.js.TestJavascriptCompiler.testRecursionDepth2 (:lucene:expressions)
Test output: /home/jenkins/jenkins-agent/workspace/Lucene/Lucene-Coverage-main/lucene/expressions/build/test-results/test/outputs/OUTPUT-org.apache.lucene.expressions.js.TestJavascriptCompiler.txt
Reproduce with: gradlew :lucene:expressions:test --tests "org.apache.lucene.expressions.js.TestJavascriptCompiler.testRecursionDepth2" -Ptests.asserts=true -Ptests.coverage=true -Ptests.file.encoding=ISO-8859-1 -Ptests.gui=true -Ptests.haltonfailure=false -Ptests.jvmargs= -Ptests.jvms=4 -Ptests.multiplier=2 -Ptests.seed=8EF4CF613F449C7A -Ptests.vectorsize=256
The slowest tests during this run:
8.46s TestMultiRangeQueries.testOneDimensionCount (:lucene:sandbox)
8.42s TestTermOrdValComparatorAdaptiveSkipping.testAdaptiveDisablingFiresForInterleavedData (:lucene:core)
5.95s TestRangeFacetCounts.testRandomLongsMultiValued (:lucene:facet)
4.74s TestLongValueFacet.testRandomSingleValued (:lucene:sandbox)
4.26s TestSortOptimization.testSortOptimizationOnSortedNumericField (:lucene:core)
4.17s TestUnifiedHighlighterRanking.testRanking (:lucene:highlighter)
4.16s TestDocumentsWriterStallControl.testAcquireReleaseRace (:lucene:core)
4.11s TestLucene103PostingsFormat.testDocsAndFreqsAndPositionsAndOffsetsAndPayloads (:lucene:backward-codecs)
4.02s TestLucene90DocValuesFormatMergeInstance.testSparseDocValuesVsStoredFields (:lucene:core)
3.91s TestSortedSetDocValuesFacets.testRandom (:lucene:facet)
The slowest suites during this run:
26.45s TestLucene90DocValuesFormat (:lucene:core)
25.01s TestLucene90DocValuesFormatMergeInstance (:lucene:core)
24.51s TestBasicBackwardsCompatibility (:lucene:backward-codecs)
21.53s TestAssertingDocValuesFormat (:lucene:test-framework)
20.87s TestLucene90DocValuesFormatVariableSkipInterval (:lucene:core)
18.83s TestSimpleTextDocValuesFormat (:lucene:codecs)
16.70s TestAssertingPostingsFormat (:lucene:test-framework)
15.58s TestAssertingNormsFormat (:lucene:test-framework)
15.55s TestLucene99PostingsFormat (:lucene:backward-codecs)
14.76s TestFixedGapPostingsFormat (:lucene:codecs)
[Incubating] Problems report is available at: file:///home/jenkins/jenkins-agent/workspace/Lucene/Lucene-Coverage-main/build/reports/problems/problems-report.html
Deprecated Gradle features were used in this build, making it incompatible with Gradle 10.
You can use '--warning-mode all' to show the individual deprecation warnings and determine if they come from your own scripts or plugins.
For more on this, please refer to https://docs.gradle.org/9.6.1/userguide/command_line_interface.html#sec:command_line_warnings in the Gradle documentation.
BUILD SUCCESSFUL in 13m 18s
373 actionable tasks: 293 executed, 80 up-to-date
Consider enabling configuration cache to speed up this build: https://docs.gradle.org/9.6.1/userguide/configuration_cache_enabling.html
Build step 'Invoke Gradle script' changed build result to SUCCESS
Archiving artifacts
‘**/build*/**/tests-cwd/*.hprof’ doesn’t match anything: ‘**’ exists but not ‘**/build*/**/tests-cwd/*.hprof’
No artifacts found that match the file pattern "**/build*/**/tests-cwd/*.hprof,**/*_pid*.log". Configuration error?
Recording test results
[Checks API] No suitable checks publisher found.
Build step 'Publish JUnit test result report' changed build result to UNSTABLE
Email was triggered for: Unstable (Test Failures)
Sending email for trigger: Unstable (Test Failures)
[JENKINS] Lucene » Lucene-Coverage-main - Build # 1869 - Still Unstable!
Posted by Apache Jenkins Server <je...@builds.apache.org>.
Build: https://ci-builds.apache.org/job/Lucene/job/Lucene-Coverage-main/1869/
2 tests failed.
FAILED: org.apache.lucene.expressions.js.TestJavascriptCompiler.testRecursionDepth2()
Error Message:
java.lang.AssertionError: expected:<1024> but was:<-1>
Stack Trace:
java.lang.AssertionError: expected:<1024> but was:<-1>
at __randomizedtesting.SeedChain.seed([6CFC225ED5A2E113:964CF37E17B2BD3D:6D2C752186671B61])
at junit@4.13.2/org.junit.Assert.fail(Assert.java:89)
at junit@4.13.2/org.junit.Assert.failNotEquals(Assert.java:835)
at junit@4.13.2/org.junit.Assert.assertEquals(Assert.java:647)
at junit@4.13.2/org.junit.Assert.assertEquals(Assert.java:633)
at org.apache.lucene.expressions.js.TestJavascriptCompiler.testRecursionDepth2(TestJavascriptCompiler.java:292)
FAILED: org.apache.lucene.expressions.js.TestJavascriptCompiler.testRecursionDepth1a()
Error Message:
java.lang.AssertionError: expected:<1024> but was:<-1>
Stack Trace:
java.lang.AssertionError: expected:<1024> but was:<-1>
at __randomizedtesting.SeedChain.seed([6CFC225ED5A2E113:964CF37E17B2BD3D:1850491238956056])
at junit@4.13.2/org.junit.Assert.fail(Assert.java:89)
at junit@4.13.2/org.junit.Assert.failNotEquals(Assert.java:835)
at junit@4.13.2/org.junit.Assert.assertEquals(Assert.java:647)
at junit@4.13.2/org.junit.Assert.assertEquals(Assert.java:633)
at org.apache.lucene.expressions.js.TestJavascriptCompiler.testRecursionDepth1a(TestJavascriptCompiler.java:286)
Build Log:
[...truncated 1161 lines...]
ERROR: 2 tests have failed:
- org.apache.lucene.expressions.js.TestJavascriptCompiler.testRecursionDepth2 (:lucene:expressions)
Test output: /home/jenkins/jenkins-agent/workspace/Lucene/Lucene-Coverage-main/lucene/expressions/build/test-results/test/outputs/OUTPUT-org.apache.lucene.expressions.js.TestJavascriptCompiler.txt
Reproduce with: gradlew :lucene:expressions:test --tests "org.apache.lucene.expressions.js.TestJavascriptCompiler.testRecursionDepth2" -Ptests.asserts=true -Ptests.coverage=true -Ptests.file.encoding=US-ASCII -Ptests.gui=true -Ptests.haltonfailure=false -Ptests.jvmargs= -Ptests.jvms=4 -Ptests.multiplier=2 -Ptests.seed=6CFC225ED5A2E113 -Ptests.vectorsize=128
- org.apache.lucene.expressions.js.TestJavascriptCompiler.testRecursionDepth1a (:lucene:expressions)
Test output: /home/jenkins/jenkins-agent/workspace/Lucene/Lucene-Coverage-main/lucene/expressions/build/test-results/test/outputs/OUTPUT-org.apache.lucene.expressions.js.TestJavascriptCompiler.txt
Reproduce with: gradlew :lucene:expressions:test --tests "org.apache.lucene.expressions.js.TestJavascriptCompiler.testRecursionDepth1a" -Ptests.asserts=true -Ptests.coverage=true -Ptests.file.encoding=US-ASCII -Ptests.gui=true -Ptests.haltonfailure=false -Ptests.jvmargs= -Ptests.jvms=4 -Ptests.multiplier=2 -Ptests.seed=6CFC225ED5A2E113 -Ptests.vectorsize=128
The slowest tests during this run:
15.98s TestDocValuesRewriteMethod.testRegexps (:lucene:core)
14.85s TestRangeOnRangeFacetCounts.testRandomMultiDimLongs (:lucene:facet)
13.59s TestSimpleTextNormsFormat.testThreads (:lucene:codecs)
6.38s TestAllGroupHeadsCollector.testRandom (:lucene:grouping)
5.63s TestLongValueFacet.testRandomMultiValued (:lucene:sandbox)
5.01s TestLatLonMultiPolygonShapeQueries.testRandomMedium (:lucene:core)
4.66s TestCommonTermsQuery.testRandomIndex (:lucene:queries)
4.61s TestAssertingNormsFormat.testOutliers2 (:lucene:test-framework)
4.39s TestRangeOnRangeFacetCounts.testRandomSingleDimLongs (:lucene:facet)
4.35s TestRangeOnRangeFacetCounts.testRandomSingleDimDoubles (:lucene:facet)
The slowest suites during this run:
27.96s TestLucene90DocValuesFormat (:lucene:core)
25.34s TestLucene90DocValuesFormatMergeInstance (:lucene:core)
24.71s TestRangeOnRangeFacetCounts (:lucene:facet)
24.39s TestAssertingDocValuesFormat (:lucene:test-framework)
23.38s TestSimpleTextNormsFormat (:lucene:codecs)
23.26s TestBasicBackwardsCompatibility (:lucene:backward-codecs)
22.58s TestLucene90DocValuesFormatVariableSkipInterval (:lucene:core)
17.34s TestSimpleTextDocValuesFormat (:lucene:codecs)
16.40s TestVarGapFixedIntervalPostingsFormat (:lucene:codecs)
16.30s TestPerFieldDocValuesFormat (:lucene:core)
[Incubating] Problems report is available at: file:///home/jenkins/jenkins-agent/workspace/Lucene/Lucene-Coverage-main/build/reports/problems/problems-report.html
Deprecated Gradle features were used in this build, making it incompatible with Gradle 10.
You can use '--warning-mode all' to show the individual deprecation warnings and determine if they come from your own scripts or plugins.
For more on this, please refer to https://docs.gradle.org/9.6.1/userguide/command_line_interface.html#sec:command_line_warnings in the Gradle documentation.
BUILD SUCCESSFUL in 13m 49s
373 actionable tasks: 293 executed, 80 up-to-date
Consider enabling configuration cache to speed up this build: https://docs.gradle.org/9.6.1/userguide/configuration_cache_enabling.html
Build step 'Invoke Gradle script' changed build result to SUCCESS
Archiving artifacts
‘**/build*/**/tests-cwd/*.hprof’ doesn’t match anything: ‘**’ exists but not ‘**/build*/**/tests-cwd/*.hprof’
No artifacts found that match the file pattern "**/build*/**/tests-cwd/*.hprof,**/*_pid*.log". Configuration error?
Recording test results
[Checks API] No suitable checks publisher found.
Build step 'Publish JUnit test result report' changed build result to UNSTABLE
Email was triggered for: Unstable (Test Failures)
Sending email for trigger: Unstable (Test Failures)
[JENKINS] Lucene » Lucene-Coverage-main - Build # 1868 - Still Unstable!
Posted by Apache Jenkins Server <je...@builds.apache.org>.
Build: https://ci-builds.apache.org/job/Lucene/job/Lucene-Coverage-main/1868/
1 tests failed.
FAILED: org.apache.lucene.expressions.js.TestJavascriptCompiler.testRecursionDepth1a()
Error Message:
java.lang.AssertionError: expected:<1024> but was:<-1>
Stack Trace:
java.lang.AssertionError: expected:<1024> but was:<-1>
at __randomizedtesting.SeedChain.seed([A1A1FA3E1AA89E1C:5B112B1ED8B8C232:D50D9172F79F1F59])
at junit@4.13.2/org.junit.Assert.fail(Assert.java:89)
at junit@4.13.2/org.junit.Assert.failNotEquals(Assert.java:835)
at junit@4.13.2/org.junit.Assert.assertEquals(Assert.java:647)
at junit@4.13.2/org.junit.Assert.assertEquals(Assert.java:633)
at org.apache.lucene.expressions.js.TestJavascriptCompiler.testRecursionDepth1a(TestJavascriptCompiler.java:286)
Build Log:
[...truncated 1146 lines...]
ERROR: 1 test has failed:
- org.apache.lucene.expressions.js.TestJavascriptCompiler.testRecursionDepth1a (:lucene:expressions)
Test output: /home/jenkins/jenkins-agent/workspace/Lucene/Lucene-Coverage-main/lucene/expressions/build/test-results/test/outputs/OUTPUT-org.apache.lucene.expressions.js.TestJavascriptCompiler.txt
Reproduce with: gradlew :lucene:expressions:test --tests "org.apache.lucene.expressions.js.TestJavascriptCompiler.testRecursionDepth1a" -Ptests.asserts=false -Ptests.coverage=true -Ptests.file.encoding=UTF-8 -Ptests.gui=true -Ptests.haltonfailure=false -Ptests.jvmargs= -Ptests.jvms=4 -Ptests.multiplier=2 -Ptests.seed=A1A1FA3E1AA89E1C -Ptests.vectorsize=128
The slowest tests during this run:
29.20s TestRangeFacetCounts.testRandomLongsMultiValued (:lucene:facet)
8.38s TestLatLonMultiPolygonShapeQueries.testRandomMedium (:lucene:core)
7.17s TestRangeOnRangeFacetCounts.testRandomMultiDimDoubles (:lucene:facet)
5.36s TestAllGroupHeadsCollector.testRandom (:lucene:grouping)
5.36s TestLucene90DocValuesFormat.testSparseDocValuesVsStoredFields (:lucene:core)
5.13s TestPerFieldPostingsFormat2.testStressPerFieldCodec (:lucene:core)
4.80s TestRangeOnRangeFacetCounts.testRandomSingleDimLongs (:lucene:facet)
4.78s TestLatLonMultiLineShapeQueries.testRandomMedium (:lucene:core)
4.62s TestLucene90DocValuesFormatMergeInstance.testSparseDocValuesVsStoredFields (:lucene:core)
4.43s TestRangeOnRangeFacetCounts.testRandomSingleDimDoubles (:lucene:facet)
The slowest suites during this run:
31.65s TestRangeFacetCounts (:lucene:facet)
28.37s TestBasicBackwardsCompatibility (:lucene:backward-codecs)
26.16s TestLucene90DocValuesFormat (:lucene:core)
23.02s TestLucene90DocValuesFormatMergeInstance (:lucene:core)
22.14s TestAssertingDocValuesFormat (:lucene:test-framework)
19.10s TestLucene90DocValuesFormatVariableSkipInterval (:lucene:core)
18.71s TestSimpleTextDocValuesFormat (:lucene:codecs)
17.48s TestRangeOnRangeFacetCounts (:lucene:facet)
16.36s TestAssertingPostingsFormat (:lucene:test-framework)
15.79s TestAssertingNormsFormat (:lucene:test-framework)
[Incubating] Problems report is available at: file:///home/jenkins/jenkins-agent/workspace/Lucene/Lucene-Coverage-main/build/reports/problems/problems-report.html
Deprecated Gradle features were used in this build, making it incompatible with Gradle 10.
You can use '--warning-mode all' to show the individual deprecation warnings and determine if they come from your own scripts or plugins.
For more on this, please refer to https://docs.gradle.org/9.6.1/userguide/command_line_interface.html#sec:command_line_warnings in the Gradle documentation.
BUILD SUCCESSFUL in 13m 39s
373 actionable tasks: 293 executed, 80 up-to-date
Consider enabling configuration cache to speed up this build: https://docs.gradle.org/9.6.1/userguide/configuration_cache_enabling.html
Build step 'Invoke Gradle script' changed build result to SUCCESS
Archiving artifacts
‘**/build*/**/tests-cwd/*.hprof’ doesn’t match anything: ‘**’ exists but not ‘**/build*/**/tests-cwd/*.hprof’
No artifacts found that match the file pattern "**/build*/**/tests-cwd/*.hprof,**/*_pid*.log". Configuration error?
Recording test results
[Checks API] No suitable checks publisher found.
Build step 'Publish JUnit test result report' changed build result to UNSTABLE
Email was triggered for: Unstable (Test Failures)
Sending email for trigger: Unstable (Test Failures)
[JENKINS] Lucene » Lucene-Coverage-main - Build # 1867 - Still Unstable!
Posted by Apache Jenkins Server <je...@builds.apache.org>.
Build: https://ci-builds.apache.org/job/Lucene/job/Lucene-Coverage-main/1867/
3 tests failed.
FAILED: org.apache.lucene.expressions.js.TestJavascriptCompiler.testRecursionDepth2()
Error Message:
java.lang.AssertionError: expected:<1024> but was:<-1>
Stack Trace:
java.lang.AssertionError: expected:<1024> but was:<-1>
at __randomizedtesting.SeedChain.seed([D99B6DCB41F15551:232BBCEB83E1097F:D84B3AB41234AF23])
at junit@4.13.2/org.junit.Assert.fail(Assert.java:89)
at junit@4.13.2/org.junit.Assert.failNotEquals(Assert.java:835)
at junit@4.13.2/org.junit.Assert.assertEquals(Assert.java:647)
at junit@4.13.2/org.junit.Assert.assertEquals(Assert.java:633)
at org.apache.lucene.expressions.js.TestJavascriptCompiler.testRecursionDepth2(TestJavascriptCompiler.java:292)
FAILED: org.apache.lucene.expressions.js.TestJavascriptCompiler.testRecursionDepth1()
Error Message:
java.lang.AssertionError: expected:<1024> but was:<-1>
Stack Trace:
java.lang.AssertionError: expected:<1024> but was:<-1>
at __randomizedtesting.SeedChain.seed([D99B6DCB41F15551:232BBCEB83E1097F:6814FD02A80B528F])
at junit@4.13.2/org.junit.Assert.fail(Assert.java:89)
at junit@4.13.2/org.junit.Assert.failNotEquals(Assert.java:835)
at junit@4.13.2/org.junit.Assert.assertEquals(Assert.java:647)
at junit@4.13.2/org.junit.Assert.assertEquals(Assert.java:633)
at org.apache.lucene.expressions.js.TestJavascriptCompiler.testRecursionDepth1(TestJavascriptCompiler.java:279)
FAILED: org.apache.lucene.expressions.js.TestJavascriptCompiler.testRecursionDepth1a()
Error Message:
java.lang.AssertionError: expected:<1024> but was:<-1>
Stack Trace:
java.lang.AssertionError: expected:<1024> but was:<-1>
at __randomizedtesting.SeedChain.seed([D99B6DCB41F15551:232BBCEB83E1097F:AD370687ACC6D414])
at junit@4.13.2/org.junit.Assert.fail(Assert.java:89)
at junit@4.13.2/org.junit.Assert.failNotEquals(Assert.java:835)
at junit@4.13.2/org.junit.Assert.assertEquals(Assert.java:647)
at junit@4.13.2/org.junit.Assert.assertEquals(Assert.java:633)
at org.apache.lucene.expressions.js.TestJavascriptCompiler.testRecursionDepth1a(TestJavascriptCompiler.java:286)
Build Log:
[...truncated 1177 lines...]
ERROR: 3 tests have failed:
- org.apache.lucene.expressions.js.TestJavascriptCompiler.testRecursionDepth1 (:lucene:expressions)
Test output: /home/jenkins/jenkins-agent/workspace/Lucene/Lucene-Coverage-main/lucene/expressions/build/test-results/test/outputs/OUTPUT-org.apache.lucene.expressions.js.TestJavascriptCompiler.txt
Reproduce with: gradlew :lucene:expressions:test --tests "org.apache.lucene.expressions.js.TestJavascriptCompiler.testRecursionDepth1" -Ptests.asserts=true -Ptests.coverage=true -Ptests.file.encoding=UTF-8 -Ptests.gui=true -Ptests.haltonfailure=false -Ptests.jvmargs= -Ptests.jvms=4 -Ptests.multiplier=2 -Ptests.seed=D99B6DCB41F15551 -Ptests.vectorsize=256
- org.apache.lucene.expressions.js.TestJavascriptCompiler.testRecursionDepth1a (:lucene:expressions)
Test output: /home/jenkins/jenkins-agent/workspace/Lucene/Lucene-Coverage-main/lucene/expressions/build/test-results/test/outputs/OUTPUT-org.apache.lucene.expressions.js.TestJavascriptCompiler.txt
Reproduce with: gradlew :lucene:expressions:test --tests "org.apache.lucene.expressions.js.TestJavascriptCompiler.testRecursionDepth1a" -Ptests.asserts=true -Ptests.coverage=true -Ptests.file.encoding=UTF-8 -Ptests.gui=true -Ptests.haltonfailure=false -Ptests.jvmargs= -Ptests.jvms=4 -Ptests.multiplier=2 -Ptests.seed=D99B6DCB41F15551 -Ptests.vectorsize=256
- org.apache.lucene.expressions.js.TestJavascriptCompiler.testRecursionDepth2 (:lucene:expressions)
Test output: /home/jenkins/jenkins-agent/workspace/Lucene/Lucene-Coverage-main/lucene/expressions/build/test-results/test/outputs/OUTPUT-org.apache.lucene.expressions.js.TestJavascriptCompiler.txt
Reproduce with: gradlew :lucene:expressions:test --tests "org.apache.lucene.expressions.js.TestJavascriptCompiler.testRecursionDepth2" -Ptests.asserts=true -Ptests.coverage=true -Ptests.file.encoding=UTF-8 -Ptests.gui=true -Ptests.haltonfailure=false -Ptests.jvmargs= -Ptests.jvms=4 -Ptests.multiplier=2 -Ptests.seed=D99B6DCB41F15551 -Ptests.vectorsize=256
The slowest tests during this run:
7.33s TestLucene90DocValuesFormat.testSparseDocValuesVsStoredFields (:lucene:core)
6.09s TestAllGroupHeadsCollector.testRandom (:lucene:grouping)
6.02s TestLatLonPolygonShapeQueries.testRandomMedium (:lucene:core)
5.99s TestLucene90DocValuesFormatMergeInstance.testSparseDocValuesVsStoredFields (:lucene:core)
5.30s TestSortOptimization.testSortOptimizationOnSortedNumericField (:lucene:core)
5.00s TestRangeFacetCounts.testRandomLongsMultiValued (:lucene:facet)
4.99s TestAssertingNormsFormat.testFullLongRange (:lucene:test-framework)
4.28s TestRangeOnRangeFacetCounts.testRandomSingleDimDoubles (:lucene:facet)
4.13s TestGroupFacetCollector.testRandom (:lucene:grouping)
3.63s TestAssertingDocValuesFormat.testSortedSetFixedLengthFewUniqueSetsVsStoredFields (:lucene:test-framework)
The slowest suites during this run:
27.52s TestLucene90DocValuesFormat (:lucene:core)
25.16s TestBasicBackwardsCompatibility (:lucene:backward-codecs)
24.48s TestLucene90DocValuesFormatMergeInstance (:lucene:core)
20.74s TestAssertingDocValuesFormat (:lucene:test-framework)
20.30s TestSimpleTextDocValuesFormat (:lucene:codecs)
19.92s TestLucene90DocValuesFormatVariableSkipInterval (:lucene:core)
15.07s TestAssertingNormsFormat (:lucene:test-framework)
14.29s TestVarGapFixedIntervalPostingsFormat (:lucene:codecs)
13.92s TestFixedGapPostingsFormat (:lucene:codecs)
13.76s TestAssertingPostingsFormat (:lucene:test-framework)
[Incubating] Problems report is available at: file:///home/jenkins/jenkins-agent/workspace/Lucene/Lucene-Coverage-main/build/reports/problems/problems-report.html
Deprecated Gradle features were used in this build, making it incompatible with Gradle 10.
You can use '--warning-mode all' to show the individual deprecation warnings and determine if they come from your own scripts or plugins.
For more on this, please refer to https://docs.gradle.org/9.6.1/userguide/command_line_interface.html#sec:command_line_warnings in the Gradle documentation.
BUILD SUCCESSFUL in 13m 13s
373 actionable tasks: 293 executed, 80 up-to-date
Consider enabling configuration cache to speed up this build: https://docs.gradle.org/9.6.1/userguide/configuration_cache_enabling.html
Build step 'Invoke Gradle script' changed build result to SUCCESS
Archiving artifacts
‘**/build*/**/tests-cwd/*.hprof’ doesn’t match anything: ‘**’ exists but not ‘**/build*/**/tests-cwd/*.hprof’
No artifacts found that match the file pattern "**/build*/**/tests-cwd/*.hprof,**/*_pid*.log". Configuration error?
Recording test results
[Checks API] No suitable checks publisher found.
Build step 'Publish JUnit test result report' changed build result to UNSTABLE
Email was triggered for: Unstable (Test Failures)
Sending email for trigger: Unstable (Test Failures)
[JENKINS] Lucene » Lucene-Coverage-main - Build # 1866 - Still Unstable!
Posted by Apache Jenkins Server <je...@builds.apache.org>.
Build: https://ci-builds.apache.org/job/Lucene/job/Lucene-Coverage-main/1866/
2 tests failed.
FAILED: org.apache.lucene.expressions.js.TestJavascriptCompiler.testRecursionDepth1()
Error Message:
java.lang.AssertionError: expected:<1024> but was:<-1>
Stack Trace:
java.lang.AssertionError: expected:<1024> but was:<-1>
at __randomizedtesting.SeedChain.seed([BA68DD4546834D63:40D80C658493114D:BE74D8CAF794ABD])
at junit@4.13.2/org.junit.Assert.fail(Assert.java:89)
at junit@4.13.2/org.junit.Assert.failNotEquals(Assert.java:835)
at junit@4.13.2/org.junit.Assert.assertEquals(Assert.java:647)
at junit@4.13.2/org.junit.Assert.assertEquals(Assert.java:633)
at org.apache.lucene.expressions.js.TestJavascriptCompiler.testRecursionDepth1(TestJavascriptCompiler.java:279)
FAILED: org.apache.lucene.expressions.js.TestJavascriptCompiler.testRecursionDepth1a()
Error Message:
java.lang.AssertionError: expected:<1024> but was:<-1>
Stack Trace:
java.lang.AssertionError: expected:<1024> but was:<-1>
at __randomizedtesting.SeedChain.seed([BA68DD4546834D63:40D80C658493114D:CEC4B609ABB4CC26])
at junit@4.13.2/org.junit.Assert.fail(Assert.java:89)
at junit@4.13.2/org.junit.Assert.failNotEquals(Assert.java:835)
at junit@4.13.2/org.junit.Assert.assertEquals(Assert.java:647)
at junit@4.13.2/org.junit.Assert.assertEquals(Assert.java:633)
at org.apache.lucene.expressions.js.TestJavascriptCompiler.testRecursionDepth1a(TestJavascriptCompiler.java:286)
Build Log:
[...truncated 1162 lines...]
ERROR: 2 tests have failed:
- org.apache.lucene.expressions.js.TestJavascriptCompiler.testRecursionDepth1 (:lucene:expressions)
Test output: /home/jenkins/jenkins-agent/workspace/Lucene/Lucene-Coverage-main/lucene/expressions/build/test-results/test/outputs/OUTPUT-org.apache.lucene.expressions.js.TestJavascriptCompiler.txt
Reproduce with: gradlew :lucene:expressions:test --tests "org.apache.lucene.expressions.js.TestJavascriptCompiler.testRecursionDepth1" -Ptests.asserts=true -Ptests.coverage=true -Ptests.file.encoding=US-ASCII -Ptests.gui=true -Ptests.haltonfailure=false -Ptests.jvmargs= -Ptests.jvms=4 -Ptests.multiplier=2 -Ptests.seed=BA68DD4546834D63 -Ptests.vectorsize=128
- org.apache.lucene.expressions.js.TestJavascriptCompiler.testRecursionDepth1a (:lucene:expressions)
Test output: /home/jenkins/jenkins-agent/workspace/Lucene/Lucene-Coverage-main/lucene/expressions/build/test-results/test/outputs/OUTPUT-org.apache.lucene.expressions.js.TestJavascriptCompiler.txt
Reproduce with: gradlew :lucene:expressions:test --tests "org.apache.lucene.expressions.js.TestJavascriptCompiler.testRecursionDepth1a" -Ptests.asserts=true -Ptests.coverage=true -Ptests.file.encoding=US-ASCII -Ptests.gui=true -Ptests.haltonfailure=false -Ptests.jvmargs= -Ptests.jvms=4 -Ptests.multiplier=2 -Ptests.seed=BA68DD4546834D63 -Ptests.vectorsize=128
The slowest tests during this run:
9.25s TestRangeFacetCounts.testRandomLongsMultiValued (:lucene:facet)
6.97s TestLatLonMultiPolygonShapeQueries.testRandomMedium (:lucene:core)
5.66s TestLucene90DocValuesFormat.testSparseDocValuesVsStoredFields (:lucene:core)
5.21s TestMultiRangeQueries.testOneDimensionCount (:lucene:sandbox)
5.19s TestLatLonMultiLineShapeQueries.testRandomMedium (:lucene:core)
4.82s TestSimpleTextNormsFormat.testThreads (:lucene:codecs)
4.80s TestAssertingDocValuesFormat.testSortedNumericsSingleValuedVsStoredFields (:lucene:test-framework)
4.70s TestDuelingCodecs.testCrazyReaderEquals (:lucene:core)
4.27s TestLazyDocument.testLazy (:lucene:misc)
4.11s TestDistinctValuesCollector.testRandom (:lucene:grouping)
The slowest suites during this run:
27.26s TestLucene90DocValuesFormat (:lucene:core)
26.20s TestBasicBackwardsCompatibility (:lucene:backward-codecs)
21.50s TestAssertingDocValuesFormat (:lucene:test-framework)
20.81s TestAssertingPostingsFormat (:lucene:test-framework)
20.04s TestLucene90DocValuesFormatMergeInstance (:lucene:core)
18.08s TestFixedGapPostingsFormat (:lucene:codecs)
16.74s TestSimpleTextDocValuesFormat (:lucene:codecs)
16.63s TestLucene90DocValuesFormatVariableSkipInterval (:lucene:core)
15.55s TestAssertingNormsFormat (:lucene:test-framework)
14.40s TestSimpleTextNormsFormat (:lucene:codecs)
[Incubating] Problems report is available at: file:///home/jenkins/jenkins-agent/workspace/Lucene/Lucene-Coverage-main/build/reports/problems/problems-report.html
Deprecated Gradle features were used in this build, making it incompatible with Gradle 10.
You can use '--warning-mode all' to show the individual deprecation warnings and determine if they come from your own scripts or plugins.
For more on this, please refer to https://docs.gradle.org/9.6.1/userguide/command_line_interface.html#sec:command_line_warnings in the Gradle documentation.
BUILD SUCCESSFUL in 13m 10s
373 actionable tasks: 293 executed, 80 up-to-date
Consider enabling configuration cache to speed up this build: https://docs.gradle.org/9.6.1/userguide/configuration_cache_enabling.html
Build step 'Invoke Gradle script' changed build result to SUCCESS
Archiving artifacts
‘**/build*/**/tests-cwd/*.hprof’ doesn’t match anything: ‘**’ exists but not ‘**/build*/**/tests-cwd/*.hprof’
No artifacts found that match the file pattern "**/build*/**/tests-cwd/*.hprof,**/*_pid*.log". Configuration error?
Recording test results
[Checks API] No suitable checks publisher found.
Build step 'Publish JUnit test result report' changed build result to UNSTABLE
Email was triggered for: Unstable (Test Failures)
Sending email for trigger: Unstable (Test Failures)
[JENKINS] Lucene » Lucene-Coverage-main - Build # 1865 - Still Unstable!
Posted by Apache Jenkins Server <je...@builds.apache.org>.
Build: https://ci-builds.apache.org/job/Lucene/job/Lucene-Coverage-main/1865/
1 tests failed.
FAILED: org.apache.lucene.expressions.js.TestJavascriptCompiler.testRecursionDepth1a()
Error Message:
java.lang.AssertionError: expected:<1024> but was:<-1>
Stack Trace:
java.lang.AssertionError: expected:<1024> but was:<-1>
at __randomizedtesting.SeedChain.seed([2072644DC4C6A3C6:DAC2B56D06D6FFE8:54DE0F0129F12283])
at junit@4.13.2/org.junit.Assert.fail(Assert.java:89)
at junit@4.13.2/org.junit.Assert.failNotEquals(Assert.java:835)
at junit@4.13.2/org.junit.Assert.assertEquals(Assert.java:647)
at junit@4.13.2/org.junit.Assert.assertEquals(Assert.java:633)
at org.apache.lucene.expressions.js.TestJavascriptCompiler.testRecursionDepth1a(TestJavascriptCompiler.java:286)
Build Log:
[...truncated 1145 lines...]
ERROR: 1 test has failed:
- org.apache.lucene.expressions.js.TestJavascriptCompiler.testRecursionDepth1a (:lucene:expressions)
Test output: /home/jenkins/jenkins-agent/workspace/Lucene/Lucene-Coverage-main/lucene/expressions/build/test-results/test/outputs/OUTPUT-org.apache.lucene.expressions.js.TestJavascriptCompiler.txt
Reproduce with: gradlew :lucene:expressions:test --tests "org.apache.lucene.expressions.js.TestJavascriptCompiler.testRecursionDepth1a" -Ptests.asserts=true -Ptests.coverage=true -Ptests.file.encoding=ISO-8859-1 -Ptests.gui=true -Ptests.haltonfailure=false -Ptests.jvmargs= -Ptests.jvms=4 -Ptests.multiplier=2 -Ptests.seed=2072644DC4C6A3C6 -Ptests.vectorsize=512
The slowest tests during this run:
5.98s TestAssertingNormsFormat.testMostZeros (:lucene:test-framework)
5.20s TestLatLonMultiPolygonShapeQueries.testRandomMedium (:lucene:core)
5.12s TestTermOrdValComparatorAdaptiveSkipping.testSkippingEffectiveForClusteredData (:lucene:core)
4.96s TestPerFieldPostingsFormat2.testStressPerFieldCodec (:lucene:core)
4.81s TestCompressingTermVectorsFormat.testMergeStability (:lucene:core)
4.74s TestLucene90DocValuesFormatMergeInstance.testSparseDocValuesVsStoredFields (:lucene:core)
4.33s TestAddTaxonomy.testConcurrency (:lucene:facet)
4.33s TestRangeOnRangeFacetCounts.testRandomSingleDimDoubles (:lucene:facet)
4.25s TestAllGroupHeadsCollector.testRandom (:lucene:grouping)
4.20s TestUnifiedHighlighterRanking.testRanking (:lucene:highlighter)
The slowest suites during this run:
28.35s TestLucene90DocValuesFormatMergeInstance (:lucene:core)
27.87s TestLucene90DocValuesFormat (:lucene:core)
23.85s TestAssertingDocValuesFormat (:lucene:test-framework)
23.72s TestBasicBackwardsCompatibility (:lucene:backward-codecs)
19.11s TestLucene90DocValuesFormatVariableSkipInterval (:lucene:core)
18.79s TestSimpleTextDocValuesFormat (:lucene:codecs)
15.91s TestAssertingPostingsFormat (:lucene:test-framework)
15.73s TestAssertingNormsFormat (:lucene:test-framework)
12.71s TestSimpleTextNormsFormat (:lucene:codecs)
12.46s TestPerFieldDocValuesFormat (:lucene:core)
[Incubating] Problems report is available at: file:///home/jenkins/jenkins-agent/workspace/Lucene/Lucene-Coverage-main/build/reports/problems/problems-report.html
Deprecated Gradle features were used in this build, making it incompatible with Gradle 10.
You can use '--warning-mode all' to show the individual deprecation warnings and determine if they come from your own scripts or plugins.
For more on this, please refer to https://docs.gradle.org/9.6.1/userguide/command_line_interface.html#sec:command_line_warnings in the Gradle documentation.
BUILD SUCCESSFUL in 13m 7s
373 actionable tasks: 293 executed, 80 up-to-date
Consider enabling configuration cache to speed up this build: https://docs.gradle.org/9.6.1/userguide/configuration_cache_enabling.html
Build step 'Invoke Gradle script' changed build result to SUCCESS
Archiving artifacts
‘**/build*/**/tests-cwd/*.hprof’ doesn’t match anything: ‘**’ exists but not ‘**/build*/**/tests-cwd/*.hprof’
No artifacts found that match the file pattern "**/build*/**/tests-cwd/*.hprof,**/*_pid*.log". Configuration error?
Recording test results
[Checks API] No suitable checks publisher found.
Build step 'Publish JUnit test result report' changed build result to UNSTABLE
Email was triggered for: Unstable (Test Failures)
Sending email for trigger: Unstable (Test Failures)
[JENKINS] Lucene » Lucene-Coverage-main - Build # 1864 - Still Unstable!
Posted by Apache Jenkins Server <je...@builds.apache.org>.
Build: https://ci-builds.apache.org/job/Lucene/job/Lucene-Coverage-main/1864/
2 tests failed.
FAILED: org.apache.lucene.expressions.js.TestJavascriptCompiler.testRecursionDepth1a()
Error Message:
java.lang.AssertionError: expected:<1024> but was:<-1>
Stack Trace:
java.lang.AssertionError: expected:<1024> but was:<-1>
at __randomizedtesting.SeedChain.seed([5CC24873123F6BA9:A6729953D02F3787:286E233FFF08EAEC])
at junit@4.13.2/org.junit.Assert.fail(Assert.java:89)
at junit@4.13.2/org.junit.Assert.failNotEquals(Assert.java:835)
at junit@4.13.2/org.junit.Assert.assertEquals(Assert.java:647)
at junit@4.13.2/org.junit.Assert.assertEquals(Assert.java:633)
at org.apache.lucene.expressions.js.TestJavascriptCompiler.testRecursionDepth1a(TestJavascriptCompiler.java:286)
FAILED: org.apache.lucene.expressions.js.TestJavascriptCompiler.testRecursionDepth1()
Error Message:
java.lang.AssertionError: expected:<1024> but was:<-1>
Stack Trace:
java.lang.AssertionError: expected:<1024> but was:<-1>
at __randomizedtesting.SeedChain.seed([5CC24873123F6BA9:A6729953D02F3787:ED4DD8BAFBC56C77])
at junit@4.13.2/org.junit.Assert.fail(Assert.java:89)
at junit@4.13.2/org.junit.Assert.failNotEquals(Assert.java:835)
at junit@4.13.2/org.junit.Assert.assertEquals(Assert.java:647)
at junit@4.13.2/org.junit.Assert.assertEquals(Assert.java:633)
at org.apache.lucene.expressions.js.TestJavascriptCompiler.testRecursionDepth1(TestJavascriptCompiler.java:279)
Build Log:
[...truncated 1161 lines...]
ERROR: 2 tests have failed:
- org.apache.lucene.expressions.js.TestJavascriptCompiler.testRecursionDepth1 (:lucene:expressions)
Test output: /home/jenkins/jenkins-agent/workspace/Lucene/Lucene-Coverage-main/lucene/expressions/build/test-results/test/outputs/OUTPUT-org.apache.lucene.expressions.js.TestJavascriptCompiler.txt
Reproduce with: gradlew :lucene:expressions:test --tests "org.apache.lucene.expressions.js.TestJavascriptCompiler.testRecursionDepth1" -Ptests.asserts=false -Ptests.coverage=true -Ptests.file.encoding=US-ASCII -Ptests.gui=true -Ptests.haltonfailure=false -Ptests.jvmargs= -Ptests.jvms=4 -Ptests.multiplier=2 -Ptests.seed=5CC24873123F6BA9 -Ptests.vectorsize=default
- org.apache.lucene.expressions.js.TestJavascriptCompiler.testRecursionDepth1a (:lucene:expressions)
Test output: /home/jenkins/jenkins-agent/workspace/Lucene/Lucene-Coverage-main/lucene/expressions/build/test-results/test/outputs/OUTPUT-org.apache.lucene.expressions.js.TestJavascriptCompiler.txt
Reproduce with: gradlew :lucene:expressions:test --tests "org.apache.lucene.expressions.js.TestJavascriptCompiler.testRecursionDepth1a" -Ptests.asserts=false -Ptests.coverage=true -Ptests.file.encoding=US-ASCII -Ptests.gui=true -Ptests.haltonfailure=false -Ptests.jvmargs= -Ptests.jvms=4 -Ptests.multiplier=2 -Ptests.seed=5CC24873123F6BA9 -Ptests.vectorsize=default
The slowest tests during this run:
15.09s TestSimpleTextNormsFormat.testThreads (:lucene:codecs)
12.31s TestRangeOnRangeFacetCounts.testRandomMultiDimLongs (:lucene:facet)
6.64s TestNeverDelete.testIndexing (:lucene:core)
4.89s TestStressAdvance.testStressAdvance (:lucene:core)
4.50s TestRangeFacetCounts.testRandomLongsMultiValued (:lucene:facet)
4.29s TestAssertingPostingsFormat.testDocsAndFreqsAndPositionsAndOffsetsAndPayloads (:lucene:test-framework)
4.26s TestSortedSetDocValuesFacets.testRandom (:lucene:facet)
4.11s TestSimpleTextPointsFormat.testOneDimTwoValues (:lucene:codecs)
4.05s TestLucene90DocValuesFormat.testSparseDocValuesVsStoredFields (:lucene:core)
3.66s TestCommonTermsQuery.testRandomIndex (:lucene:queries)
The slowest suites during this run:
31.53s TestLucene90DocValuesFormat (:lucene:core)
25.63s TestLucene90DocValuesFormatMergeInstance (:lucene:core)
25.53s TestSimpleTextNormsFormat (:lucene:codecs)
23.92s TestLucene90DocValuesFormatVariableSkipInterval (:lucene:core)
21.99s TestBasicBackwardsCompatibility (:lucene:backward-codecs)
21.89s TestAssertingDocValuesFormat (:lucene:test-framework)
20.90s TestSimpleTextDocValuesFormat (:lucene:codecs)
18.73s TestAssertingPostingsFormat (:lucene:test-framework)
18.05s TestFixedGapPostingsFormat (:lucene:codecs)
16.06s TestRangeOnRangeFacetCounts (:lucene:facet)
[Incubating] Problems report is available at: file:///home/jenkins/jenkins-agent/workspace/Lucene/Lucene-Coverage-main/build/reports/problems/problems-report.html
Deprecated Gradle features were used in this build, making it incompatible with Gradle 10.
You can use '--warning-mode all' to show the individual deprecation warnings and determine if they come from your own scripts or plugins.
For more on this, please refer to https://docs.gradle.org/9.6.1/userguide/command_line_interface.html#sec:command_line_warnings in the Gradle documentation.
BUILD SUCCESSFUL in 13m 56s
373 actionable tasks: 293 executed, 80 up-to-date
Consider enabling configuration cache to speed up this build: https://docs.gradle.org/9.6.1/userguide/configuration_cache_enabling.html
Build step 'Invoke Gradle script' changed build result to SUCCESS
Archiving artifacts
‘**/build*/**/tests-cwd/*.hprof’ doesn’t match anything: ‘**’ exists but not ‘**/build*/**/tests-cwd/*.hprof’
No artifacts found that match the file pattern "**/build*/**/tests-cwd/*.hprof,**/*_pid*.log". Configuration error?
Recording test results
[Checks API] No suitable checks publisher found.
Build step 'Publish JUnit test result report' changed build result to UNSTABLE
Email was triggered for: Unstable (Test Failures)
Sending email for trigger: Unstable (Test Failures)
[JENKINS] Lucene » Lucene-Coverage-main - Build # 1863 - Still Unstable!
Posted by Apache Jenkins Server <je...@builds.apache.org>.
Build: https://ci-builds.apache.org/job/Lucene/job/Lucene-Coverage-main/1863/
2 tests failed.
FAILED: org.apache.lucene.expressions.js.TestJavascriptCompiler.testRecursionDepth2()
Error Message:
java.lang.AssertionError: expected:<1024> but was:<-1>
Stack Trace:
java.lang.AssertionError: expected:<1024> but was:<-1>
at __randomizedtesting.SeedChain.seed([5064767E7EEF5976:AAD4A75EBCFF0558:51B421012D2AA304])
at junit@4.13.2/org.junit.Assert.fail(Assert.java:89)
at junit@4.13.2/org.junit.Assert.failNotEquals(Assert.java:835)
at junit@4.13.2/org.junit.Assert.assertEquals(Assert.java:647)
at junit@4.13.2/org.junit.Assert.assertEquals(Assert.java:633)
at org.apache.lucene.expressions.js.TestJavascriptCompiler.testRecursionDepth2(TestJavascriptCompiler.java:292)
FAILED: org.apache.lucene.expressions.js.TestJavascriptCompiler.testRecursionDepth1()
Error Message:
java.lang.AssertionError: expected:<1024> but was:<-1>
Stack Trace:
java.lang.AssertionError: expected:<1024> but was:<-1>
at __randomizedtesting.SeedChain.seed([5064767E7EEF5976:AAD4A75EBCFF0558:E1EBE6B797155EA8])
at junit@4.13.2/org.junit.Assert.fail(Assert.java:89)
at junit@4.13.2/org.junit.Assert.failNotEquals(Assert.java:835)
at junit@4.13.2/org.junit.Assert.assertEquals(Assert.java:647)
at junit@4.13.2/org.junit.Assert.assertEquals(Assert.java:633)
at org.apache.lucene.expressions.js.TestJavascriptCompiler.testRecursionDepth1(TestJavascriptCompiler.java:279)
Build Log:
[...truncated 1161 lines...]
ERROR: 2 tests have failed:
- org.apache.lucene.expressions.js.TestJavascriptCompiler.testRecursionDepth2 (:lucene:expressions)
Test output: /home/jenkins/jenkins-agent/workspace/Lucene/Lucene-Coverage-main/lucene/expressions/build/test-results/test/outputs/OUTPUT-org.apache.lucene.expressions.js.TestJavascriptCompiler.txt
Reproduce with: gradlew :lucene:expressions:test --tests "org.apache.lucene.expressions.js.TestJavascriptCompiler.testRecursionDepth2" -Ptests.asserts=false -Ptests.coverage=true -Ptests.file.encoding=US-ASCII -Ptests.gui=true -Ptests.haltonfailure=false -Ptests.jvmargs= -Ptests.jvms=4 -Ptests.multiplier=2 -Ptests.seed=5064767E7EEF5976 -Ptests.vectorsize=128
- org.apache.lucene.expressions.js.TestJavascriptCompiler.testRecursionDepth1 (:lucene:expressions)
Test output: /home/jenkins/jenkins-agent/workspace/Lucene/Lucene-Coverage-main/lucene/expressions/build/test-results/test/outputs/OUTPUT-org.apache.lucene.expressions.js.TestJavascriptCompiler.txt
Reproduce with: gradlew :lucene:expressions:test --tests "org.apache.lucene.expressions.js.TestJavascriptCompiler.testRecursionDepth1" -Ptests.asserts=false -Ptests.coverage=true -Ptests.file.encoding=US-ASCII -Ptests.gui=true -Ptests.haltonfailure=false -Ptests.jvmargs= -Ptests.jvms=4 -Ptests.multiplier=2 -Ptests.seed=5064767E7EEF5976 -Ptests.vectorsize=128
The slowest tests during this run:
10.64s TestDocValuesRewriteMethod.testRegexps (:lucene:core)
8.95s TestRangeOnRangeFacetCounts.testRandomMultiDimDoubles (:lucene:facet)
7.68s TestRangeFacetCounts.testRandomLongsMultiValued (:lucene:facet)
5.90s TestSimpleTextNormsFormat.testThreads (:lucene:codecs)
5.40s TestTessellator.testComplexPolygon47 (:lucene:core)
4.63s TestRangeOnRangeFacetCounts.testRandomMultiDimLongs (:lucene:facet)
4.51s TestBooleanOr.testBooleanScorerMax (:lucene:core)
4.08s TestTermsEnum.testIntersectRandom (:lucene:core)
3.93s TestPerFieldPostingsFormat2.testStressPerFieldCodec (:lucene:core)
3.86s TestFSTs.testRealTerms (:lucene:core)
The slowest suites during this run:
28.10s TestLucene90DocValuesFormat (:lucene:core)
26.34s TestBasicBackwardsCompatibility (:lucene:backward-codecs)
25.76s TestLucene90DocValuesFormatVariableSkipInterval (:lucene:core)
24.45s TestLucene90DocValuesFormatMergeInstance (:lucene:core)
22.30s TestAssertingDocValuesFormat (:lucene:test-framework)
20.15s TestSimpleTextDocValuesFormat (:lucene:codecs)
17.23s TestFixedGapPostingsFormat (:lucene:codecs)
17.21s TestSimpleTextNormsFormat (:lucene:codecs)
16.81s TestPerFieldDocValuesFormat (:lucene:core)
16.13s TestAssertingNormsFormat (:lucene:test-framework)
[Incubating] Problems report is available at: file:///home/jenkins/jenkins-agent/workspace/Lucene/Lucene-Coverage-main/build/reports/problems/problems-report.html
Deprecated Gradle features were used in this build, making it incompatible with Gradle 10.
You can use '--warning-mode all' to show the individual deprecation warnings and determine if they come from your own scripts or plugins.
For more on this, please refer to https://docs.gradle.org/9.6.1/userguide/command_line_interface.html#sec:command_line_warnings in the Gradle documentation.
BUILD SUCCESSFUL in 14m 48s
373 actionable tasks: 293 executed, 80 up-to-date
Consider enabling configuration cache to speed up this build: https://docs.gradle.org/9.6.1/userguide/configuration_cache_enabling.html
Build step 'Invoke Gradle script' changed build result to SUCCESS
Archiving artifacts
‘**/build*/**/tests-cwd/*.hprof’ doesn’t match anything: ‘**’ exists but not ‘**/build*/**/tests-cwd/*.hprof’
No artifacts found that match the file pattern "**/build*/**/tests-cwd/*.hprof,**/*_pid*.log". Configuration error?
Recording test results
[Checks API] No suitable checks publisher found.
Build step 'Publish JUnit test result report' changed build result to UNSTABLE
Email was triggered for: Unstable (Test Failures)
Sending email for trigger: Unstable (Test Failures)
[JENKINS] Lucene » Lucene-Coverage-main - Build # 1862 - Still Unstable!
Posted by Apache Jenkins Server <je...@builds.apache.org>.
Build: https://ci-builds.apache.org/job/Lucene/job/Lucene-Coverage-main/1862/
2 tests failed.
FAILED: org.apache.lucene.expressions.js.TestJavascriptCompiler.testRecursionDepth1()
Error Message:
java.lang.AssertionError: expected:<1024> but was:<-1>
Stack Trace:
java.lang.AssertionError: expected:<1024> but was:<-1>
at __randomizedtesting.SeedChain.seed([A1509E31D1C275CC:5BE04F1113D229E2:10DF0EF838387212])
at junit@4.13.2/org.junit.Assert.fail(Assert.java:89)
at junit@4.13.2/org.junit.Assert.failNotEquals(Assert.java:835)
at junit@4.13.2/org.junit.Assert.assertEquals(Assert.java:647)
at junit@4.13.2/org.junit.Assert.assertEquals(Assert.java:633)
at org.apache.lucene.expressions.js.TestJavascriptCompiler.testRecursionDepth1(TestJavascriptCompiler.java:279)
FAILED: org.apache.lucene.expressions.js.TestJavascriptCompiler.testRecursionDepth1a()
Error Message:
java.lang.AssertionError: expected:<1024> but was:<-1>
Stack Trace:
java.lang.AssertionError: expected:<1024> but was:<-1>
at __randomizedtesting.SeedChain.seed([A1509E31D1C275CC:5BE04F1113D229E2:D5FCF57D3CF5F489])
at junit@4.13.2/org.junit.Assert.fail(Assert.java:89)
at junit@4.13.2/org.junit.Assert.failNotEquals(Assert.java:835)
at junit@4.13.2/org.junit.Assert.assertEquals(Assert.java:647)
at junit@4.13.2/org.junit.Assert.assertEquals(Assert.java:633)
at org.apache.lucene.expressions.js.TestJavascriptCompiler.testRecursionDepth1a(TestJavascriptCompiler.java:286)
Build Log:
[...truncated 1162 lines...]
ERROR: 2 tests have failed:
- org.apache.lucene.expressions.js.TestJavascriptCompiler.testRecursionDepth1 (:lucene:expressions)
Test output: /home/jenkins/jenkins-agent/workspace/Lucene/Lucene-Coverage-main/lucene/expressions/build/test-results/test/outputs/OUTPUT-org.apache.lucene.expressions.js.TestJavascriptCompiler.txt
Reproduce with: gradlew :lucene:expressions:test --tests "org.apache.lucene.expressions.js.TestJavascriptCompiler.testRecursionDepth1" -Ptests.asserts=false -Ptests.coverage=true -Ptests.file.encoding=ISO-8859-1 -Ptests.gui=true -Ptests.haltonfailure=false -Ptests.jvmargs= -Ptests.jvms=4 -Ptests.multiplier=2 -Ptests.seed=A1509E31D1C275CC -Ptests.vectorsize=512
- org.apache.lucene.expressions.js.TestJavascriptCompiler.testRecursionDepth1a (:lucene:expressions)
Test output: /home/jenkins/jenkins-agent/workspace/Lucene/Lucene-Coverage-main/lucene/expressions/build/test-results/test/outputs/OUTPUT-org.apache.lucene.expressions.js.TestJavascriptCompiler.txt
Reproduce with: gradlew :lucene:expressions:test --tests "org.apache.lucene.expressions.js.TestJavascriptCompiler.testRecursionDepth1a" -Ptests.asserts=false -Ptests.coverage=true -Ptests.file.encoding=ISO-8859-1 -Ptests.gui=true -Ptests.haltonfailure=false -Ptests.jvmargs= -Ptests.jvms=4 -Ptests.multiplier=2 -Ptests.seed=A1509E31D1C275CC -Ptests.vectorsize=512
The slowest tests during this run:
10.15s TestSimpleTextNormsFormat.testThreads (:lucene:codecs)
9.92s TestLucene90DocValuesFormat.testSparseDocValuesVsStoredFields (:lucene:core)
8.91s TestRangeOnRangeFacetCounts.testRandomMultiDimDoubles (:lucene:facet)
4.99s TestSortedSetDocValuesFacets.testRandom (:lucene:facet)
4.74s TestAllGroupHeadsCollector.testRandom (:lucene:grouping)
4.00s TestIndexWriterExceptions.testRandomExceptionsThreads (:lucene:core)
3.96s TestAssertingDocValuesFormat.testSortedSetFixedLengthFewUniqueSetsVsStoredFields (:lucene:test-framework)
3.95s TestAssertingNormsFormat.testSparseShortRange (:lucene:test-framework)
3.94s TestLazyDocument.testLazy (:lucene:misc)
3.89s TestLucene90DocValuesFormatMergeInstance.testSparseDocValuesVsStoredFields (:lucene:core)
The slowest suites during this run:
32.21s TestLucene90DocValuesFormat (:lucene:core)
24.68s TestLucene90DocValuesFormatMergeInstance (:lucene:core)
24.28s TestBasicBackwardsCompatibility (:lucene:backward-codecs)
22.95s TestLucene90DocValuesFormatVariableSkipInterval (:lucene:core)
21.32s TestAssertingDocValuesFormat (:lucene:test-framework)
19.93s TestSimpleTextNormsFormat (:lucene:codecs)
18.11s TestSimpleTextDocValuesFormat (:lucene:codecs)
15.82s TestAssertingNormsFormat (:lucene:test-framework)
15.28s TestPerFieldDocValuesFormat (:lucene:core)
15.09s TestFixedGapPostingsFormat (:lucene:codecs)
[Incubating] Problems report is available at: file:///home/jenkins/jenkins-agent/workspace/Lucene/Lucene-Coverage-main/build/reports/problems/problems-report.html
Deprecated Gradle features were used in this build, making it incompatible with Gradle 10.
You can use '--warning-mode all' to show the individual deprecation warnings and determine if they come from your own scripts or plugins.
For more on this, please refer to https://docs.gradle.org/9.6.1/userguide/command_line_interface.html#sec:command_line_warnings in the Gradle documentation.
BUILD SUCCESSFUL in 13m 42s
373 actionable tasks: 293 executed, 80 up-to-date
Consider enabling configuration cache to speed up this build: https://docs.gradle.org/9.6.1/userguide/configuration_cache_enabling.html
Build step 'Invoke Gradle script' changed build result to SUCCESS
Archiving artifacts
‘**/build*/**/tests-cwd/*.hprof’ doesn’t match anything: ‘**’ exists but not ‘**/build*/**/tests-cwd/*.hprof’
No artifacts found that match the file pattern "**/build*/**/tests-cwd/*.hprof,**/*_pid*.log". Configuration error?
Recording test results
[Checks API] No suitable checks publisher found.
Build step 'Publish JUnit test result report' changed build result to UNSTABLE
Email was triggered for: Unstable (Test Failures)
Sending email for trigger: Unstable (Test Failures)
[JENKINS] Lucene » Lucene-Coverage-main - Build # 1861 - Still Unstable!
Posted by Apache Jenkins Server <je...@builds.apache.org>.
Build: https://ci-builds.apache.org/job/Lucene/job/Lucene-Coverage-main/1861/
2 tests failed.
FAILED: org.apache.lucene.expressions.js.TestJavascriptCompiler.testRecursionDepth2()
Error Message:
java.lang.AssertionError: expected:<1024> but was:<-1>
Stack Trace:
java.lang.AssertionError: expected:<1024> but was:<-1>
at __randomizedtesting.SeedChain.seed([B11C4114AD26FAF6:4BAC90346F36A6D8:B0CC166BFEE30084])
at junit@4.13.2/org.junit.Assert.fail(Assert.java:89)
at junit@4.13.2/org.junit.Assert.failNotEquals(Assert.java:835)
at junit@4.13.2/org.junit.Assert.assertEquals(Assert.java:647)
at junit@4.13.2/org.junit.Assert.assertEquals(Assert.java:633)
at org.apache.lucene.expressions.js.TestJavascriptCompiler.testRecursionDepth2(TestJavascriptCompiler.java:292)
FAILED: org.apache.lucene.expressions.js.TestJavascriptCompiler.testRecursionDepth1a()
Error Message:
java.lang.AssertionError: expected:<1024> but was:<-1>
Stack Trace:
java.lang.AssertionError: expected:<1024> but was:<-1>
at __randomizedtesting.SeedChain.seed([B11C4114AD26FAF6:4BAC90346F36A6D8:C5B02A5840117BB3])
at junit@4.13.2/org.junit.Assert.fail(Assert.java:89)
at junit@4.13.2/org.junit.Assert.failNotEquals(Assert.java:835)
at junit@4.13.2/org.junit.Assert.assertEquals(Assert.java:647)
at junit@4.13.2/org.junit.Assert.assertEquals(Assert.java:633)
at org.apache.lucene.expressions.js.TestJavascriptCompiler.testRecursionDepth1a(TestJavascriptCompiler.java:286)
Build Log:
[...truncated 1162 lines...]
ERROR: 2 tests have failed:
- org.apache.lucene.expressions.js.TestJavascriptCompiler.testRecursionDepth1a (:lucene:expressions)
Test output: /home/jenkins/jenkins-agent/workspace/Lucene/Lucene-Coverage-main/lucene/expressions/build/test-results/test/outputs/OUTPUT-org.apache.lucene.expressions.js.TestJavascriptCompiler.txt
Reproduce with: gradlew :lucene:expressions:test --tests "org.apache.lucene.expressions.js.TestJavascriptCompiler.testRecursionDepth1a" -Ptests.asserts=false -Ptests.coverage=true -Ptests.file.encoding=UTF-8 -Ptests.gui=true -Ptests.haltonfailure=false -Ptests.jvmargs= -Ptests.jvms=4 -Ptests.multiplier=2 -Ptests.seed=B11C4114AD26FAF6 -Ptests.vectorsize=256
- org.apache.lucene.expressions.js.TestJavascriptCompiler.testRecursionDepth2 (:lucene:expressions)
Test output: /home/jenkins/jenkins-agent/workspace/Lucene/Lucene-Coverage-main/lucene/expressions/build/test-results/test/outputs/OUTPUT-org.apache.lucene.expressions.js.TestJavascriptCompiler.txt
Reproduce with: gradlew :lucene:expressions:test --tests "org.apache.lucene.expressions.js.TestJavascriptCompiler.testRecursionDepth2" -Ptests.asserts=false -Ptests.coverage=true -Ptests.file.encoding=UTF-8 -Ptests.gui=true -Ptests.haltonfailure=false -Ptests.jvmargs= -Ptests.jvms=4 -Ptests.multiplier=2 -Ptests.seed=B11C4114AD26FAF6 -Ptests.vectorsize=256
The slowest tests during this run:
6.43s TestSimpleTextNormsFormat.testThreads (:lucene:codecs)
6.14s TestAllGroupHeadsCollector.testRandom (:lucene:grouping)
5.33s TestLucene90DocValuesFormatMergeInstance.testSparseDocValuesVsStoredFields (:lucene:core)
4.98s TestLatLonMultiPolygonShapeQueries.testRandomMedium (:lucene:core)
4.83s TestMultiRangeQueries.testOneDimensionCount (:lucene:sandbox)
4.73s TestLazyDocument.testLazy (:lucene:misc)
4.23s TestLatLonMultiLineShapeQueries.testRandomMedium (:lucene:core)
4.18s TestAssertingNormsFormat.testSparseOutliers (:lucene:test-framework)
4.09s TestTessellator.testComplexPolygon47 (:lucene:core)
4.01s TestSortOptimization.testSortOptimizationOnSortedNumericField (:lucene:core)
The slowest suites during this run:
28.27s TestLucene90DocValuesFormatMergeInstance (:lucene:core)
26.13s TestLucene90DocValuesFormat (:lucene:core)
23.39s TestBasicBackwardsCompatibility (:lucene:backward-codecs)
21.41s TestLucene90DocValuesFormatVariableSkipInterval (:lucene:core)
20.68s TestAssertingDocValuesFormat (:lucene:test-framework)
19.50s TestSimpleTextDocValuesFormat (:lucene:codecs)
16.81s TestPerFieldDocValuesFormat (:lucene:core)
16.66s TestSimpleTextNormsFormat (:lucene:codecs)
15.47s TestAssertingNormsFormat (:lucene:test-framework)
13.97s TestVarGapDocFreqIntervalPostingsFormat (:lucene:codecs)
[Incubating] Problems report is available at: file:///home/jenkins/jenkins-agent/workspace/Lucene/Lucene-Coverage-main/build/reports/problems/problems-report.html
Deprecated Gradle features were used in this build, making it incompatible with Gradle 10.
You can use '--warning-mode all' to show the individual deprecation warnings and determine if they come from your own scripts or plugins.
For more on this, please refer to https://docs.gradle.org/9.6.1/userguide/command_line_interface.html#sec:command_line_warnings in the Gradle documentation.
BUILD SUCCESSFUL in 13m 16s
373 actionable tasks: 293 executed, 80 up-to-date
Consider enabling configuration cache to speed up this build: https://docs.gradle.org/9.6.1/userguide/configuration_cache_enabling.html
Build step 'Invoke Gradle script' changed build result to SUCCESS
Archiving artifacts
‘**/build*/**/tests-cwd/*.hprof’ doesn’t match anything: ‘**’ exists but not ‘**/build*/**/tests-cwd/*.hprof’
No artifacts found that match the file pattern "**/build*/**/tests-cwd/*.hprof,**/*_pid*.log". Configuration error?
Recording test results
[Checks API] No suitable checks publisher found.
Build step 'Publish JUnit test result report' changed build result to UNSTABLE
Email was triggered for: Unstable (Test Failures)
Sending email for trigger: Unstable (Test Failures)
[JENKINS] Lucene » Lucene-Coverage-main - Build # 1860 - Still Unstable!
Posted by Apache Jenkins Server <je...@builds.apache.org>.
Build: https://ci-builds.apache.org/job/Lucene/job/Lucene-Coverage-main/1860/
3 tests failed.
FAILED: org.apache.lucene.expressions.js.TestJavascriptCompiler.testRecursionDepth2()
Error Message:
java.lang.AssertionError: expected:<1024> but was:<-1>
Stack Trace:
java.lang.AssertionError: expected:<1024> but was:<-1>
at __randomizedtesting.SeedChain.seed([410144A0087A01CC:BBB19580CA6A5DE2:40D113DF5BBFFBBE])
at junit@4.13.2/org.junit.Assert.fail(Assert.java:89)
at junit@4.13.2/org.junit.Assert.failNotEquals(Assert.java:835)
at junit@4.13.2/org.junit.Assert.assertEquals(Assert.java:647)
at junit@4.13.2/org.junit.Assert.assertEquals(Assert.java:633)
at org.apache.lucene.expressions.js.TestJavascriptCompiler.testRecursionDepth2(TestJavascriptCompiler.java:292)
FAILED: org.apache.lucene.expressions.js.TestJavascriptCompiler.testRecursionDepth1()
Error Message:
java.lang.AssertionError: expected:<1024> but was:<-1>
Stack Trace:
java.lang.AssertionError: expected:<1024> but was:<-1>
at __randomizedtesting.SeedChain.seed([410144A0087A01CC:BBB19580CA6A5DE2:F08ED469E1800612])
at junit@4.13.2/org.junit.Assert.fail(Assert.java:89)
at junit@4.13.2/org.junit.Assert.failNotEquals(Assert.java:835)
at junit@4.13.2/org.junit.Assert.assertEquals(Assert.java:647)
at junit@4.13.2/org.junit.Assert.assertEquals(Assert.java:633)
at org.apache.lucene.expressions.js.TestJavascriptCompiler.testRecursionDepth1(TestJavascriptCompiler.java:279)
FAILED: org.apache.lucene.expressions.js.TestJavascriptCompiler.testRecursionDepth1a()
Error Message:
java.lang.AssertionError: expected:<1024> but was:<-1>
Stack Trace:
java.lang.AssertionError: expected:<1024> but was:<-1>
at __randomizedtesting.SeedChain.seed([410144A0087A01CC:BBB19580CA6A5DE2:35AD2FECE54D8089])
at junit@4.13.2/org.junit.Assert.fail(Assert.java:89)
at junit@4.13.2/org.junit.Assert.failNotEquals(Assert.java:835)
at junit@4.13.2/org.junit.Assert.assertEquals(Assert.java:647)
at junit@4.13.2/org.junit.Assert.assertEquals(Assert.java:633)
at org.apache.lucene.expressions.js.TestJavascriptCompiler.testRecursionDepth1a(TestJavascriptCompiler.java:286)
Build Log:
[...truncated 1178 lines...]
ERROR: 3 tests have failed:
- org.apache.lucene.expressions.js.TestJavascriptCompiler.testRecursionDepth1a (:lucene:expressions)
Test output: /home/jenkins/jenkins-agent/workspace/Lucene/Lucene-Coverage-main/lucene/expressions/build/test-results/test/outputs/OUTPUT-org.apache.lucene.expressions.js.TestJavascriptCompiler.txt
Reproduce with: gradlew :lucene:expressions:test --tests "org.apache.lucene.expressions.js.TestJavascriptCompiler.testRecursionDepth1a" -Ptests.asserts=true -Ptests.coverage=true -Ptests.file.encoding=US-ASCII -Ptests.gui=true -Ptests.haltonfailure=false -Ptests.jvmargs= -Ptests.jvms=4 -Ptests.multiplier=2 -Ptests.seed=410144A0087A01CC -Ptests.vectorsize=default
- org.apache.lucene.expressions.js.TestJavascriptCompiler.testRecursionDepth1 (:lucene:expressions)
Test output: /home/jenkins/jenkins-agent/workspace/Lucene/Lucene-Coverage-main/lucene/expressions/build/test-results/test/outputs/OUTPUT-org.apache.lucene.expressions.js.TestJavascriptCompiler.txt
Reproduce with: gradlew :lucene:expressions:test --tests "org.apache.lucene.expressions.js.TestJavascriptCompiler.testRecursionDepth1" -Ptests.asserts=true -Ptests.coverage=true -Ptests.file.encoding=US-ASCII -Ptests.gui=true -Ptests.haltonfailure=false -Ptests.jvmargs= -Ptests.jvms=4 -Ptests.multiplier=2 -Ptests.seed=410144A0087A01CC -Ptests.vectorsize=default
- org.apache.lucene.expressions.js.TestJavascriptCompiler.testRecursionDepth2 (:lucene:expressions)
Test output: /home/jenkins/jenkins-agent/workspace/Lucene/Lucene-Coverage-main/lucene/expressions/build/test-results/test/outputs/OUTPUT-org.apache.lucene.expressions.js.TestJavascriptCompiler.txt
Reproduce with: gradlew :lucene:expressions:test --tests "org.apache.lucene.expressions.js.TestJavascriptCompiler.testRecursionDepth2" -Ptests.asserts=true -Ptests.coverage=true -Ptests.file.encoding=US-ASCII -Ptests.gui=true -Ptests.haltonfailure=false -Ptests.jvmargs= -Ptests.jvms=4 -Ptests.multiplier=2 -Ptests.seed=410144A0087A01CC -Ptests.vectorsize=default
The slowest tests during this run:
7.57s TestSimpleTextNormsFormat.testThreads (:lucene:codecs)
5.46s TestBoolean2.testRandomQueries (:lucene:core)
4.70s TestRangeOnRangeFacetCounts.testRandomSingleDimDoubles (:lucene:facet)
4.46s TestLucene90DocValuesFormatMergeInstance.testSparseDocValuesVsStoredFields (:lucene:core)
4.29s TestAllGroupHeadsCollector.testRandom (:lucene:grouping)
4.20s TestLongPostings.testLongPostingsNoPositions (:lucene:core)
4.12s TestCompressingTermVectorsFormat.testMergeStability (:lucene:core)
4.11s TestStressNRT.test (:lucene:core)
4.11s TestLazyDocument.testLazy (:lucene:misc)
3.93s TestAssertingNormsFormat.testSparseOutliers2 (:lucene:test-framework)
The slowest suites during this run:
32.46s TestLucene90DocValuesFormat (:lucene:core)
28.71s TestLucene90DocValuesFormatMergeInstance (:lucene:core)
24.32s TestBasicBackwardsCompatibility (:lucene:backward-codecs)
21.42s TestLucene90DocValuesFormatVariableSkipInterval (:lucene:core)
21.32s TestAssertingDocValuesFormat (:lucene:test-framework)
20.31s TestSimpleTextDocValuesFormat (:lucene:codecs)
17.77s TestSimpleTextNormsFormat (:lucene:codecs)
14.56s TestVarGapFixedIntervalPostingsFormat (:lucene:codecs)
14.40s TestFixedGapPostingsFormat (:lucene:codecs)
13.98s TestAssertingNormsFormat (:lucene:test-framework)
[Incubating] Problems report is available at: file:///home/jenkins/jenkins-agent/workspace/Lucene/Lucene-Coverage-main/build/reports/problems/problems-report.html
Deprecated Gradle features were used in this build, making it incompatible with Gradle 10.
You can use '--warning-mode all' to show the individual deprecation warnings and determine if they come from your own scripts or plugins.
For more on this, please refer to https://docs.gradle.org/9.6.1/userguide/command_line_interface.html#sec:command_line_warnings in the Gradle documentation.
BUILD SUCCESSFUL in 13m 56s
373 actionable tasks: 293 executed, 80 up-to-date
Consider enabling configuration cache to speed up this build: https://docs.gradle.org/9.6.1/userguide/configuration_cache_enabling.html
Build step 'Invoke Gradle script' changed build result to SUCCESS
Archiving artifacts
‘**/build*/**/tests-cwd/*.hprof’ doesn’t match anything: ‘**’ exists but not ‘**/build*/**/tests-cwd/*.hprof’
No artifacts found that match the file pattern "**/build*/**/tests-cwd/*.hprof,**/*_pid*.log". Configuration error?
Recording test results
[Checks API] No suitable checks publisher found.
Build step 'Publish JUnit test result report' changed build result to UNSTABLE
Email was triggered for: Unstable (Test Failures)
Sending email for trigger: Unstable (Test Failures)
[JENKINS] Lucene » Lucene-Coverage-main - Build # 1859 - Still Unstable!
Posted by Apache Jenkins Server <je...@builds.apache.org>.
Build: https://ci-builds.apache.org/job/Lucene/job/Lucene-Coverage-main/1859/
3 tests failed.
FAILED: org.apache.lucene.expressions.js.TestJavascriptCompiler.testRecursionDepth2()
Error Message:
java.lang.AssertionError: expected:<1024> but was:<-1>
Stack Trace:
java.lang.AssertionError: expected:<1024> but was:<-1>
at __randomizedtesting.SeedChain.seed([7ADDFFAE82851ECF:806D2E8E409542E1:7B0DA8D1D140E4BD])
at junit@4.13.2/org.junit.Assert.fail(Assert.java:89)
at junit@4.13.2/org.junit.Assert.failNotEquals(Assert.java:835)
at junit@4.13.2/org.junit.Assert.assertEquals(Assert.java:647)
at junit@4.13.2/org.junit.Assert.assertEquals(Assert.java:633)
at org.apache.lucene.expressions.js.TestJavascriptCompiler.testRecursionDepth2(TestJavascriptCompiler.java:292)
FAILED: org.apache.lucene.expressions.js.TestJavascriptCompiler.testRecursionDepth1()
Error Message:
java.lang.AssertionError: expected:<1024> but was:<-1>
Stack Trace:
java.lang.AssertionError: expected:<1024> but was:<-1>
at __randomizedtesting.SeedChain.seed([7ADDFFAE82851ECF:806D2E8E409542E1:CB526F676B7F1911])
at junit@4.13.2/org.junit.Assert.fail(Assert.java:89)
at junit@4.13.2/org.junit.Assert.failNotEquals(Assert.java:835)
at junit@4.13.2/org.junit.Assert.assertEquals(Assert.java:647)
at junit@4.13.2/org.junit.Assert.assertEquals(Assert.java:633)
at org.apache.lucene.expressions.js.TestJavascriptCompiler.testRecursionDepth1(TestJavascriptCompiler.java:279)
FAILED: org.apache.lucene.expressions.js.TestJavascriptCompiler.testRecursionDepth1a()
Error Message:
java.lang.AssertionError: expected:<1024> but was:<-1>
Stack Trace:
java.lang.AssertionError: expected:<1024> but was:<-1>
at __randomizedtesting.SeedChain.seed([7ADDFFAE82851ECF:806D2E8E409542E1:E7194E26FB29F8A])
at junit@4.13.2/org.junit.Assert.fail(Assert.java:89)
at junit@4.13.2/org.junit.Assert.failNotEquals(Assert.java:835)
at junit@4.13.2/org.junit.Assert.assertEquals(Assert.java:647)
at junit@4.13.2/org.junit.Assert.assertEquals(Assert.java:633)
at org.apache.lucene.expressions.js.TestJavascriptCompiler.testRecursionDepth1a(TestJavascriptCompiler.java:286)
Build Log:
[...truncated 1177 lines...]
ERROR: 3 tests have failed:
- org.apache.lucene.expressions.js.TestJavascriptCompiler.testRecursionDepth1a (:lucene:expressions)
Test output: /home/jenkins/jenkins-agent/workspace/Lucene/Lucene-Coverage-main/lucene/expressions/build/test-results/test/outputs/OUTPUT-org.apache.lucene.expressions.js.TestJavascriptCompiler.txt
Reproduce with: gradlew :lucene:expressions:test --tests "org.apache.lucene.expressions.js.TestJavascriptCompiler.testRecursionDepth1a" -Ptests.asserts=true -Ptests.coverage=true -Ptests.file.encoding=US-ASCII -Ptests.gui=true -Ptests.haltonfailure=false -Ptests.jvmargs= -Ptests.jvms=4 -Ptests.multiplier=2 -Ptests.seed=7ADDFFAE82851ECF -Ptests.vectorsize=256
- org.apache.lucene.expressions.js.TestJavascriptCompiler.testRecursionDepth2 (:lucene:expressions)
Test output: /home/jenkins/jenkins-agent/workspace/Lucene/Lucene-Coverage-main/lucene/expressions/build/test-results/test/outputs/OUTPUT-org.apache.lucene.expressions.js.TestJavascriptCompiler.txt
Reproduce with: gradlew :lucene:expressions:test --tests "org.apache.lucene.expressions.js.TestJavascriptCompiler.testRecursionDepth2" -Ptests.asserts=true -Ptests.coverage=true -Ptests.file.encoding=US-ASCII -Ptests.gui=true -Ptests.haltonfailure=false -Ptests.jvmargs= -Ptests.jvms=4 -Ptests.multiplier=2 -Ptests.seed=7ADDFFAE82851ECF -Ptests.vectorsize=256
- org.apache.lucene.expressions.js.TestJavascriptCompiler.testRecursionDepth1 (:lucene:expressions)
Test output: /home/jenkins/jenkins-agent/workspace/Lucene/Lucene-Coverage-main/lucene/expressions/build/test-results/test/outputs/OUTPUT-org.apache.lucene.expressions.js.TestJavascriptCompiler.txt
Reproduce with: gradlew :lucene:expressions:test --tests "org.apache.lucene.expressions.js.TestJavascriptCompiler.testRecursionDepth1" -Ptests.asserts=true -Ptests.coverage=true -Ptests.file.encoding=US-ASCII -Ptests.gui=true -Ptests.haltonfailure=false -Ptests.jvmargs= -Ptests.jvms=4 -Ptests.multiplier=2 -Ptests.seed=7ADDFFAE82851ECF -Ptests.vectorsize=256
The slowest tests during this run:
14.32s TestLatLonMultiLineShapeQueries.testLowCardinalityShapeManyTimes (:lucene:core)
8.50s TestLatLonMultiLineShapeQueries.testRandomMedium (:lucene:core)
6.35s TestRangeOnRangeFacetCounts.testRandomSingleDimDoubles (:lucene:facet)
6.18s TestAllGroupHeadsCollector.testRandom (:lucene:grouping)
5.55s TestLatLonMultiLineShapeQueries.testRandomTiny (:lucene:core)
5.02s TestSortedSetDocValuesFacets.testRandom (:lucene:facet)
4.76s TestNeverDelete.testIndexing (:lucene:core)
4.75s TestPerFieldPostingsFormat2.testStressPerFieldCodec (:lucene:core)
4.52s TestRangeFacetCounts.testRandomLongsMultiValued (:lucene:facet)
4.34s TestAssertingNormsFormat.testSparseOutliers (:lucene:test-framework)
The slowest suites during this run:
31.41s TestLatLonMultiLineShapeQueries (:lucene:core)
26.43s TestLucene90DocValuesFormat (:lucene:core)
24.37s TestBasicBackwardsCompatibility (:lucene:backward-codecs)
21.16s TestLucene90DocValuesFormatMergeInstance (:lucene:core)
21.07s TestLucene90DocValuesFormatVariableSkipInterval (:lucene:core)
19.82s TestAssertingDocValuesFormat (:lucene:test-framework)
18.07s TestSimpleTextDocValuesFormat (:lucene:codecs)
15.09s TestAssertingNormsFormat (:lucene:test-framework)
13.96s TestAssertingPostingsFormat (:lucene:test-framework)
13.57s TestFixedGapPostingsFormat (:lucene:codecs)
[Incubating] Problems report is available at: file:///home/jenkins/jenkins-agent/workspace/Lucene/Lucene-Coverage-main/build/reports/problems/problems-report.html
Deprecated Gradle features were used in this build, making it incompatible with Gradle 10.
You can use '--warning-mode all' to show the individual deprecation warnings and determine if they come from your own scripts or plugins.
For more on this, please refer to https://docs.gradle.org/9.6.1/userguide/command_line_interface.html#sec:command_line_warnings in the Gradle documentation.
BUILD SUCCESSFUL in 13m 29s
373 actionable tasks: 293 executed, 80 up-to-date
Consider enabling configuration cache to speed up this build: https://docs.gradle.org/9.6.1/userguide/configuration_cache_enabling.html
Build step 'Invoke Gradle script' changed build result to SUCCESS
Archiving artifacts
‘**/build*/**/tests-cwd/*.hprof’ doesn’t match anything: ‘**’ exists but not ‘**/build*/**/tests-cwd/*.hprof’
No artifacts found that match the file pattern "**/build*/**/tests-cwd/*.hprof,**/*_pid*.log". Configuration error?
Recording test results
[Checks API] No suitable checks publisher found.
Build step 'Publish JUnit test result report' changed build result to UNSTABLE
Email was triggered for: Unstable (Test Failures)
Sending email for trigger: Unstable (Test Failures)
[JENKINS] Lucene » Lucene-Coverage-main - Build # 1858 - Still Unstable!
Posted by Apache Jenkins Server <je...@builds.apache.org>.
Build: https://ci-builds.apache.org/job/Lucene/job/Lucene-Coverage-main/1858/
2 tests failed.
FAILED: org.apache.lucene.expressions.js.TestJavascriptCompiler.testRecursionDepth1()
Error Message:
java.lang.AssertionError: expected:<1024> but was:<-1>
Stack Trace:
java.lang.AssertionError: expected:<1024> but was:<-1>
at __randomizedtesting.SeedChain.seed([33324B96DFCDC417:C9829AB61DDD9839:82BDDB5F3637C3C9])
at junit@4.13.2/org.junit.Assert.fail(Assert.java:89)
at junit@4.13.2/org.junit.Assert.failNotEquals(Assert.java:835)
at junit@4.13.2/org.junit.Assert.assertEquals(Assert.java:647)
at junit@4.13.2/org.junit.Assert.assertEquals(Assert.java:633)
at org.apache.lucene.expressions.js.TestJavascriptCompiler.testRecursionDepth1(TestJavascriptCompiler.java:279)
FAILED: org.apache.lucene.expressions.js.TestJavascriptCompiler.testRecursionDepth1a()
Error Message:
java.lang.AssertionError: expected:<1024> but was:<-1>
Stack Trace:
java.lang.AssertionError: expected:<1024> but was:<-1>
at __randomizedtesting.SeedChain.seed([33324B96DFCDC417:C9829AB61DDD9839:479E20DA32FA4552])
at junit@4.13.2/org.junit.Assert.fail(Assert.java:89)
at junit@4.13.2/org.junit.Assert.failNotEquals(Assert.java:835)
at junit@4.13.2/org.junit.Assert.assertEquals(Assert.java:647)
at junit@4.13.2/org.junit.Assert.assertEquals(Assert.java:633)
at org.apache.lucene.expressions.js.TestJavascriptCompiler.testRecursionDepth1a(TestJavascriptCompiler.java:286)
Build Log:
[...truncated 1162 lines...]
ERROR: 2 tests have failed:
- org.apache.lucene.expressions.js.TestJavascriptCompiler.testRecursionDepth1 (:lucene:expressions)
Test output: /home/jenkins/jenkins-agent/workspace/Lucene/Lucene-Coverage-main/lucene/expressions/build/test-results/test/outputs/OUTPUT-org.apache.lucene.expressions.js.TestJavascriptCompiler.txt
Reproduce with: gradlew :lucene:expressions:test --tests "org.apache.lucene.expressions.js.TestJavascriptCompiler.testRecursionDepth1" -Ptests.asserts=false -Ptests.coverage=true -Ptests.file.encoding=US-ASCII -Ptests.gui=true -Ptests.haltonfailure=false -Ptests.jvmargs= -Ptests.jvms=4 -Ptests.multiplier=2 -Ptests.seed=33324B96DFCDC417 -Ptests.vectorsize=512
- org.apache.lucene.expressions.js.TestJavascriptCompiler.testRecursionDepth1a (:lucene:expressions)
Test output: /home/jenkins/jenkins-agent/workspace/Lucene/Lucene-Coverage-main/lucene/expressions/build/test-results/test/outputs/OUTPUT-org.apache.lucene.expressions.js.TestJavascriptCompiler.txt
Reproduce with: gradlew :lucene:expressions:test --tests "org.apache.lucene.expressions.js.TestJavascriptCompiler.testRecursionDepth1a" -Ptests.asserts=false -Ptests.coverage=true -Ptests.file.encoding=US-ASCII -Ptests.gui=true -Ptests.haltonfailure=false -Ptests.jvmargs= -Ptests.jvms=4 -Ptests.multiplier=2 -Ptests.seed=33324B96DFCDC417 -Ptests.vectorsize=512
The slowest tests during this run:
6.64s TestBoolean2.testRandomQueries (:lucene:core)
6.00s TestRangeOnRangeFacetCounts.testRandomMultiDimLongs (:lucene:facet)
4.90s TestLucene90DocValuesFormatMergeInstance.testSparseDocValuesVsStoredFields (:lucene:core)
4.83s TestAssertingNormsFormat.testShortRange (:lucene:test-framework)
4.26s TestLongValueFacetCounts.testRandomMultiValued (:lucene:facet)
4.15s TestSortedSetDocValuesFacets.testRandom (:lucene:facet)
4.01s TestPerFieldPostingsFormat2.testStressPerFieldCodec (:lucene:core)
3.81s TestRangeOnRangeFacetCounts.testRandomSingleDimLongs (:lucene:facet)
3.74s TestSimpleTextNormsFormat.testThreads (:lucene:codecs)
3.72s TestAssertingPostingsFormat.testDocsAndFreqsAndPositionsAndPayloads (:lucene:test-framework)
The slowest suites during this run:
26.07s TestLucene90DocValuesFormatMergeInstance (:lucene:core)
24.17s TestLucene90DocValuesFormat (:lucene:core)
24.04s TestBasicBackwardsCompatibility (:lucene:backward-codecs)
20.93s TestSimpleTextDocValuesFormat (:lucene:codecs)
20.38s TestAssertingDocValuesFormat (:lucene:test-framework)
19.01s TestLucene90DocValuesFormatVariableSkipInterval (:lucene:core)
15.05s TestSimpleTextNormsFormat (:lucene:codecs)
14.78s TestBoolean2 (:lucene:core)
14.68s TestAssertingPostingsFormat (:lucene:test-framework)
14.62s TestPerFieldDocValuesFormat (:lucene:core)
[Incubating] Problems report is available at: file:///home/jenkins/jenkins-agent/workspace/Lucene/Lucene-Coverage-main/build/reports/problems/problems-report.html
Deprecated Gradle features were used in this build, making it incompatible with Gradle 10.
You can use '--warning-mode all' to show the individual deprecation warnings and determine if they come from your own scripts or plugins.
For more on this, please refer to https://docs.gradle.org/9.6.1/userguide/command_line_interface.html#sec:command_line_warnings in the Gradle documentation.
BUILD SUCCESSFUL in 13m 31s
373 actionable tasks: 293 executed, 80 up-to-date
Consider enabling configuration cache to speed up this build: https://docs.gradle.org/9.6.1/userguide/configuration_cache_enabling.html
Build step 'Invoke Gradle script' changed build result to SUCCESS
Archiving artifacts
‘**/build*/**/tests-cwd/*.hprof’ doesn’t match anything: ‘**’ exists but not ‘**/build*/**/tests-cwd/*.hprof’
No artifacts found that match the file pattern "**/build*/**/tests-cwd/*.hprof,**/*_pid*.log". Configuration error?
Recording test results
[Checks API] No suitable checks publisher found.
Build step 'Publish JUnit test result report' changed build result to UNSTABLE
Email was triggered for: Unstable (Test Failures)
Sending email for trigger: Unstable (Test Failures)
[JENKINS] Lucene » Lucene-Coverage-main - Build # 1857 - Still Unstable!
Posted by Apache Jenkins Server <je...@builds.apache.org>.
Build: https://ci-builds.apache.org/job/Lucene/job/Lucene-Coverage-main/1857/
2 tests failed.
FAILED: org.apache.lucene.expressions.js.TestJavascriptCompiler.testRecursionDepth1a()
Error Message:
java.lang.AssertionError: expected:<1024> but was:<-1>
Stack Trace:
java.lang.AssertionError: expected:<1024> but was:<-1>
at __randomizedtesting.SeedChain.seed([FC30C7F1BB203060:68016D179306C4E:889CACBD5617B125])
at junit@4.13.2/org.junit.Assert.fail(Assert.java:89)
at junit@4.13.2/org.junit.Assert.failNotEquals(Assert.java:835)
at junit@4.13.2/org.junit.Assert.assertEquals(Assert.java:647)
at junit@4.13.2/org.junit.Assert.assertEquals(Assert.java:633)
at org.apache.lucene.expressions.js.TestJavascriptCompiler.testRecursionDepth1a(TestJavascriptCompiler.java:286)
FAILED: org.apache.lucene.expressions.js.TestJavascriptCompiler.testRecursionDepth2()
Error Message:
java.lang.AssertionError: expected:<1024> but was:<-1>
Stack Trace:
java.lang.AssertionError: expected:<1024> but was:<-1>
at __randomizedtesting.SeedChain.seed([FC30C7F1BB203060:68016D179306C4E:FDE0908EE8E5CA12])
at junit@4.13.2/org.junit.Assert.fail(Assert.java:89)
at junit@4.13.2/org.junit.Assert.failNotEquals(Assert.java:835)
at junit@4.13.2/org.junit.Assert.assertEquals(Assert.java:647)
at junit@4.13.2/org.junit.Assert.assertEquals(Assert.java:633)
at org.apache.lucene.expressions.js.TestJavascriptCompiler.testRecursionDepth2(TestJavascriptCompiler.java:292)
Build Log:
[...truncated 1161 lines...]
ERROR: 2 tests have failed:
- org.apache.lucene.expressions.js.TestJavascriptCompiler.testRecursionDepth2 (:lucene:expressions)
Test output: /home/jenkins/jenkins-agent/workspace/Lucene/Lucene-Coverage-main/lucene/expressions/build/test-results/test/outputs/OUTPUT-org.apache.lucene.expressions.js.TestJavascriptCompiler.txt
Reproduce with: gradlew :lucene:expressions:test --tests "org.apache.lucene.expressions.js.TestJavascriptCompiler.testRecursionDepth2" -Ptests.asserts=true -Ptests.coverage=true -Ptests.file.encoding=UTF-8 -Ptests.gui=true -Ptests.haltonfailure=false -Ptests.jvmargs= -Ptests.jvms=4 -Ptests.multiplier=2 -Ptests.seed=FC30C7F1BB203060 -Ptests.vectorsize=default
- org.apache.lucene.expressions.js.TestJavascriptCompiler.testRecursionDepth1a (:lucene:expressions)
Test output: /home/jenkins/jenkins-agent/workspace/Lucene/Lucene-Coverage-main/lucene/expressions/build/test-results/test/outputs/OUTPUT-org.apache.lucene.expressions.js.TestJavascriptCompiler.txt
Reproduce with: gradlew :lucene:expressions:test --tests "org.apache.lucene.expressions.js.TestJavascriptCompiler.testRecursionDepth1a" -Ptests.asserts=true -Ptests.coverage=true -Ptests.file.encoding=UTF-8 -Ptests.gui=true -Ptests.haltonfailure=false -Ptests.jvmargs= -Ptests.jvms=4 -Ptests.multiplier=2 -Ptests.seed=FC30C7F1BB203060 -Ptests.vectorsize=default
The slowest tests during this run:
5.93s TestNeverDelete.testIndexing (:lucene:core)
5.06s TestCompressingTermVectorsFormat.testMergeStability (:lucene:core)
5.00s TestGroupFacetCollector.testRandom (:lucene:grouping)
4.93s TestSimpleTextNormsFormat.testThreads (:lucene:codecs)
4.54s TestLatLonMultiLineShapeQueries.testRandomMedium (:lucene:core)
4.25s TestLucene90DocValuesFormat.testSparseDocValuesVsStoredFields (:lucene:core)
4.07s TestAssertingPostingsFormat.testDocsAndFreqsAndPositionsAndOffsetsAndPayloads (:lucene:test-framework)
4.06s TestLucene90DocValuesFormatMergeInstance.testSparseDocValuesVsStoredFields (:lucene:core)
3.95s TestUnifiedHighlighterRanking.testRanking (:lucene:highlighter)
3.92s TestLazyDocument.testLazy (:lucene:misc)
The slowest suites during this run:
27.73s TestLucene90DocValuesFormat (:lucene:core)
26.72s TestLucene90DocValuesFormatMergeInstance (:lucene:core)
24.27s TestBasicBackwardsCompatibility (:lucene:backward-codecs)
21.55s TestAssertingDocValuesFormat (:lucene:test-framework)
20.41s TestLucene90DocValuesFormatVariableSkipInterval (:lucene:core)
20.40s TestSimpleTextDocValuesFormat (:lucene:codecs)
17.31s TestAssertingPostingsFormat (:lucene:test-framework)
14.48s TestPerFieldDocValuesFormat (:lucene:core)
14.24s TestSimpleTextNormsFormat (:lucene:codecs)
14.05s TestVarGapDocFreqIntervalPostingsFormat (:lucene:codecs)
[Incubating] Problems report is available at: file:///home/jenkins/jenkins-agent/workspace/Lucene/Lucene-Coverage-main/build/reports/problems/problems-report.html
Deprecated Gradle features were used in this build, making it incompatible with Gradle 10.
You can use '--warning-mode all' to show the individual deprecation warnings and determine if they come from your own scripts or plugins.
For more on this, please refer to https://docs.gradle.org/9.6.1/userguide/command_line_interface.html#sec:command_line_warnings in the Gradle documentation.
BUILD SUCCESSFUL in 13m 10s
373 actionable tasks: 293 executed, 80 up-to-date
Consider enabling configuration cache to speed up this build: https://docs.gradle.org/9.6.1/userguide/configuration_cache_enabling.html
Build step 'Invoke Gradle script' changed build result to SUCCESS
Archiving artifacts
‘**/build*/**/tests-cwd/*.hprof’ doesn’t match anything: ‘**’ exists but not ‘**/build*/**/tests-cwd/*.hprof’
No artifacts found that match the file pattern "**/build*/**/tests-cwd/*.hprof,**/*_pid*.log". Configuration error?
Recording test results
[Checks API] No suitable checks publisher found.
Build step 'Publish JUnit test result report' changed build result to UNSTABLE
Email was triggered for: Unstable (Test Failures)
Sending email for trigger: Unstable (Test Failures)