You are viewing a plain text version of this content. The canonical link for it is here.
Posted to builds@solr.apache.org by Policeman Jenkins Server <je...@thetaphi.de> on 2025/06/11 23:45:30 UTC
[JENKINS] Solr-main-macOS (64bit/hotspot/jdk-21.0.6) - Build # 6047 - Unstable!
Build: https://jenkins.thetaphi.de/job/Solr-main-macOS/6047/
Java: 64bit/hotspot/jdk-21.0.6 -XX:-UseCompressedOops -XX:+UseG1GC
2 tests failed.
FAILED: org.apache.solr.TestTolerantSearch.testAllShardsFail
Error Message:
com.carrotsearch.randomizedtesting.UncaughtExceptionError: Captured an uncaught exception in thread: Thread[id=244, name=httpShardExecutor-172-thread-4, state=RUNNABLE, group=TGRP-TestTolerantSearch]
Stack Trace:
com.carrotsearch.randomizedtesting.UncaughtExceptionError: Captured an uncaught exception in thread: Thread[id=244, name=httpShardExecutor-172-thread-4, state=RUNNABLE, group=TGRP-TestTolerantSearch]
at __randomizedtesting.SeedInfo.seed([D689B21F3CD547B4:4989EAEBEAD52043]:0)
Caused by: java.util.concurrent.CancellationException
at __randomizedtesting.SeedInfo.seed([D689B21F3CD547B4]:0)
at java.base/java.util.concurrent.CompletableFuture.cancel(CompletableFuture.java:2510)
at org.apache.solr.client.solrj.impl.LBHttp2SolrClient.lambda$requestAsync$0(LBHttp2SolrClient.java:190)
at java.base/java.util.concurrent.CompletableFuture.uniExceptionally(CompletableFuture.java:990)
at java.base/java.util.concurrent.CompletableFuture$UniExceptionally.tryFire(CompletableFuture.java:974)
at java.base/java.util.concurrent.CompletableFuture.postComplete(CompletableFuture.java:510)
at java.base/java.util.concurrent.CompletableFuture.cancel(CompletableFuture.java:2512)
at org.apache.solr.handler.component.HttpShardHandler.cancelAll(HttpShardHandler.java:361)
at org.apache.solr.handler.component.SearchHandler.processComponents(SearchHandler.java:636)
at org.apache.solr.handler.component.SearchHandler.handleRequestBody(SearchHandler.java:425)
at org.apache.solr.handler.RequestHandlerBase.handleRequest(RequestHandlerBase.java:238)
at org.apache.solr.core.SolrCore.execute(SolrCore.java:2893)
at org.apache.solr.servlet.HttpSolrCall.executeCoreRequest(HttpSolrCall.java:898)
at org.apache.solr.servlet.HttpSolrCall.call(HttpSolrCall.java:587)
at org.apache.solr.servlet.SolrDispatchFilter.dispatch(SolrDispatchFilter.java:233)
at org.apache.solr.servlet.SolrDispatchFilter.lambda$doFilterRetry$0(SolrDispatchFilter.java:194)
at org.apache.solr.servlet.ServletUtils.traceHttpRequestExecution2(ServletUtils.java:226)
at org.apache.solr.servlet.ServletUtils.rateLimitRequest(ServletUtils.java:194)
at org.apache.solr.servlet.SolrDispatchFilter.doFilterRetry(SolrDispatchFilter.java:188)
at org.apache.solr.servlet.SolrDispatchFilter.doFilter(SolrDispatchFilter.java:178)
at jakarta.servlet.http.HttpFilter.doFilter(HttpFilter.java:97)
at org.eclipse.jetty.ee10.servlet.FilterHolder.doFilter(FilterHolder.java:205)
at org.eclipse.jetty.ee10.servlet.ServletHandler$Chain.doFilter(ServletHandler.java:1594)
at org.apache.solr.embedded.JettySolrRunner$DebugFilter.doFilter(JettySolrRunner.java:181)
at org.eclipse.jetty.ee10.servlet.FilterHolder.doFilter(FilterHolder.java:205)
at org.eclipse.jetty.ee10.servlet.ServletHandler$Chain.doFilter(ServletHandler.java:1594)
at org.eclipse.jetty.ee10.servlet.ServletHandler$MappedServlet.handle(ServletHandler.java:1555)
at org.eclipse.jetty.ee10.servlet.ServletChannel.dispatch(ServletChannel.java:819)
at org.eclipse.jetty.ee10.servlet.ServletChannel.handle(ServletChannel.java:436)
at org.eclipse.jetty.ee10.servlet.ServletHandler.handle(ServletHandler.java:470)
at org.eclipse.jetty.ee10.servlet.SessionHandler.handle(SessionHandler.java:717)
at org.eclipse.jetty.server.handler.ContextHandler.handle(ContextHandler.java:1064)
at org.eclipse.jetty.server.Handler$Wrapper.handle(Handler.java:740)
at org.eclipse.jetty.rewrite.handler.RewriteHandler.handle(RewriteHandler.java:138)
at org.eclipse.jetty.server.handler.gzip.GzipHandler.handle(GzipHandler.java:611)
at org.eclipse.jetty.server.Handler$Wrapper.handle(Handler.java:740)
at org.eclipse.jetty.server.handler.GracefulHandler.handle(GracefulHandler.java:101)
at org.eclipse.jetty.server.Server.handle(Server.java:182)
at org.eclipse.jetty.server.internal.HttpChannelState$HandlerInvoker.run(HttpChannelState.java:662)
at org.eclipse.jetty.server.internal.HttpConnection.onFillable(HttpConnection.java:416)
at org.eclipse.jetty.io.AbstractConnection$ReadCallback.succeeded(AbstractConnection.java:322)
at org.eclipse.jetty.io.FillInterest.fillable(FillInterest.java:99)
at org.eclipse.jetty.io.ssl.SslConnection$SslEndPoint.onFillable(SslConnection.java:575)
at org.eclipse.jetty.io.ssl.SslConnection.onFillable(SslConnection.java:390)
at org.eclipse.jetty.io.ssl.SslConnection$2.succeeded(SslConnection.java:150)
at org.eclipse.jetty.io.FillInterest.fillable(FillInterest.java:99)
at org.eclipse.jetty.io.SelectableChannelEndPoint$1.run(SelectableChannelEndPoint.java:53)
at org.eclipse.jetty.util.thread.QueuedThreadPool.runJob(QueuedThreadPool.java:979)
at org.eclipse.jetty.util.thread.QueuedThreadPool$Runner.doRunJob(QueuedThreadPool.java:1209)
at org.eclipse.jetty.util.thread.QueuedThreadPool$Runner.run(QueuedThreadPool.java:1164)
at java.base/java.lang.Thread.run(Thread.java:1583)
FAILED: org.apache.solr.search.TestThinCache.testSimple
Error Message:
java.lang.AssertionError: expected:<0> but was:<1>
Stack Trace:
java.lang.AssertionError: expected:<0> but was:<1>
at __randomizedtesting.SeedInfo.seed([D689B21F3CD547B4:EE3A96E11B269365]:0)
at org.junit.Assert.fail(Assert.java:89)
at org.junit.Assert.failNotEquals(Assert.java:835)
at org.junit.Assert.assertEquals(Assert.java:120)
at org.junit.Assert.assertEquals(Assert.java:146)
at org.apache.solr.search.TestThinCache.testSimple(TestThinCache.java:139)
at java.base/jdk.internal.reflect.DirectMethodHandleAccessor.invoke(DirectMethodHandleAccessor.java:103)
at java.base/java.lang.reflect.Method.invoke(Method.java:580)
at com.carrotsearch.randomizedtesting.RandomizedRunner.invoke(RandomizedRunner.java:1758)
at com.carrotsearch.randomizedtesting.RandomizedRunner$8.evaluate(RandomizedRunner.java:946)
at com.carrotsearch.randomizedtesting.RandomizedRunner$9.evaluate(RandomizedRunner.java:982)
at com.carrotsearch.randomizedtesting.RandomizedRunner$10.evaluate(RandomizedRunner.java:996)
at com.carrotsearch.randomizedtesting.rules.SystemPropertiesRestoreRule$1.evaluate(SystemPropertiesRestoreRule.java:80)
at org.junit.rules.RunRules.evaluate(RunRules.java:20)
at org.apache.lucene.tests.util.TestRuleSetupTeardownChained$1.evaluate(TestRuleSetupTeardownChained.java:48)
at org.apache.lucene.tests.util.AbstractBeforeAfterRule$1.evaluate(AbstractBeforeAfterRule.java:43)
at org.apache.lucene.tests.util.TestRuleThreadAndTestName$1.evaluate(TestRuleThreadAndTestName.java:45)
at org.apache.lucene.tests.util.TestRuleIgnoreAfterMaxFailures$1.evaluate(TestRuleIgnoreAfterMaxFailures.java:60)
at org.apache.lucene.tests.util.TestRuleMarkFailure$1.evaluate(TestRuleMarkFailure.java:44)
at org.junit.rules.RunRules.evaluate(RunRules.java:20)
at com.carrotsearch.randomizedtesting.rules.StatementAdapter.evaluate(StatementAdapter.java:36)
at com.carrotsearch.randomizedtesting.ThreadLeakControl$StatementRunner.run(ThreadLeakControl.java:390)
at com.carrotsearch.randomizedtesting.ThreadLeakControl.forkTimeoutingTask(ThreadLeakControl.java:843)
at com.carrotsearch.randomizedtesting.ThreadLeakControl$3.evaluate(ThreadLeakControl.java:490)
at com.carrotsearch.randomizedtesting.RandomizedRunner.runSingleTest(RandomizedRunner.java:955)
at com.carrotsearch.randomizedtesting.RandomizedRunner$5.evaluate(RandomizedRunner.java:840)
at com.carrotsearch.randomizedtesting.RandomizedRunner$6.evaluate(RandomizedRunner.java:891)
at com.carrotsearch.randomizedtesting.RandomizedRunner$7.evaluate(RandomizedRunner.java:902)
at org.junit.rules.ExternalResource$1.evaluate(ExternalResource.java:54)
at com.carrotsearch.randomizedtesting.rules.StatementAdapter.evaluate(StatementAdapter.java:36)
at com.carrotsearch.randomizedtesting.rules.StatementAdapter.evaluate(StatementAdapter.java:36)
at org.apache.lucene.tests.util.AbstractBeforeAfterRule$1.evaluate(AbstractBeforeAfterRule.java:43)
at com.carrotsearch.randomizedtesting.rules.SystemPropertiesRestoreRule$1.evaluate(SystemPropertiesRestoreRule.java:80)
at org.junit.rules.RunRules.evaluate(RunRules.java:20)
at org.apache.lucene.tests.util.AbstractBeforeAfterRule$1.evaluate(AbstractBeforeAfterRule.java:43)
at com.carrotsearch.randomizedtesting.rules.StatementAdapter.evaluate(StatementAdapter.java:36)
at org.apache.lucene.tests.util.TestRuleStoreClassName$1.evaluate(TestRuleStoreClassName.java:38)
at com.carrotsearch.randomizedtesting.rules.NoShadowingOrOverridesOnMethodsRule$1.evaluate(NoShadowingOrOverridesOnMethodsRule.java:40)
at com.carrotsearch.randomizedtesting.rules.NoShadowingOrOverridesOnMethodsRule$1.evaluate(NoShadowingOrOverridesOnMethodsRule.java:40)
at com.carrotsearch.randomizedtesting.rules.StatementAdapter.evaluate(StatementAdapter.java:36)
at com.carrotsearch.randomizedtesting.rules.StatementAdapter.evaluate(StatementAdapter.java:36)
at org.apache.lucene.tests.util.TestRuleAssertionsRequired$1.evaluate(TestRuleAssertionsRequired.java:53)
at org.apache.lucene.tests.util.AbstractBeforeAfterRule$1.evaluate(AbstractBeforeAfterRule.java:43)
at org.apache.lucene.tests.util.TestRuleMarkFailure$1.evaluate(TestRuleMarkFailure.java:44)
at org.apache.lucene.tests.util.TestRuleIgnoreAfterMaxFailures$1.evaluate(TestRuleIgnoreAfterMaxFailures.java:60)
at org.apache.lucene.tests.util.TestRuleIgnoreTestSuites$1.evaluate(TestRuleIgnoreTestSuites.java:47)
at org.junit.rules.RunRules.evaluate(RunRules.java:20)
at com.carrotsearch.randomizedtesting.rules.StatementAdapter.evaluate(StatementAdapter.java:36)
at com.carrotsearch.randomizedtesting.ThreadLeakControl$StatementRunner.run(ThreadLeakControl.java:390)
at com.carrotsearch.randomizedtesting.ThreadLeakControl.lambda$forkTimeoutingTask$0(ThreadLeakControl.java:850)
at java.base/java.lang.Thread.run(Thread.java:1583)