You are viewing a plain text version of this content. The canonical link for it is here.
Posted to builds@cassandra.apache.org by Apache Jenkins Server <je...@builds.apache.org> on 2026/07/27 22:28:27 UTC

Build complete: Cassandra-trunk #2547 [UNSTABLE] a3ec88632d12a82b7057e1014b00d34890dad3c1

-------------------------------------------------------------------------------
  Build Cassandra-trunk #2547 Still Unstable
  URL: https://ci-cassandra.apache.org/job/Cassandra-trunk/2547/
  -------------------------------------------------------------------------------
  Changes:
  No changes

  -------------------------------------------------------------------------------
  Failed Tests:
  34 tests failed.
FAILED:  dtest-latest.materialized_views_test.TestMaterializedViews.Tests / dtest-latest jdk21 36/64 / test_view_metadata_cleanup
FAILED:  dtest-latest.materialized_views_test.TestMaterializedViews.Tests / dtest-latest jdk21 36/64 / test_view_metadata_cleanup
FAILED:  dtest-novnode.materialized_views_test.TestMaterializedViews.Tests / dtest-novnode jdk11 42/64 / test_view_metadata_cleanup
FAILED:  dtest-upgrade-novnode.upgrade_tests.cql_tests.TestCQLNodes3RF3_Upgrade_current_6_0_x_To_indev_trunk.Tests / dtest-upgrade-novnode jdk11 98/160 / test_column_name_validation
FAILED:  dtest-upgrade-novnode.upgrade_tests.cql_tests.TestCQLNodes3RF3_Upgrade_current_6_0_x_To_indev_trunk.Tests / dtest-upgrade-novnode jdk11 83/160 / test_conditional_update
FAILED:  dtest-upgrade-novnode.upgrade_tests.cql_tests.TestCQLNodes3RF3_Upgrade_current_6_0_x_To_indev_trunk.Tests / dtest-upgrade-novnode jdk11 80/160 / test_empty_blob
FAILED:  dtest-upgrade-novnode.upgrade_tests.cql_tests.TestCQLNodes3RF3_Upgrade_current_6_0_x_To_indev_trunk.Tests / dtest-upgrade-novnode jdk11 145/160 / test_materialized_view_simple
FAILED:  dtest-upgrade-novnode.upgrade_tests.cql_tests.TestCQLNodes3RF3_Upgrade_current_6_0_x_To_indev_trunk.Tests / dtest-upgrade-novnode jdk11 65/160 / test_multi_in_compact
FAILED:  dtest-upgrade-novnode.upgrade_tests.cql_tests.TestCQLNodes3RF3_Upgrade_current_6_0_x_To_indev_trunk.Tests / dtest-upgrade-novnode jdk11 107/160 / test_static_columns_cas
FAILED:  dtest-upgrade-novnode.upgrade_tests.cql_tests.TestCQLNodes3RF3_Upgrade_current_6_0_x_To_indev_trunk.Tests / dtest-upgrade-novnode jdk11 75/160 / test_ticket_5230
FAILED:  dtest-upgrade.upgrade_tests.cql_tests.TestCQLNodes2RF1_Upgrade_current_6_0_x_To_indev_trunk.Tests / dtest-upgrade jdk11 107/160 / test_cas_and_list_index
FAILED:  dtest-upgrade.upgrade_tests.cql_tests.TestCQLNodes2RF1_Upgrade_current_6_0_x_To_indev_trunk.Tests / dtest-upgrade jdk11 102/160 / test_expanded_list_item_conditional
FAILED:  dtest-upgrade.upgrade_tests.cql_tests.TestCQLNodes3RF3_Upgrade_current_6_0_x_To_indev_trunk.Tests / dtest-upgrade jdk11 73/160 / test_list_item_conditional
FAILED:  dtest-upgrade.upgrade_tests.cql_tests.TestCQLNodes3RF3_Upgrade_current_6_0_x_To_indev_trunk.Tests / dtest-upgrade jdk11 157/160 / test_multi_collection
FAILED:  dtest-upgrade.upgrade_tests.cql_tests.TestCQLNodes3RF3_Upgrade_current_6_0_x_To_indev_trunk.Tests / dtest-upgrade jdk11 142/160 / test_null_support
FAILED:  dtest-upgrade.upgrade_tests.cql_tests.TestCQLNodes3RF3_Upgrade_current_6_0_x_To_indev_trunk.Tests / dtest-upgrade jdk11 158/160 / test_range_query
FAILED:  dtest-upgrade.upgrade_tests.cql_tests.TestCQLNodes3RF3_Upgrade_current_6_0_x_To_indev_trunk.Tests / dtest-upgrade jdk11 154/160 / test_set
FAILED:  dtest-upgrade.upgrade_tests.cql_tests.TestCQLNodes3RF3_Upgrade_current_6_0_x_To_indev_trunk.Tests / dtest-upgrade jdk11 81/160 / test_static_with_empty_clustering
FAILED:  dtest.cqlsh_tests.test_cqlsh_copy.TestCqlshCopy.Tests / dtest jdk17 5/64 / test_bulk_round_trip_with_timeouts
FAILED:  org.apache.cassandra.fuzz.sai.MultiNodeSAITest.Tests / jvm-dtest jdk21 5/16 / indexOnlySaiTest-_jdk21_x86_64
FAILED:  org.apache.cassandra.service.accord.journal.AccordJournalBurnTest.Tests / jvm-dtest jdk11 3/16 / testOne-_jdk11_x86_64
FAILED:  org.apache.cassandra.simulator.test.HarrySimulatorTest.Tests / simulator-dtest jdk11 1/2 / test-_jdk11_x86_64
FAILED:  org.apache.cassandra.distributed.test.accord.InteropAccordCQLTest.Tests / jvm-dtest jdk21 16/16 / testCASSimulatorLite-_jdk21_x86_64
FAILED:  org.apache.cassandra.fuzz.topology.AccordTopologyMixupTest.Tests / jvm-dtest jdk17 13/16 / test-_jdk17_x86_64
FAILED:  junit.framework.TestSuite.Tests / jvm-dtest jdk21 5/16 / org.apache.cassandra.fuzz.sai.MultiNodeSAITest-_jdk21_x86_64
FAILED:  org.apache.cassandra.distributed.upgrade.ClusterMetadata2iInitializeTest.Tests / jvm-dtest-upgrade jdk11 3/6 / initializeCMSWithConcurrentIndexReadsTest-_jdk11_x86_64
FAILED:  org.apache.cassandra.distributed.upgrade.ClusterMetadataUpgradePreparedStatementsTest.Tests / jvm-dtest-upgrade jdk11 2/6 / simpleUpgradeTest-_jdk11_x86_64
FAILED:  org.apache.cassandra.simulator.test.EpochStressTest.Tests / simulator-dtest jdk11 2/2 / manyEpochsAndAccordConverges-_jdk11_x86_64
FAILED:  org.apache.cassandra.simulator.test.SingleNodeSingleTableASTTest.Tests / simulator-dtest jdk11 1/2 / accordFull-_jdk11_x86_64
FAILED:  org.apache.cassandra.simulator.test.SingleNodeSingleTableASTTest.Tests / simulator-dtest jdk11 1/2 / accordMixedReads-_jdk11_x86_64
FAILED:  org.apache.cassandra.simulator.test.AccordHarrySimulationTest.Tests / simulator-dtest jdk11 2/2 / test-_jdk11_x86_64
FAILED:  org.apache.cassandra.simulator.test.ShortPaxosSimulationTest.Tests / simulator-dtest jdk11 2/2 / simulationTest-cassandra.testtag_IS_UNDEFINED
FAILED:  org.apache.cassandra.simulator.test.ShortAccordSimulationTest.Tests / simulator-dtest jdk11 1/2 / simulationTest-cassandra.testtag_IS_UNDEFINED
FAILED:  org.apache.cassandra.fuzz.sai.MultiNodeSAITest.Tests / jvm-dtest jdk11 5/16 / indexOnlySaiTest-cassandra.testtag_IS_UNDEFINED

  -------------------------------------------------------------------------------
  For complete test report and logs see https://nightlies.apache.org/cassandra/Cassandra-trunk/2547/