You are viewing a plain text version of this content. The canonical link for it is here.
Posted to builds@cassandra.apache.org by Apache Jenkins Server <je...@builds.apache.org> on 2026/06/08 06:25:14 UTC
Build complete: Cassandra-trunk #2506 [UNSTABLE] 5816595ff174ff49d95f98a0763eee9026395062
-------------------------------------------------------------------------------
Build Cassandra-trunk #2506 Still Unstable
URL: https://ci-cassandra.apache.org/job/Cassandra-trunk/2506/
-------------------------------------------------------------------------------
Changes:
[Michael Semb Wever] Fix ci-cassandra.a.o agent workspaces for Cassandra-5.0 (and above) not
-------------------------------------------------------------------------------
Failed Tests:
69 tests failed.
FAILED: dtest-latest.disk_balance_test.TestDiskBalance.Tests / dtest-latest jdk11 45/64 / test_disk_balance_decommission
FAILED: dtest-latest.disk_balance_test.TestDiskBalance.Tests / dtest-latest jdk11 45/64 / test_disk_balance_decommission
FAILED: dtest-latest.disk_balance_test.TestDiskBalance.Tests / dtest-latest jdk21 43/64 / test_disk_balance_replace_same_address
FAILED: dtest-latest.materialized_views_test.TestMaterializedViews.Tests / dtest-latest jdk21 17/64 / test_complex_mv_select_statements
FAILED: dtest-novnode.materialized_views_test.TestMaterializedViews.Tests / dtest-novnode jdk21 5/64 / test_drop_with_stopped_build
FAILED: dtest-novnode.rebuild_test.TestRebuild.Tests / dtest-novnode jdk11 25/64 / test_resumable_rebuild
FAILED: dtest-novnode.secondary_indexes_test.TestSecondaryIndexes.Tests / dtest-novnode jdk11 14/64 / test_6924_dropping_cf
FAILED: org.apache.cassandra.distributed.test.SinglePartitionReadCommandTest.Tests / jvm-dtest jdk21 2/16 / testNonCompactTableWithOnlyUpdatedColumnOnOneNodeAndColumnDeletionOnTheOther-_jdk21_x86_64
FAILED: org.apache.cassandra.distributed.test.accord.InteropAccordCQLTest.Tests / jvm-dtest jdk11 15/16 / testCASSimulatorLite-_jdk11_x86_64
FAILED: org.apache.cassandra.fuzz.topology.AccordTopologyMixupTest.Tests / jvm-dtest jdk11 1/16 / test-_jdk11_x86_64
FAILED: org.apache.cassandra.repair.autorepair.AutoRepairParameterizedTest.Tests / test jdk11 12/20 / testMVRepair[repairType=PREVIEW_REPAIRED]-cassandra.testtag_IS_UNDEFINED
FAILED: cqlshlib_jdk11_python_3.11_no_amd64_1_1.xml.[failed-to-read]
FAILED: cqlshlib_jdk11_python_3.11_yes_amd64_1_1.xml.[failed-to-read]
FAILED: cqlshlib_jdk11_python_3.8_no_amd64_1_1.xml.[failed-to-read]
FAILED: cqlshlib_jdk11_python_3.8_yes_amd64_1_1.xml.[failed-to-read]
FAILED: dtest-latest.jmx_test.TestJMXSSL.Tests / dtest-latest jdk17 16/64 / test_jmx_connection
FAILED: dtest-latest.jmx_test.TestJMXSSL.Tests / dtest-latest jdk21 16/64 / test_jmx_connection
FAILED: dtest-latest.jmx_test.TestJMXSSL.Tests / dtest-latest jdk11 16/64 / test_jmx_connection
FAILED: dtest-latest.jmx_test.TestJMXSSL.Tests / dtest-latest jdk21 17/64 / test_require_client_auth
FAILED: dtest-latest.jmx_test.TestJMXSSL.Tests / dtest-latest jdk17 17/64 / test_require_client_auth
FAILED: dtest-latest.jmx_test.TestJMXSSL.Tests / dtest-latest jdk11 17/64 / test_require_client_auth
FAILED: dtest-novnode.jmx_test.TestJMXSSL.Tests / dtest-novnode jdk11 22/64 / test_jmx_connection
FAILED: dtest-novnode.jmx_test.TestJMXSSL.Tests / dtest-novnode jdk21 22/64 / test_jmx_connection
FAILED: dtest-novnode.jmx_test.TestJMXSSL.Tests / dtest-novnode jdk17 22/64 / test_jmx_connection
FAILED: dtest-novnode.jmx_test.TestJMXSSL.Tests / dtest-novnode jdk21 23/64 / test_require_client_auth
FAILED: dtest-novnode.jmx_test.TestJMXSSL.Tests / dtest-novnode jdk17 23/64 / test_require_client_auth
FAILED: dtest-novnode.jmx_test.TestJMXSSL.Tests / dtest-novnode jdk11 23/64 / test_require_client_auth
FAILED: dtest.jmx_test.TestJMXSSL.Tests / dtest jdk11 16/64 / test_jmx_connection
FAILED: dtest.jmx_test.TestJMXSSL.Tests / dtest jdk17 16/64 / test_jmx_connection
FAILED: dtest.jmx_test.TestJMXSSL.Tests / dtest jdk21 16/64 / test_jmx_connection
FAILED: dtest.jmx_test.TestJMXSSL.Tests / dtest jdk17 17/64 / test_require_client_auth
FAILED: dtest.jmx_test.TestJMXSSL.Tests / dtest jdk11 17/64 / test_require_client_auth
FAILED: dtest.jmx_test.TestJMXSSL.Tests / dtest jdk21 17/64 / test_require_client_auth
FAILED: org.apache.cassandra.distributed.test.SSTableLoaderEncryptionOptionsTest.Tests / jvm-dtest jdk11 7/16 / bulkLoaderSuccessfullyStreamsOverSsl-_jdk11_x86_64
FAILED: org.apache.cassandra.distributed.test.SSTableLoaderEncryptionOptionsTest.Tests / jvm-dtest jdk17 7/16 / bulkLoaderSuccessfullyStreamsOverSsl-_jdk17_x86_64
FAILED: org.apache.cassandra.distributed.test.SSTableLoaderEncryptionOptionsTest.Tests / jvm-dtest jdk21 7/16 / bulkLoaderSuccessfullyStreamsOverSsl-_jdk21_x86_64
FAILED: org.apache.cassandra.distributed.test.auth.AuthAuditLoggingTest.Tests / jvm-dtest jdk17 13/16 / testMutualTlsAuthenticationFailedWithUntrustedCertificate-_jdk17_x86_64
FAILED: org.apache.cassandra.distributed.test.auth.AuthAuditLoggingTest.Tests / jvm-dtest jdk21 13/16 / testMutualTlsAuthenticationFailedWithUntrustedCertificate-_jdk21_x86_64
FAILED: org.apache.cassandra.distributed.test.jmx.JMXSslConfigDistributedTest.Tests / jvm-dtest jdk11 2/16 / testSystemSettings-_jdk11_x86_64
FAILED: org.apache.cassandra.distributed.test.jmx.JMXSslConfigDistributedTest.Tests / jvm-dtest jdk17 2/16 / testSystemSettings-_jdk17_x86_64
FAILED: org.apache.cassandra.distributed.test.jmx.JMXSslConfigDistributedTest.Tests / jvm-dtest jdk21 2/16 / testSystemSettings-_jdk21_x86_64
FAILED: org.apache.cassandra.distributed.test.accord.InteropAccordCQLTest.Tests / jvm-dtest jdk21 15/16 / testCASSimulatorLite-_jdk21_x86_64
FAILED: org.apache.cassandra.repair.autorepair.AutoRepairParameterizedTest.Tests / test-cdc jdk17 12/20 / testTableAttribute[repairType=PREVIEW_REPAIRED]-cassandra.testtag_IS_UNDEFINED
FAILED: org.apache.cassandra.simulator.test.ShortAccordSimulationTest.Tests / simulator-dtest jdk11 2/2 / simulationTest-_jdk11_x86_64
FAILED: org.apache.cassandra.repair.autorepair.AutoRepairParameterizedTest.Tests / test-cdc jdk11 12/20 / testRepairSuccessAfterRetry[repairType=PREVIEW_REPAIRED]-cassandra.testtag_IS_UNDEFINED
FAILED: org.apache.cassandra.simulator.test.EpochStressTest.Tests / simulator-dtest jdk11 2/2 / manyEpochsAndAccordConverges-_jdk11_x86_64
FAILED: org.apache.cassandra.simulator.test.SingleNodeSingleTableASTTest.Tests / simulator-dtest jdk11 2/2 / accordFull-_jdk11_x86_64
FAILED: org.apache.cassandra.simulator.test.SingleNodeSingleTableASTTest.Tests / simulator-dtest jdk11 2/2 / accordMixedReads-_jdk11_x86_64
FAILED: org.apache.cassandra.simulator.test.AccordHarrySimulationTest.Tests / simulator-dtest jdk11 2/2 / test-_jdk11_x86_64
FAILED: dtest-latest.client_request_metrics_test.TestClientRequestMetrics.Tests / dtest-latest jdk21 34/64 / test_client_request_metrics
FAILED: dtest-latest.client_request_metrics_test.TestClientRequestMetrics.Tests / dtest-latest jdk17 34/64 / test_client_request_metrics
FAILED: dtest-latest.client_request_metrics_test.TestClientRequestMetrics.Tests / dtest-latest jdk11 34/64 / test_client_request_metrics
FAILED: dtest-latest.replace_address_test.TestReplaceAddress.Tests / dtest-latest jdk11 23/64 / test_replace_with_insufficient_replicas
FAILED: dtest-latest.replace_address_test.TestReplaceAddress.Tests / dtest-latest jdk17 23/64 / test_replace_with_insufficient_replicas
FAILED: dtest-latest.replace_address_test.TestReplaceAddress.Tests / dtest-latest jdk17 23/64 / test_replace_with_insufficient_replicas
FAILED: dtest-latest.replace_address_test.TestReplaceAddress.Tests / dtest-latest jdk21 23/64 / test_replace_with_insufficient_replicas
FAILED: dtest-latest.replace_address_test.TestReplaceAddress.Tests / dtest-latest jdk11 23/64 / test_replace_with_insufficient_replicas
FAILED: dtest-latest.replace_address_test.TestReplaceAddress.Tests / dtest-latest jdk21 23/64 / test_replace_with_insufficient_replicas
FAILED: dtest-latest.replace_address_test.TestReplaceAddress.Tests / dtest-latest jdk21 23/64 / test_replace_with_insufficient_replicas
FAILED: dtest-latest.replace_address_test.TestReplaceAddress.Tests / dtest-latest jdk17 23/64 / test_replace_with_insufficient_replicas
FAILED: dtest-latest.replace_address_test.TestReplaceAddress.Tests / dtest-latest jdk11 23/64 / test_replace_with_insufficient_replicas
FAILED: org.apache.cassandra.transport.DriverBurnTest.Tests / test-burn jdk21 1/4 / measureLargeV4WithCompression-cassandra.testtag_IS_UNDEFINED
FAILED: dtest-latest.bootstrap_test.TestBootstrap.Tests / dtest-latest jdk17 7/64 / test_consistent_range_movement_false_with_rf1_should_succeed
FAILED: dtest-latest.bootstrap_test.TestBootstrap.Tests / dtest-latest jdk21 7/64 / test_consistent_range_movement_false_with_rf1_should_succeed
FAILED: dtest-latest.bootstrap_test.TestBootstrap.Tests / dtest-latest jdk11 7/64 / test_consistent_range_movement_false_with_rf1_should_succeed
FAILED: dtest-latest.bootstrap_test.TestBootstrap.Tests / dtest-latest jdk17 6/64 / test_consistent_range_movement_true_with_rf1_should_fail
FAILED: dtest-latest.bootstrap_test.TestBootstrap.Tests / dtest-latest jdk21 6/64 / test_consistent_range_movement_true_with_rf1_should_fail
FAILED: dtest-latest.bootstrap_test.TestBootstrap.Tests / dtest-latest jdk11 6/64 / test_consistent_range_movement_true_with_rf1_should_fail
FAILED: org.apache.cassandra.simulator.test.ShortPaxosSimulationTest.Tests / simulator-dtest jdk11 1/2 / selfReconcileTest-cassandra.testtag_IS_UNDEFINED
-------------------------------------------------------------------------------
For complete test report and logs see https://nightlies.apache.org/cassandra/Cassandra-trunk/2506/