You are viewing a plain text version of this content. The canonical link for it is here.
Posted to dev@hbase.apache.org by Apache Jenkins Server <je...@builds.apache.org> on 2012/04/03 22:38:40 UTC
Build failed in Jenkins: HBase-TRUNK #2705
See <https://builds.apache.org/job/HBase-TRUNK/2705/changes>
Changes:
[stack] HBASE-5692 Add real action time for HLogPrettyPrinter
------------------------------------------
[...truncated 12831 lines...]
Setting project property: maven.dependency.org.xerial.snappy.snappy-java.jar.path -> /home/jenkins/.m2/repository/org/xerial/snappy/snappy-java/1.0.3.2/snappy-java-1.0.3.2.jar
Setting project property: maven.dependency.org.apache.avro.avro-ipc.jar.path -> /home/jenkins/.m2/repository/org/apache/avro/avro-ipc/1.5.3/avro-ipc-1.5.3.jar
Setting project property: maven.dependency.org.jboss.netty.netty.jar.path -> /home/jenkins/.m2/repository/org/jboss/netty/netty/3.2.4.Final/netty-3.2.4.Final.jar
Setting project property: maven.dependency.org.apache.velocity.velocity.jar.path -> /home/jenkins/.m2/repository/org/apache/velocity/velocity/1.7/velocity-1.7.jar
Setting project property: maven.dependency.org.apache.zookeeper.zookeeper.jar.path -> /home/jenkins/.m2/repository/org/apache/zookeeper/zookeeper/3.4.3/zookeeper-3.4.3.jar
Setting project property: maven.dependency.org.apache.thrift.libthrift.jar.path -> /home/jenkins/.m2/repository/org/apache/thrift/libthrift/0.8.0/libthrift-0.8.0.jar
Setting project property: maven.dependency.org.apache.httpcomponents.httpclient.jar.path -> /home/jenkins/.m2/repository/org/apache/httpcomponents/httpclient/4.1.2/httpclient-4.1.2.jar
Setting project property: maven.dependency.org.apache.httpcomponents.httpcore.jar.path -> /home/jenkins/.m2/repository/org/apache/httpcomponents/httpcore/4.1.3/httpcore-4.1.3.jar
Setting project property: maven.dependency.org.jruby.jruby-complete.jar.path -> /home/jenkins/.m2/repository/org/jruby/jruby-complete/1.6.5/jruby-complete-1.6.5.jar
Setting project property: maven.dependency.org.mortbay.jetty.jetty.jar.path -> /home/jenkins/.m2/repository/org/mortbay/jetty/jetty/6.1.26/jetty-6.1.26.jar
Setting project property: maven.dependency.org.mortbay.jetty.jetty-util.jar.path -> /home/jenkins/.m2/repository/org/mortbay/jetty/jetty-util/6.1.26/jetty-util-6.1.26.jar
Setting project property: maven.dependency.org.mortbay.jetty.jsp-2.1.jar.path -> /home/jenkins/.m2/repository/org/mortbay/jetty/jsp-2.1/6.1.14/jsp-2.1-6.1.14.jar
Setting project property: maven.dependency.org.eclipse.jdt.core.jar.path -> /home/jenkins/.m2/repository/org/eclipse/jdt/core/3.1.1/core-3.1.1.jar
Setting project property: maven.dependency.org.mortbay.jetty.jsp-api-2.1.jar.path -> /home/jenkins/.m2/repository/org/mortbay/jetty/jsp-api-2.1/6.1.14/jsp-api-2.1-6.1.14.jar
Setting project property: maven.dependency.org.mortbay.jetty.servlet-api-2.5.jar.path -> /home/jenkins/.m2/repository/org/mortbay/jetty/servlet-api-2.5/6.1.14/servlet-api-2.5-6.1.14.jar
Setting project property: maven.dependency.org.codehaus.jackson.jackson-core-asl.jar.path -> /home/jenkins/.m2/repository/org/codehaus/jackson/jackson-core-asl/1.5.5/jackson-core-asl-1.5.5.jar
Setting project property: maven.dependency.org.codehaus.jackson.jackson-mapper-asl.jar.path -> /home/jenkins/.m2/repository/org/codehaus/jackson/jackson-mapper-asl/1.5.5/jackson-mapper-asl-1.5.5.jar
Setting project property: maven.dependency.org.codehaus.jackson.jackson-jaxrs.jar.path -> /home/jenkins/.m2/repository/org/codehaus/jackson/jackson-jaxrs/1.5.5/jackson-jaxrs-1.5.5.jar
Setting project property: maven.dependency.org.codehaus.jackson.jackson-xc.jar.path -> /home/jenkins/.m2/repository/org/codehaus/jackson/jackson-xc/1.5.5/jackson-xc-1.5.5.jar
Setting project property: maven.dependency.org.slf4j.slf4j-api.jar.path -> /home/jenkins/.m2/repository/org/slf4j/slf4j-api/1.5.8/slf4j-api-1.5.8.jar
Setting project property: maven.dependency.org.slf4j.slf4j-log4j12.jar.path -> /home/jenkins/.m2/repository/org/slf4j/slf4j-log4j12/1.5.8/slf4j-log4j12-1.5.8.jar
Setting project property: maven.dependency.tomcat.jasper-compiler.jar.path -> /home/jenkins/.m2/repository/tomcat/jasper-compiler/5.5.23/jasper-compiler-5.5.23.jar
Setting project property: maven.dependency.tomcat.jasper-runtime.jar.path -> /home/jenkins/.m2/repository/tomcat/jasper-runtime/5.5.23/jasper-runtime-5.5.23.jar
Setting project property: maven.dependency.commons-el.commons-el.jar.path -> /home/jenkins/.m2/repository/commons-el/commons-el/1.0/commons-el-1.0.jar
Setting project property: maven.dependency.org.jamon.jamon-runtime.jar.path -> /home/jenkins/.m2/repository/org/jamon/jamon-runtime/2.3.1/jamon-runtime-2.3.1.jar
Setting project property: maven.dependency.com.google.protobuf.protobuf-java.jar.path -> /home/jenkins/.m2/repository/com/google/protobuf/protobuf-java/2.4.0a/protobuf-java-2.4.0a.jar
Setting project property: maven.dependency.com.sun.jersey.jersey-core.jar.path -> /home/jenkins/.m2/repository/com/sun/jersey/jersey-core/1.4/jersey-core-1.4.jar
Setting project property: maven.dependency.com.sun.jersey.jersey-json.jar.path -> /home/jenkins/.m2/repository/com/sun/jersey/jersey-json/1.4/jersey-json-1.4.jar
Setting project property: maven.dependency.org.codehaus.jettison.jettison.jar.path -> /home/jenkins/.m2/repository/org/codehaus/jettison/jettison/1.1/jettison-1.1.jar
Setting project property: maven.dependency.com.sun.xml.bind.jaxb-impl.jar.path -> /home/jenkins/.m2/repository/com/sun/xml/bind/jaxb-impl/2.1.12/jaxb-impl-2.1.12.jar
Setting project property: maven.dependency.com.sun.jersey.jersey-server.jar.path -> /home/jenkins/.m2/repository/com/sun/jersey/jersey-server/1.4/jersey-server-1.4.jar
Setting project property: maven.dependency.asm.asm.jar.path -> /home/jenkins/.m2/repository/asm/asm/3.1/asm-3.1.jar
Setting project property: maven.dependency.javax.xml.bind.jaxb-api.jar.path -> /home/jenkins/.m2/repository/javax/xml/bind/jaxb-api/2.1/jaxb-api-2.1.jar
Setting project property: maven.dependency.javax.activation.activation.jar.path -> /home/jenkins/.m2/repository/javax/activation/activation/1.1/activation-1.1.jar
Setting project property: maven.dependency.stax.stax-api.jar.path -> /home/jenkins/.m2/repository/stax/stax-api/1.0.1/stax-api-1.0.1.jar
Setting project property: maven.dependency.junit.junit.jar.path -> /home/jenkins/.m2/repository/junit/junit/4.10-HBASE-1/junit-4.10-HBASE-1.jar
Setting project property: maven.dependency.org.mockito.mockito-all.jar.path -> /home/jenkins/.m2/repository/org/mockito/mockito-all/1.8.5/mockito-all-1.8.5.jar
Setting project property: maven.dependency.org.apache.commons.commons-math.jar.path -> /home/jenkins/.m2/repository/org/apache/commons/commons-math/2.1/commons-math-2.1.jar
Setting project property: maven.dependency.org.apache.hadoop.hadoop-core.jar.path -> /home/jenkins/.m2/repository/org/apache/hadoop/hadoop-core/1.0.0/hadoop-core-1.0.0.jar
Setting project property: maven.dependency.xmlenc.xmlenc.jar.path -> /home/jenkins/.m2/repository/xmlenc/xmlenc/0.52/xmlenc-0.52.jar
Setting project property: maven.dependency.commons-net.commons-net.jar.path -> /home/jenkins/.m2/repository/commons-net/commons-net/1.4.1/commons-net-1.4.1.jar
Setting project property: maven.dependency.org.apache.hadoop.hadoop-test.jar.path -> /home/jenkins/.m2/repository/org/apache/hadoop/hadoop-test/1.0.0/hadoop-test-1.0.0.jar
Setting project property: maven.dependency.org.apache.ftpserver.ftplet-api.jar.path -> /home/jenkins/.m2/repository/org/apache/ftpserver/ftplet-api/1.0.0/ftplet-api-1.0.0.jar
Setting project property: maven.dependency.org.apache.mina.mina-core.jar.path -> /home/jenkins/.m2/repository/org/apache/mina/mina-core/2.0.0-M5/mina-core-2.0.0-M5.jar
Setting project property: maven.dependency.org.apache.ftpserver.ftpserver-core.jar.path -> /home/jenkins/.m2/repository/org/apache/ftpserver/ftpserver-core/1.0.0/ftpserver-core-1.0.0.jar
Setting project property: maven.dependency.org.apache.ftpserver.ftpserver-deprecated.jar.path -> /home/jenkins/.m2/repository/org/apache/ftpserver/ftpserver-deprecated/1.0.0-M2/ftpserver-deprecated-1.0.0-M2.jar
[INFO] Executing tasks
Build sequence for target(s) `main' is [main]
Complete build sequence is [main, ]
main:
[mkdir] Created dir: <https://builds.apache.org/job/HBase-TRUNK/ws/trunk/target/hbase-0.95-SNAPSHOT/hbase-0.95-SNAPSHOT/lib/native/Linux-i386-32>
[exec] Current OS is Linux
[exec] Executing 'sh' with arguments:
[exec] './copynativelibs.sh'
[exec]
[exec] The ' characters around the executable and arguments are
[exec] not part of the command.
Execute:Java13CommandLauncher: Executing 'sh' with arguments:
'./copynativelibs.sh'
The ' characters around the executable and arguments are
not part of the command.
[exec] Current OS is Linux
[exec] Executing 'tar' with arguments:
[exec] 'czf'
[exec] '<https://builds.apache.org/job/HBase-TRUNK/ws/trunk/target/hbase-0.95-SNAPSHOT.tar.gz'>
[exec] 'hbase-0.95-SNAPSHOT/'
[exec]
[exec] The ' characters around the executable and arguments are
[exec] not part of the command.
Execute:Java13CommandLauncher: Executing 'tar' with arguments:
'czf'
'<https://builds.apache.org/job/HBase-TRUNK/ws/trunk/target/hbase-0.95-SNAPSHOT.tar.gz'>
'hbase-0.95-SNAPSHOT/'
The ' characters around the executable and arguments are
not part of the command.
[INFO] Executed tasks
[INFO]
[INFO] --- apache-rat-plugin:0.8:check (default) @ hbase ---
[DEBUG] org.apache.rat:apache-rat-plugin:jar:0.8:
[DEBUG] org.apache.rat:apache-rat-core:jar:0.8:compile
[DEBUG] commons-collections:commons-collections:jar:3.2:compile
[DEBUG] commons-lang:commons-lang:jar:2.1:compile
[DEBUG] commons-io:commons-io:jar:1.4:compile
[DEBUG] org.apache.commons:commons-compress:jar:1.0:compile
[DEBUG] commons-cli:commons-cli:jar:1.2:compile
[DEBUG] org.codehaus.plexus:plexus-utils:jar:1.4:compile
[DEBUG] org.apache.maven:maven-plugin-api:jar:2.0.4:compile
[DEBUG] org.apache.maven.doxia:doxia-site-renderer:jar:1.0-alpha-8:compile
[DEBUG] org.apache.maven.doxia:doxia-core:jar:1.0-alpha-8:compile
[DEBUG] org.apache.maven.doxia:doxia-sink-api:jar:1.0-alpha-8:compile
[DEBUG] org.codehaus.plexus:plexus-i18n:jar:1.0-beta-6:compile
[DEBUG] org.codehaus.plexus:plexus-velocity:jar:1.1.3:compile
[DEBUG] velocity:velocity:jar:1.4:compile
[DEBUG] velocity:velocity-dep:jar:1.4:runtime
[DEBUG] org.apache.maven.doxia:doxia-decoration-model:jar:1.0-alpha-8:compile
[DEBUG] org.apache.maven.reporting:maven-reporting-impl:jar:2.0.4:compile
[DEBUG] org.apache.maven:maven-project:jar:2.0.4:compile
[DEBUG] org.apache.maven:maven-settings:jar:2.0.4:compile
[DEBUG] org.apache.maven:maven-profile:jar:2.0.4:compile
[DEBUG] org.apache.maven:maven-model:jar:2.0.4:compile
[DEBUG] commons-validator:commons-validator:jar:1.2.0:compile
[DEBUG] commons-beanutils:commons-beanutils:jar:1.7.0:compile
[DEBUG] commons-digester:commons-digester:jar:1.6:compile
[DEBUG] commons-logging:commons-logging:jar:1.0.4:compile
[DEBUG] xml-apis:xml-apis:jar:1.0.b2:compile
[DEBUG] oro:oro:jar:2.0.7:compile
[DEBUG] org.apache.maven.reporting:maven-reporting-api:jar:2.0.4:compile
[DEBUG] org.apache.maven:maven-artifact-manager:jar:2.0.4:compile
[DEBUG] org.apache.maven:maven-repository-metadata:jar:2.0.4:compile
[DEBUG] org.apache.maven:maven-artifact:jar:2.0.4:compile
[DEBUG] org.codehaus.plexus:plexus-container-default:jar:1.0-alpha-9:compile
[DEBUG] classworlds:classworlds:jar:1.1-alpha-2:compile
[DEBUG] org.apache.maven.shared:maven-plugin-testing-harness:jar:1.1:compile
[DEBUG] org.apache.maven:maven-core:jar:2.0:compile
[DEBUG] org.apache.maven:maven-plugin-parameter-documenter:jar:2.0:compile
[DEBUG] org.apache.maven:maven-error-diagnostics:jar:2.0:compile
[DEBUG] org.apache.maven:maven-plugin-registry:jar:2.0:compile
[DEBUG] org.apache.maven:maven-plugin-descriptor:jar:2.0:compile
[DEBUG] org.codehaus.plexus:plexus-interactivity-api:jar:1.0-alpha-4:compile
[DEBUG] org.apache.maven:maven-monitor:jar:2.0:compile
[DEBUG] junit:junit:jar:3.8.2:test (scope managed from compile) (version managed from 3.8.1)
[DEBUG] org.codehaus.plexus:plexus-archiver:jar:1.0-alpha-7:compile
[DEBUG] Created new class realm plugin>org.apache.rat:apache-rat-plugin:0.8
[DEBUG] Importing foreign packages into class realm plugin>org.apache.rat:apache-rat-plugin:0.8
[DEBUG] Imported: < maven.api
[DEBUG] Populating class realm plugin>org.apache.rat:apache-rat-plugin:0.8
[DEBUG] Included: org.apache.rat:apache-rat-plugin:jar:0.8
[DEBUG] Included: org.apache.rat:apache-rat-core:jar:0.8
[DEBUG] Included: commons-collections:commons-collections:jar:3.2
[DEBUG] Included: commons-lang:commons-lang:jar:2.1
[DEBUG] Included: commons-io:commons-io:jar:1.4
[DEBUG] Included: org.apache.commons:commons-compress:jar:1.0
[DEBUG] Included: commons-cli:commons-cli:jar:1.2
[DEBUG] Included: org.codehaus.plexus:plexus-utils:jar:1.4
[DEBUG] Included: org.apache.maven.doxia:doxia-site-renderer:jar:1.0-alpha-8
[DEBUG] Included: org.apache.maven.doxia:doxia-core:jar:1.0-alpha-8
[DEBUG] Included: org.apache.maven.doxia:doxia-sink-api:jar:1.0-alpha-8
[DEBUG] Included: org.codehaus.plexus:plexus-i18n:jar:1.0-beta-6
[DEBUG] Included: org.codehaus.plexus:plexus-velocity:jar:1.1.3
[DEBUG] Included: velocity:velocity:jar:1.4
[DEBUG] Included: velocity:velocity-dep:jar:1.4
[DEBUG] Included: org.apache.maven.doxia:doxia-decoration-model:jar:1.0-alpha-8
[DEBUG] Included: org.apache.maven.reporting:maven-reporting-impl:jar:2.0.4
[DEBUG] Included: commons-validator:commons-validator:jar:1.2.0
[DEBUG] Included: commons-beanutils:commons-beanutils:jar:1.7.0
[DEBUG] Included: commons-digester:commons-digester:jar:1.6
[DEBUG] Included: commons-logging:commons-logging:jar:1.0.4
[DEBUG] Included: xml-apis:xml-apis:jar:1.0.b2
[DEBUG] Included: oro:oro:jar:2.0.7
[DEBUG] Included: org.apache.maven.reporting:maven-reporting-api:jar:2.0.4
[DEBUG] Included: org.apache.maven.shared:maven-plugin-testing-harness:jar:1.1
[DEBUG] Included: org.codehaus.plexus:plexus-interactivity-api:jar:1.0-alpha-4
[DEBUG] Included: org.codehaus.plexus:plexus-archiver:jar:1.0-alpha-7
[DEBUG] Excluded: org.apache.maven:maven-plugin-api:jar:2.0.4
[DEBUG] Excluded: org.apache.maven:maven-project:jar:2.0.4
[DEBUG] Excluded: org.apache.maven:maven-settings:jar:2.0.4
[DEBUG] Excluded: org.apache.maven:maven-profile:jar:2.0.4
[DEBUG] Excluded: org.apache.maven:maven-model:jar:2.0.4
[DEBUG] Excluded: org.apache.maven:maven-artifact-manager:jar:2.0.4
[DEBUG] Excluded: org.apache.maven:maven-repository-metadata:jar:2.0.4
[DEBUG] Excluded: org.apache.maven:maven-artifact:jar:2.0.4
[DEBUG] Excluded: org.codehaus.plexus:plexus-container-default:jar:1.0-alpha-9
[DEBUG] Excluded: classworlds:classworlds:jar:1.1-alpha-2
[DEBUG] Excluded: org.apache.maven:maven-core:jar:2.0
[DEBUG] Excluded: org.apache.maven:maven-plugin-parameter-documenter:jar:2.0
[DEBUG] Excluded: org.apache.maven:maven-error-diagnostics:jar:2.0
[DEBUG] Excluded: org.apache.maven:maven-plugin-registry:jar:2.0
[DEBUG] Excluded: org.apache.maven:maven-plugin-descriptor:jar:2.0
[DEBUG] Excluded: org.apache.maven:maven-monitor:jar:2.0
[DEBUG] Excluded: junit:junit:jar:3.8.2
[DEBUG] Configuring mojo org.apache.rat:apache-rat-plugin:0.8:check from plugin realm ClassRealm[plugin>org.apache.rat:apache-rat-plugin:0.8, parent: sun.misc.Launcher$AppClassLoader@192d342]
[DEBUG] Configuring mojo 'org.apache.rat:apache-rat-plugin:0.8:check' with basic configurator -->
[DEBUG] (f) addDefaultLicenseMatchers = true
[DEBUG] (f) addLicenseHeaders = false
[DEBUG] (f) basedir = <https://builds.apache.org/job/HBase-TRUNK/ws/trunk>
[DEBUG] (f) excludeSubProjects = true
[DEBUG] (f) excludes = [**/.*, **/*.tgz, **/*.orig, **/test/**, **/8e8ab58dcf39412da19833fcd8f687ac, **/.git/**, **/target/**, **/CHANGES.txt, **/generated/**, **/conf/*, **/*.avpr, **/*.svg, **/*.vm, **/control, **/conffile, docs/*, **/src/site/resources/css/freebsd_docbook.css]
[DEBUG] (f) numUnapprovedLicenses = 0
[DEBUG] (f) project = MavenProject: org.apache.hbase:hbase:0.95-SNAPSHOT @ <https://builds.apache.org/job/HBase-TRUNK/ws/trunk/pom.xml>
[DEBUG] (f) reportFile = <https://builds.apache.org/job/HBase-TRUNK/ws/trunk/target/rat.txt>
[DEBUG] (f) reportStyle = plain
[DEBUG] (f) useDefaultExcludes = true
[DEBUG] (f) useEclipseDefaultExcludes = true
[DEBUG] (f) useIdeaDefaultExcludes = true
[DEBUG] (f) useMavenDefaultExcludes = true
[DEBUG] -- end configuration --
[INFO] Exclude: **/.*
[INFO] Exclude: **/*.tgz
[INFO] Exclude: **/*.orig
[INFO] Exclude: **/test/**
[INFO] Exclude: **/8e8ab58dcf39412da19833fcd8f687ac
[INFO] Exclude: **/.git/**
[INFO] Exclude: **/target/**
[INFO] Exclude: **/CHANGES.txt
[INFO] Exclude: **/generated/**
[INFO] Exclude: **/conf/*
[INFO] Exclude: **/*.avpr
[INFO] Exclude: **/*.svg
[INFO] Exclude: **/*.vm
[INFO] Exclude: **/control
[INFO] Exclude: **/conffile
[INFO] Exclude: docs/*
[INFO] Exclude: **/src/site/resources/css/freebsd_docbook.css
[INFO] ------------------------------------------------------------------------
[INFO] BUILD FAILURE
[INFO] ------------------------------------------------------------------------
[INFO] Total time: 38:29.421s
[INFO] Finished at: Tue Apr 03 00:22:38 UTC 2012
[INFO] Final Memory: 51M/1149M
[INFO] ------------------------------------------------------------------------
[ERROR] Failed to execute goal org.apache.rat:apache-rat-plugin:0.8:check (default) on project hbase: Too many unapproved licenses: 1 -> [Help 1]
org.apache.maven.lifecycle.LifecycleExecutionException: Failed to execute goal org.apache.rat:apache-rat-plugin:0.8:check (default) on project hbase: Too many unapproved licenses: 1
at org.apache.maven.lifecycle.internal.MojoExecutor.execute(MojoExecutor.java:213)
at org.apache.maven.lifecycle.internal.MojoExecutor.execute(MojoExecutor.java:153)
at org.apache.maven.lifecycle.internal.MojoExecutor.execute(MojoExecutor.java:145)
at org.apache.maven.lifecycle.internal.LifecycleModuleBuilder.buildProject(LifecycleModuleBuilder.java:84)
at org.apache.maven.lifecycle.internal.LifecycleModuleBuilder.buildProject(LifecycleModuleBuilder.java:59)
at org.apache.maven.lifecycle.internal.LifecycleStarter.singleThreadedBuild(LifecycleStarter.java:183)
at org.apache.maven.lifecycle.internal.LifecycleStarter.execute(LifecycleStarter.java:161)
at org.apache.maven.DefaultMaven.doExecute(DefaultMaven.java:319)
at org.apache.maven.DefaultMaven.execute(DefaultMaven.java:156)
at org.apache.maven.cli.MavenCli.execute(MavenCli.java:537)
at org.apache.maven.cli.MavenCli.doMain(MavenCli.java:196)
at org.apache.maven.cli.MavenCli.main(MavenCli.java:141)
at sun.reflect.NativeMethodAccessorImpl.invoke0(Native Method)
at sun.reflect.NativeMethodAccessorImpl.invoke(NativeMethodAccessorImpl.java:39)
at sun.reflect.DelegatingMethodAccessorImpl.invoke(DelegatingMethodAccessorImpl.java:25)
at java.lang.reflect.Method.invoke(Method.java:597)
at org.codehaus.plexus.classworlds.launcher.Launcher.launchEnhanced(Launcher.java:290)
at org.codehaus.plexus.classworlds.launcher.Launcher.launch(Launcher.java:230)
at org.codehaus.plexus.classworlds.launcher.Launcher.mainWithExitCode(Launcher.java:409)
at org.codehaus.plexus.classworlds.launcher.Launcher.main(Launcher.java:352)
Caused by: org.apache.rat.mp.RatCheckException: Too many unapproved licenses: 1
at org.apache.rat.mp.RatCheckMojo.check(RatCheckMojo.java:167)
at org.apache.rat.mp.RatCheckMojo.execute(RatCheckMojo.java:159)
at org.apache.maven.plugin.DefaultBuildPluginManager.executeMojo(DefaultBuildPluginManager.java:101)
at org.apache.maven.lifecycle.internal.MojoExecutor.execute(MojoExecutor.java:209)
... 19 more
[ERROR]
[ERROR]
[ERROR] For more information about the errors and possible solutions, please read the following articles:
[ERROR] [Help 1] http://cwiki.apache.org/confluence/display/MAVEN/MojoFailureException
Build step 'Invoke top-level Maven targets' marked build as failure
Archiving artifacts
Updating HBASE-5692
Recording test results
Jenkins build is back to normal : HBase-TRUNK #2712
Posted by Apache Jenkins Server <je...@builds.apache.org>.
See <https://builds.apache.org/job/HBase-TRUNK/2712/>
Build failed in Jenkins: HBase-TRUNK #2711
Posted by Apache Jenkins Server <je...@builds.apache.org>.
See <https://builds.apache.org/job/HBase-TRUNK/2711/>
------------------------------------------
Started by user stack
Building remotely on ubuntu4 in workspace <https://builds.apache.org/job/HBase-TRUNK/ws/>
hudson.util.IOException2: remote file operation failed: <https://builds.apache.org/job/HBase-TRUNK/ws/> at hudson.remoting.Channel@7b7252c4:ubuntu4
at hudson.FilePath.act(FilePath.java:828)
at hudson.FilePath.act(FilePath.java:814)
at hudson.scm.SubversionSCM.checkout(SubversionSCM.java:743)
at hudson.scm.SubversionSCM.checkout(SubversionSCM.java:685)
at hudson.model.AbstractProject.checkout(AbstractProject.java:1212)
at hudson.model.AbstractBuild$AbstractRunner.checkout(AbstractBuild.java:579)
at hudson.model.AbstractBuild$AbstractRunner.run(AbstractBuild.java:468)
at hudson.model.Run.run(Run.java:1413)
at hudson.model.FreeStyleBuild.run(FreeStyleBuild.java:46)
at hudson.model.ResourceController.execute(ResourceController.java:88)
at hudson.model.Executor.run(Executor.java:238)
Caused by: java.io.IOException: Remote call on ubuntu4 failed
at hudson.remoting.Channel.call(Channel.java:655)
at hudson.FilePath.act(FilePath.java:821)
... 10 more
Caused by: java.lang.LinkageError: loader (instance of hudson/remoting/RemoteClassLoader): attempted duplicate class definition for name: "hudson/model/Descriptor"
at java.lang.ClassLoader.defineClass1(Native Method)
at java.lang.ClassLoader.defineClass(ClassLoader.java:634)
at java.lang.ClassLoader.defineClass(ClassLoader.java:480)
at hudson.remoting.RemoteClassLoader.loadClassFile(RemoteClassLoader.java:152)
at hudson.remoting.RemoteClassLoader.findClass(RemoteClassLoader.java:131)
at java.lang.ClassLoader.loadClass(ClassLoader.java:321)
at java.lang.ClassLoader.loadClass(ClassLoader.java:266)
at java.lang.Class.getDeclaredFields0(Native Method)
at java.lang.Class.privateGetDeclaredFields(Class.java:2308)
at java.lang.Class.getDeclaredField(Class.java:1897)
at java.io.ObjectStreamClass.getDeclaredSUID(ObjectStreamClass.java:1627)
at java.io.ObjectStreamClass.access$700(ObjectStreamClass.java:69)
at java.io.ObjectStreamClass$2.run(ObjectStreamClass.java:442)
at java.security.AccessController.doPrivileged(Native Method)
at java.io.ObjectStreamClass.<init>(ObjectStreamClass.java:430)
at java.io.ObjectStreamClass.lookup(ObjectStreamClass.java:327)
at java.io.ObjectStreamClass.initNonProxy(ObjectStreamClass.java:564)
at java.io.ObjectInputStream.readNonProxyDesc(ObjectInputStream.java:1600)
at java.io.ObjectInputStream.readClassDesc(ObjectInputStream.java:1513)
at java.io.ObjectInputStream.readNonProxyDesc(ObjectInputStream.java:1600)
at java.io.ObjectInputStream.readClassDesc(ObjectInputStream.java:1513)
at java.io.ObjectInputStream.readOrdinaryObject(ObjectInputStream.java:1749)
at java.io.ObjectInputStream.readObject0(ObjectInputStream.java:1346)
at java.io.ObjectInputStream.defaultReadFields(ObjectInputStream.java:1963)
at java.io.ObjectInputStream.readSerialData(ObjectInputStream.java:1887)
at java.io.ObjectInputStream.readOrdinaryObject(ObjectInputStream.java:1770)
at java.io.ObjectInputStream.readObject0(ObjectInputStream.java:1346)
at java.io.ObjectInputStream.defaultReadFields(ObjectInputStream.java:1963)
at java.io.ObjectInputStream.readSerialData(ObjectInputStream.java:1887)
at java.io.ObjectInputStream.readOrdinaryObject(ObjectInputStream.java:1770)
at java.io.ObjectInputStream.readObject0(ObjectInputStream.java:1346)
at java.io.ObjectInputStream.defaultReadFields(ObjectInputStream.java:1963)
at java.io.ObjectInputStream.readSerialData(ObjectInputStream.java:1887)
at java.io.ObjectInputStream.readOrdinaryObject(ObjectInputStream.java:1770)
at java.io.ObjectInputStream.readObject0(ObjectInputStream.java:1346)
at java.io.ObjectInputStream.readObject(ObjectInputStream.java:368)
at hudson.remoting.UserRequest.deserialize(UserRequest.java:182)
at hudson.remoting.UserRequest.perform(UserRequest.java:98)
at hudson.remoting.UserRequest.perform(UserRequest.java:48)
at hudson.remoting.Request$2.run(Request.java:287)
at hudson.remoting.InterceptingExecutorService$1.call(InterceptingExecutorService.java:72)
at java.util.concurrent.FutureTask$Sync.innerRun(FutureTask.java:334)
at java.util.concurrent.FutureTask.run(FutureTask.java:166)
at java.util.concurrent.ThreadPoolExecutor.runWorker(ThreadPoolExecutor.java:1110)
at java.util.concurrent.ThreadPoolExecutor$Worker.run(ThreadPoolExecutor.java:603)
at java.lang.Thread.run(Thread.java:636)
Retrying after 10 seconds
hudson.util.IOException2: remote file operation failed: <https://builds.apache.org/job/HBase-TRUNK/ws/> at hudson.remoting.Channel@7b7252c4:ubuntu4
at hudson.FilePath.act(FilePath.java:828)
at hudson.FilePath.act(FilePath.java:814)
at hudson.scm.SubversionSCM.checkout(SubversionSCM.java:743)
at hudson.scm.SubversionSCM.checkout(SubversionSCM.java:685)
at hudson.model.AbstractProject.checkout(AbstractProject.java:1212)
at hudson.model.AbstractBuild$AbstractRunner.checkout(AbstractBuild.java:579)
at hudson.model.AbstractBuild$AbstractRunner.run(AbstractBuild.java:468)
at hudson.model.Run.run(Run.java:1413)
at hudson.model.FreeStyleBuild.run(FreeStyleBuild.java:46)
at hudson.model.ResourceController.execute(ResourceController.java:88)
at hudson.model.Executor.run(Executor.java:238)
Caused by: java.io.IOException: Remote call on ubuntu4 failed
at hudson.remoting.Channel.call(Channel.java:655)
at hudson.FilePath.act(FilePath.java:821)
... 10 more
Caused by: java.lang.LinkageError: loader (instance of hudson/remoting/RemoteClassLoader): attempted duplicate class definition for name: "hudson/model/Descriptor"
at java.lang.ClassLoader.defineClass1(Native Method)
at java.lang.ClassLoader.defineClass(ClassLoader.java:634)
at java.lang.ClassLoader.defineClass(ClassLoader.java:480)
at hudson.remoting.RemoteClassLoader.loadClassFile(RemoteClassLoader.java:152)
at hudson.remoting.RemoteClassLoader.findClass(RemoteClassLoader.java:131)
at java.lang.ClassLoader.loadClass(ClassLoader.java:321)
at java.lang.ClassLoader.loadClass(ClassLoader.java:266)
at java.lang.Class.getDeclaredFields0(Native Method)
at java.lang.Class.privateGetDeclaredFields(Class.java:2308)
at java.lang.Class.getDeclaredField(Class.java:1897)
at java.io.ObjectStreamClass.getDeclaredSUID(ObjectStreamClass.java:1627)
at java.io.ObjectStreamClass.access$700(ObjectStreamClass.java:69)
at java.io.ObjectStreamClass$2.run(ObjectStreamClass.java:442)
at java.security.AccessController.doPrivileged(Native Method)
at java.io.ObjectStreamClass.<init>(ObjectStreamClass.java:430)
at java.io.ObjectStreamClass.lookup(ObjectStreamClass.java:327)
at java.io.ObjectStreamClass.initNonProxy(ObjectStreamClass.java:564)
at java.io.ObjectInputStream.readNonProxyDesc(ObjectInputStream.java:1600)
at java.io.ObjectInputStream.readClassDesc(ObjectInputStream.java:1513)
at java.io.ObjectInputStream.readNonProxyDesc(ObjectInputStream.java:1600)
at java.io.ObjectInputStream.readClassDesc(ObjectInputStream.java:1513)
at java.io.ObjectInputStream.readOrdinaryObject(ObjectInputStream.java:1749)
at java.io.ObjectInputStream.readObject0(ObjectInputStream.java:1346)
at java.io.ObjectInputStream.defaultReadFields(ObjectInputStream.java:1963)
at java.io.ObjectInputStream.readSerialData(ObjectInputStream.java:1887)
at java.io.ObjectInputStream.readOrdinaryObject(ObjectInputStream.java:1770)
at java.io.ObjectInputStream.readObject0(ObjectInputStream.java:1346)
at java.io.ObjectInputStream.defaultReadFields(ObjectInputStream.java:1963)
at java.io.ObjectInputStream.readSerialData(ObjectInputStream.java:1887)
at java.io.ObjectInputStream.readOrdinaryObject(ObjectInputStream.java:1770)
at java.io.ObjectInputStream.readObject0(ObjectInputStream.java:1346)
at java.io.ObjectInputStream.defaultReadFields(ObjectInputStream.java:1963)
at java.io.ObjectInputStream.readSerialData(ObjectInputStream.java:1887)
at java.io.ObjectInputStream.readOrdinaryObject(ObjectInputStream.java:1770)
at java.io.ObjectInputStream.readObject0(ObjectInputStream.java:1346)
at java.io.ObjectInputStream.readObject(ObjectInputStream.java:368)
at hudson.remoting.UserRequest.deserialize(UserRequest.java:182)
at hudson.remoting.UserRequest.perform(UserRequest.java:98)
at hudson.remoting.UserRequest.perform(UserRequest.java:48)
at hudson.remoting.Request$2.run(Request.java:287)
at hudson.remoting.InterceptingExecutorService$1.call(InterceptingExecutorService.java:72)
at java.util.concurrent.FutureTask$Sync.innerRun(FutureTask.java:334)
at java.util.concurrent.FutureTask.run(FutureTask.java:166)
at java.util.concurrent.ThreadPoolExecutor.runWorker(ThreadPoolExecutor.java:1110)
at java.util.concurrent.ThreadPoolExecutor$Worker.run(ThreadPoolExecutor.java:603)
at java.lang.Thread.run(Thread.java:636)
Retrying after 10 seconds
hudson.util.IOException2: remote file operation failed: <https://builds.apache.org/job/HBase-TRUNK/ws/> at hudson.remoting.Channel@7b7252c4:ubuntu4
at hudson.FilePath.act(FilePath.java:828)
at hudson.FilePath.act(FilePath.java:814)
at hudson.scm.SubversionSCM.checkout(SubversionSCM.java:743)
at hudson.scm.SubversionSCM.checkout(SubversionSCM.java:685)
at hudson.model.AbstractProject.checkout(AbstractProject.java:1212)
at hudson.model.AbstractBuild$AbstractRunner.checkout(AbstractBuild.java:579)
at hudson.model.AbstractBuild$AbstractRunner.run(AbstractBuild.java:468)
at hudson.model.Run.run(Run.java:1413)
at hudson.model.FreeStyleBuild.run(FreeStyleBuild.java:46)
at hudson.model.ResourceController.execute(ResourceController.java:88)
at hudson.model.Executor.run(Executor.java:238)
Caused by: java.io.IOException: Remote call on ubuntu4 failed
at hudson.remoting.Channel.call(Channel.java:655)
at hudson.FilePath.act(FilePath.java:821)
... 10 more
Caused by: java.lang.LinkageError: loader (instance of hudson/remoting/RemoteClassLoader): attempted duplicate class definition for name: "hudson/model/Descriptor"
at java.lang.ClassLoader.defineClass1(Native Method)
at java.lang.ClassLoader.defineClass(ClassLoader.java:634)
at java.lang.ClassLoader.defineClass(ClassLoader.java:480)
at hudson.remoting.RemoteClassLoader.loadClassFile(RemoteClassLoader.java:152)
at hudson.remoting.RemoteClassLoader.findClass(RemoteClassLoader.java:131)
at java.lang.ClassLoader.loadClass(ClassLoader.java:321)
at java.lang.ClassLoader.loadClass(ClassLoader.java:266)
at java.lang.Class.getDeclaredFields0(Native Method)
at java.lang.Class.privateGetDeclaredFields(Class.java:2308)
at java.lang.Class.getDeclaredField(Class.java:1897)
at java.io.ObjectStreamClass.getDeclaredSUID(ObjectStreamClass.java:1627)
at java.io.ObjectStreamClass.access$700(ObjectStreamClass.java:69)
at java.io.ObjectStreamClass$2.run(ObjectStreamClass.java:442)
at java.security.AccessController.doPrivileged(Native Method)
at java.io.ObjectStreamClass.<init>(ObjectStreamClass.java:430)
at java.io.ObjectStreamClass.lookup(ObjectStreamClass.java:327)
at java.io.ObjectStreamClass.initNonProxy(ObjectStreamClass.java:564)
at java.io.ObjectInputStream.readNonProxyDesc(ObjectInputStream.java:1600)
at java.io.ObjectInputStream.readClassDesc(ObjectInputStream.java:1513)
at java.io.ObjectInputStream.readNonProxyDesc(ObjectInputStream.java:1600)
at java.io.ObjectInputStream.readClassDesc(ObjectInputStream.java:1513)
at java.io.ObjectInputStream.readOrdinaryObject(ObjectInputStream.java:1749)
at java.io.ObjectInputStream.readObject0(ObjectInputStream.java:1346)
at java.io.ObjectInputStream.defaultReadFields(ObjectInputStream.java:1963)
at java.io.ObjectInputStream.readSerialData(ObjectInputStream.java:1887)
at java.io.ObjectInputStream.readOrdinaryObject(ObjectInputStream.java:1770)
at java.io.ObjectInputStream.readObject0(ObjectInputStream.java:1346)
at java.io.ObjectInputStream.defaultReadFields(ObjectInputStream.java:1963)
at java.io.ObjectInputStream.readSerialData(ObjectInputStream.java:1887)
at java.io.ObjectInputStream.readOrdinaryObject(ObjectInputStream.java:1770)
at java.io.ObjectInputStream.readObject0(ObjectInputStream.java:1346)
at java.io.ObjectInputStream.defaultReadFields(ObjectInputStream.java:1963)
at java.io.ObjectInputStream.readSerialData(ObjectInputStream.java:1887)
at java.io.ObjectInputStream.readOrdinaryObject(ObjectInputStream.java:1770)
at java.io.ObjectInputStream.readObject0(ObjectInputStream.java:1346)
at java.io.ObjectInputStream.readObject(ObjectInputStream.java:368)
at hudson.remoting.UserRequest.deserialize(UserRequest.java:182)
at hudson.remoting.UserRequest.perform(UserRequest.java:98)
at hudson.remoting.UserRequest.perform(UserRequest.java:48)
at hudson.remoting.Request$2.run(Request.java:287)
at hudson.remoting.InterceptingExecutorService$1.call(InterceptingExecutorService.java:72)
at java.util.concurrent.FutureTask$Sync.innerRun(FutureTask.java:334)
at java.util.concurrent.FutureTask.run(FutureTask.java:166)
at java.util.concurrent.ThreadPoolExecutor.runWorker(ThreadPoolExecutor.java:1110)
at java.util.concurrent.ThreadPoolExecutor$Worker.run(ThreadPoolExecutor.java:603)
at java.lang.Thread.run(Thread.java:636)
Archiving artifacts
Recording test results
Build failed in Jenkins: HBase-TRUNK #2710
Posted by Apache Jenkins Server <je...@builds.apache.org>.
See <https://builds.apache.org/job/HBase-TRUNK/2710/changes>
Changes:
[nspiegelberg] HBASE-5359 Alter in the shell can be too quick and return before the table is altered
------------------------------------------
[...truncated 13104 lines...]
[DEBUG] Excluded: org.apache.maven:maven-artifact:jar:2.0.9
[DEBUG] Excluded: org.apache.maven:maven-project:jar:2.0.9
[DEBUG] Excluded: org.apache.maven:maven-settings:jar:2.0.9
[DEBUG] Excluded: org.apache.maven:maven-profile:jar:2.0.9
[DEBUG] Excluded: org.apache.maven:maven-model:jar:2.0.9
[DEBUG] Excluded: org.apache.maven:maven-artifact-manager:jar:2.0.9
[DEBUG] Excluded: org.apache.maven:maven-plugin-registry:jar:2.0.9
[DEBUG] Excluded: org.codehaus.plexus:plexus-container-default:jar:1.0-alpha-9-stable-1
[DEBUG] Excluded: junit:junit:jar:3.8.1
[DEBUG] Excluded: org.apache.maven:maven-core:jar:2.0.9
[DEBUG] Excluded: org.apache.maven:maven-plugin-parameter-documenter:jar:2.0.9
[DEBUG] Excluded: org.apache.maven:maven-repository-metadata:jar:2.0.9
[DEBUG] Excluded: org.apache.maven:maven-error-diagnostics:jar:2.0.9
[DEBUG] Excluded: org.apache.maven:maven-plugin-descriptor:jar:2.0.9
[DEBUG] Excluded: org.apache.maven:maven-monitor:jar:2.0.9
[DEBUG] Excluded: classworlds:classworlds:jar:1.1
[DEBUG] Excluded: org.apache.maven:maven-toolchain:jar:2.0.9
[DEBUG] Configuring mojo org.apache.maven.plugins:maven-failsafe-plugin:2.12-TRUNK-HBASE-2:integration-test from plugin realm ClassRealm[plugin>org.apache.maven.plugins:maven-failsafe-plugin:2.12-TRUNK-HBASE-2, parent: sun.misc.Launcher$AppClassLoader@192d342]
[DEBUG] Configuring mojo 'org.apache.maven.plugins:maven-failsafe-plugin:2.12-TRUNK-HBASE-2:integration-test' with basic configurator -->
[DEBUG] (s) basedir = <https://builds.apache.org/job/HBase-TRUNK/ws/trunk>
[DEBUG] (s) childDelegation = false
[DEBUG] (s) classesDirectory = <https://builds.apache.org/job/HBase-TRUNK/ws/trunk/target/classes>
[DEBUG] (s) disableXmlReport = false
[DEBUG] (s) enableAssertions = true
[DEBUG] (s) environmentVariables = {DYLD_LIBRARY_PATH=${env.DYLD_LIBRARY_PATH}:<https://builds.apache.org/job/HBase-TRUNK/ws/trunk/target/nativelib,> LD_LIBRARY_PATH=/home/jenkins/tools/java/jdk1.6.0_27-32/jre/lib/i386/server:/home/jenkins/tools/java/jdk1.6.0_27-32/jre/lib/i386:/home/jenkins/tools/java/jdk1.6.0_27-32/jre/../lib/i386:/usr/lib/jvm/java-6-openjdk/jre/lib/amd64/server:/usr/lib/jvm/java-6-openjdk/jre/lib/amd64:/usr/lib/jvm/java-6-openjdk/jre/../lib/amd64:<https://builds.apache.org/job/HBase-TRUNK/ws/trunk/target/nativelib,> MALLOC_ARENA_MAX=4}
[DEBUG] (s) excludes = [**/Test*.java, **/*$*, null]
[DEBUG] (s) forkMode = always
[DEBUG] (s) includes = [**/IntegrationTest*.java]
[DEBUG] (s) junitArtifactName = junit:junit
[DEBUG] (s) localRepository = id: local
url: file:///home/jenkins/.m2/repository/
layout: none
[DEBUG] (f) parallelMavenExecution = false
[DEBUG] (s) perCoreThreadCount = true
[DEBUG] (s) pluginArtifactMap = {org.apache.maven.plugins:maven-failsafe-plugin=org.apache.maven.plugins:maven-failsafe-plugin:maven-plugin:2.12-TRUNK-HBASE-2:, org.apache.maven.surefire:surefire-junit47=org.apache.maven.surefire:surefire-junit47:jar:2.12-TRUNK-HBASE-2:runtime, org.apache.maven.surefire:common-junit48=org.apache.maven.surefire:common-junit48:jar:2.12-TRUNK-HBASE-2:runtime, org.apache.maven.surefire:common-junit4=org.apache.maven.surefire:common-junit4:jar:2.12-TRUNK-HBASE-2:runtime, org.apache.maven.surefire:common-junit3=org.apache.maven.surefire:common-junit3:jar:2.12-TRUNK-HBASE-2:runtime, org.apache.maven.surefire:surefire-api=org.apache.maven.surefire:surefire-api:jar:2.12-TRUNK-HBASE-2:compile, org.apache.maven.surefire:surefire-booter=org.apache.maven.surefire:surefire-booter:jar:2.12-TRUNK-HBASE-2:compile, org.apache.maven.surefire:maven-surefire-common=org.apache.maven.surefire:maven-surefire-common:jar:2.12-TRUNK-HBASE-2:compile, org.apache.maven.shared:maven-common-artifact-filters=org.apache.maven.shared:maven-common-artifact-filters:jar:1.3:compile, org.codehaus.plexus:plexus-utils=org.codehaus.plexus:plexus-utils:jar:2.1:compile, org.apache.maven.reporting:maven-reporting-api=org.apache.maven.reporting:maven-reporting-api:jar:2.0.9:compile}
[DEBUG] (s) printSummary = true
[DEBUG] (s) project = MavenProject: org.apache.hbase:hbase:0.95-SNAPSHOT @ <https://builds.apache.org/job/HBase-TRUNK/ws/trunk/pom.xml>
[DEBUG] (s) projectArtifactMap = {com.google.guava:guava=com.google.guava:guava:jar:r09:compile, commons-cli:commons-cli=commons-cli:commons-cli:jar:1.2:compile, commons-configuration:commons-configuration=commons-configuration:commons-configuration:jar:1.6:compile, commons-collections:commons-collections=commons-collections:commons-collections:jar:3.2.1:compile, commons-digester:commons-digester=commons-digester:commons-digester:jar:1.8:compile, commons-beanutils:commons-beanutils=commons-beanutils:commons-beanutils:jar:1.7.0:compile, commons-beanutils:commons-beanutils-core=commons-beanutils:commons-beanutils-core:jar:1.8.0:compile, com.github.stephenc.high-scale-lib:high-scale-lib=com.github.stephenc.high-scale-lib:high-scale-lib:jar:1.1.1:compile, commons-codec:commons-codec=commons-codec:commons-codec:jar:1.4:compile, commons-httpclient:commons-httpclient=commons-httpclient:commons-httpclient:jar:3.1:compile, commons-io:commons-io=commons-io:commons-io:jar:2.1:compile, commons-lang:commons-lang=commons-lang:commons-lang:jar:2.5:compile, commons-logging:commons-logging=commons-logging:commons-logging:jar:1.1.1:compile, log4j:log4j=log4j:log4j:jar:1.2.16:compile, org.apache.avro:avro=org.apache.avro:avro:jar:1.5.3:compile, org.xerial.snappy:snappy-java=org.xerial.snappy:snappy-java:jar:1.0.3.2:compile, org.apache.avro:avro-ipc=org.apache.avro:avro-ipc:jar:1.5.3:compile, org.jboss.netty:netty=org.jboss.netty:netty:jar:3.2.4.Final:compile, org.apache.velocity:velocity=org.apache.velocity:velocity:jar:1.7:compile, org.apache.zookeeper:zookeeper=org.apache.zookeeper:zookeeper:jar:3.4.3:compile, org.apache.thrift:libthrift=org.apache.thrift:libthrift:jar:0.8.0:compile, org.apache.httpcomponents:httpclient=org.apache.httpcomponents:httpclient:jar:4.1.2:compile, org.apache.httpcomponents:httpcore=org.apache.httpcomponents:httpcore:jar:4.1.3:compile, org.jruby:jruby-complete=org.jruby:jruby-complete:jar:1.6.5:compile, org.mortbay.jetty:jetty=org.mortbay.jetty:jetty:jar:6.1.26:compile, org.mortbay.jetty:jetty-util=org.mortbay.jetty:jetty-util:jar:6.1.26:compile, org.mortbay.jetty:jsp-2.1=org.mortbay.jetty:jsp-2.1:jar:6.1.14:compile, org.eclipse.jdt:core=org.eclipse.jdt:core:jar:3.1.1:compile, org.mortbay.jetty:jsp-api-2.1=org.mortbay.jetty:jsp-api-2.1:jar:6.1.14:compile, org.mortbay.jetty:servlet-api-2.5=org.mortbay.jetty:servlet-api-2.5:jar:6.1.14:compile, org.codehaus.jackson:jackson-core-asl=org.codehaus.jackson:jackson-core-asl:jar:1.5.5:compile, org.codehaus.jackson:jackson-mapper-asl=org.codehaus.jackson:jackson-mapper-asl:jar:1.5.5:compile, org.codehaus.jackson:jackson-jaxrs=org.codehaus.jackson:jackson-jaxrs:jar:1.5.5:compile, org.codehaus.jackson:jackson-xc=org.codehaus.jackson:jackson-xc:jar:1.5.5:compile, org.slf4j:slf4j-api=org.slf4j:slf4j-api:jar:1.5.8:compile, org.slf4j:slf4j-log4j12=org.slf4j:slf4j-log4j12:jar:1.5.8:compile, tomcat:jasper-compiler=tomcat:jasper-compiler:jar:5.5.23:runtime, tomcat:jasper-runtime=tomcat:jasper-runtime:jar:5.5.23:runtime, commons-el:commons-el=commons-el:commons-el:jar:1.0:compile, org.jamon:jamon-runtime=org.jamon:jamon-runtime:jar:2.3.1:compile, com.google.protobuf:protobuf-java=com.google.protobuf:protobuf-java:jar:2.4.0a:compile, com.sun.jersey:jersey-core=com.sun.jersey:jersey-core:jar:1.4:compile, com.sun.jersey:jersey-json=com.sun.jersey:jersey-json:jar:1.4:compile, org.codehaus.jettison:jettison=org.codehaus.jettison:jettison:jar:1.1:compile, com.sun.xml.bind:jaxb-impl=com.sun.xml.bind:jaxb-impl:jar:2.1.12:compile, com.sun.jersey:jersey-server=com.sun.jersey:jersey-server:jar:1.4:compile, asm:asm=asm:asm:jar:3.1:compile, javax.xml.bind:jaxb-api=javax.xml.bind:jaxb-api:jar:2.1:compile, javax.activation:activation=javax.activation:activation:jar:1.1:compile, stax:stax-api=stax:stax-api:jar:1.0.1:compile, junit:junit=junit:junit:jar:4.10-HBASE-1:test, org.mockito:mockito-all=org.mockito:mockito-all:jar:1.8.5:test, org.apache.commons:commons-math=org.apache.commons:commons-math:jar:2.1:test, org.apache.hadoop:hadoop-core=org.apache.hadoop:hadoop-core:jar:1.0.0:compile, xmlenc:xmlenc=xmlenc:xmlenc:jar:0.52:compile, commons-net:commons-net=commons-net:commons-net:jar:1.4.1:compile, org.apache.hadoop:hadoop-test=org.apache.hadoop:hadoop-test:jar:1.0.0:test, org.apache.ftpserver:ftplet-api=org.apache.ftpserver:ftplet-api:jar:1.0.0:test, org.apache.mina:mina-core=org.apache.mina:mina-core:jar:2.0.0-M5:test, org.apache.ftpserver:ftpserver-core=org.apache.ftpserver:ftpserver-core:jar:1.0.0:test, org.apache.ftpserver:ftpserver-deprecated=org.apache.ftpserver:ftpserver-deprecated:jar:1.0.0-M2:test}
[DEBUG] (s) redirectTestOutputToFile = true
[DEBUG] (s) remoteRepositories = [ id: ghelmling.testing
url: http://people.apache.org/~garyh/mvn/
layout: default
snapshots: [enabled => true, update => daily]
releases: [enabled => true, update => daily]
, id: central
url: http://repo1.maven.org/maven2
layout: default
snapshots: [enabled => false, update => daily]
releases: [enabled => true, update => never]
]
[DEBUG] (s) reportFormat = brief
[DEBUG] (s) reportsDirectory = <https://builds.apache.org/job/HBase-TRUNK/ws/trunk/target/failsafe-reports>
[DEBUG] (s) runOrder = filesystem
[DEBUG] (s) session = org.apache.maven.execution.MavenSession@139425c
[DEBUG] (s) skip = false
[DEBUG] (s) skipTests = false
[DEBUG] (s) summaryFile = <https://builds.apache.org/job/HBase-TRUNK/ws/trunk/target/failsafe-reports/failsafe-summary.xml>
[DEBUG] (s) testClassesDirectory = <https://builds.apache.org/job/HBase-TRUNK/ws/trunk/target/test-classes>
[DEBUG] (s) testNGArtifactName = org.testng:testng
[DEBUG] (s) testSourceDirectory = <https://builds.apache.org/job/HBase-TRUNK/ws/trunk/src/test/java>
[DEBUG] (s) trimStackTrace = true
[DEBUG] (s) useFile = true
[DEBUG] (s) useManifestOnlyJar = true
[DEBUG] (s) useSystemClassLoader = true
[DEBUG] (s) useUnlimitedThreads = false
[DEBUG] (s) workingDirectory = <https://builds.apache.org/job/HBase-TRUNK/ws/trunk>
[DEBUG] -- end configuration --
[INFO] Failsafe report directory: <https://builds.apache.org/job/HBase-TRUNK/ws/trunk/target/failsafe-reports>
[INFO] Using configured provider org.apache.maven.surefire.junitcore.JUnitCoreProvider
[DEBUG] dummy:dummy:jar:1.0 (selected for null)
[DEBUG] org.apache.maven.surefire:surefire-booter:jar:2.12-TRUNK-HBASE-2:compile (selected for compile)
[DEBUG] org.apache.maven.surefire:surefire-api:jar:2.12-TRUNK-HBASE-2:compile (selected for compile)
[DEBUG] Adding to failsafe booter test classpath: /home/jenkins/.m2/repository/org/apache/maven/surefire/surefire-booter/2.12-TRUNK-HBASE-2/surefire-booter-2.12-TRUNK-HBASE-2.jar Scope: compile
[DEBUG] Adding to failsafe booter test classpath: /home/jenkins/.m2/repository/org/apache/maven/surefire/surefire-api/2.12-TRUNK-HBASE-2/surefire-api-2.12-TRUNK-HBASE-2.jar Scope: compile
[DEBUG] Setting system property [user.dir]=[<https://builds.apache.org/job/HBase-TRUNK/ws/trunk]>
[DEBUG] Setting system property [localRepository]=[/home/jenkins/.m2/repository]
[DEBUG] Setting system property [basedir]=[<https://builds.apache.org/job/HBase-TRUNK/ws/trunk]>
[DEBUG] Setting system property [maven.test.redirectTestOutputToFile]=[true]
[DEBUG] Using JVM: /home/jenkins/tools/java/jdk1.6.0_27-32/jre/bin/java
[DEBUG] Setting environment variable [DYLD_LIBRARY_PATH]=[${env.DYLD_LIBRARY_PATH}:<https://builds.apache.org/job/HBase-TRUNK/ws/trunk/target/nativelib]>
[DEBUG] Setting environment variable [LD_LIBRARY_PATH]=[/home/jenkins/tools/java/jdk1.6.0_27-32/jre/lib/i386/server:/home/jenkins/tools/java/jdk1.6.0_27-32/jre/lib/i386:/home/jenkins/tools/java/jdk1.6.0_27-32/jre/../lib/i386:/usr/lib/jvm/java-6-openjdk/jre/lib/amd64/server:/usr/lib/jvm/java-6-openjdk/jre/lib/amd64:/usr/lib/jvm/java-6-openjdk/jre/../lib/amd64:<https://builds.apache.org/job/HBase-TRUNK/ws/trunk/target/nativelib]>
[DEBUG] Setting environment variable [MALLOC_ARENA_MAX]=[4]
[DEBUG] dummy:dummy:jar:1.0 (selected for null)
[DEBUG] org.apache.maven.surefire:surefire-junit47:jar:2.12-TRUNK-HBASE-2:test (selected for test)
[DEBUG] org.apache.maven.surefire:common-junit48:jar:2.12-TRUNK-HBASE-2:test (selected for test)
[DEBUG] org.apache.maven.surefire:common-junit4:jar:2.12-TRUNK-HBASE-2:test (selected for test)
[DEBUG] org.apache.maven.surefire:common-junit3:jar:2.12-TRUNK-HBASE-2:test (selected for test)
[DEBUG] org.apache.maven.surefire:surefire-api:jar:2.12-TRUNK-HBASE-2:test (selected for test)
[DEBUG] org.apache.maven.surefire:surefire-api:jar:2.12-TRUNK-HBASE-2:test (selected for test)
[DEBUG] org.apache.maven.surefire:surefire-api:jar:2.12-TRUNK-HBASE-2:test (selected for test)
[DEBUG] org.apache.maven.surefire:surefire-api:jar:2.12-TRUNK-HBASE-2:test (selected for test)
[DEBUG] Adding to failsafe test classpath: /home/jenkins/.m2/repository/org/apache/maven/surefire/surefire-junit47/2.12-TRUNK-HBASE-2/surefire-junit47-2.12-TRUNK-HBASE-2.jar Scope: test
[DEBUG] Adding to failsafe test classpath: /home/jenkins/.m2/repository/org/apache/maven/surefire/common-junit48/2.12-TRUNK-HBASE-2/common-junit48-2.12-TRUNK-HBASE-2.jar Scope: test
[DEBUG] Adding to failsafe test classpath: /home/jenkins/.m2/repository/org/apache/maven/surefire/common-junit4/2.12-TRUNK-HBASE-2/common-junit4-2.12-TRUNK-HBASE-2.jar Scope: test
[DEBUG] Adding to failsafe test classpath: /home/jenkins/.m2/repository/org/apache/maven/surefire/common-junit3/2.12-TRUNK-HBASE-2/common-junit3-2.12-TRUNK-HBASE-2.jar Scope: test
[DEBUG] Adding to failsafe test classpath: /home/jenkins/.m2/repository/org/apache/maven/surefire/surefire-api/2.12-TRUNK-HBASE-2/surefire-api-2.12-TRUNK-HBASE-2.jar Scope: test
[DEBUG] test classpath classpath:
[DEBUG] <https://builds.apache.org/job/HBase-TRUNK/ws/trunk/target/test-classes>
[DEBUG] <https://builds.apache.org/job/HBase-TRUNK/ws/trunk/target/classes>
[DEBUG] /home/jenkins/.m2/repository/com/google/guava/guava/r09/guava-r09.jar
[DEBUG] /home/jenkins/.m2/repository/commons-cli/commons-cli/1.2/commons-cli-1.2.jar
[DEBUG] /home/jenkins/.m2/repository/commons-configuration/commons-configuration/1.6/commons-configuration-1.6.jar
[DEBUG] /home/jenkins/.m2/repository/commons-collections/commons-collections/3.2.1/commons-collections-3.2.1.jar
[DEBUG] /home/jenkins/.m2/repository/commons-digester/commons-digester/1.8/commons-digester-1.8.jar
[DEBUG] /home/jenkins/.m2/repository/commons-beanutils/commons-beanutils/1.7.0/commons-beanutils-1.7.0.jar
[DEBUG] /home/jenkins/.m2/repository/commons-beanutils/commons-beanutils-core/1.8.0/commons-beanutils-core-1.8.0.jar
[DEBUG] /home/jenkins/.m2/repository/com/github/stephenc/high-scale-lib/high-scale-lib/1.1.1/high-scale-lib-1.1.1.jar
[DEBUG] /home/jenkins/.m2/repository/commons-codec/commons-codec/1.4/commons-codec-1.4.jar
[DEBUG] /home/jenkins/.m2/repository/commons-httpclient/commons-httpclient/3.1/commons-httpclient-3.1.jar
[DEBUG] /home/jenkins/.m2/repository/commons-io/commons-io/2.1/commons-io-2.1.jar
[DEBUG] /home/jenkins/.m2/repository/commons-lang/commons-lang/2.5/commons-lang-2.5.jar
[DEBUG] /home/jenkins/.m2/repository/commons-logging/commons-logging/1.1.1/commons-logging-1.1.1.jar
[DEBUG] /home/jenkins/.m2/repository/log4j/log4j/1.2.16/log4j-1.2.16.jar
[DEBUG] /home/jenkins/.m2/repository/org/apache/avro/avro/1.5.3/avro-1.5.3.jar
[DEBUG] /home/jenkins/.m2/repository/org/xerial/snappy/snappy-java/1.0.3.2/snappy-java-1.0.3.2.jar
[DEBUG] /home/jenkins/.m2/repository/org/apache/avro/avro-ipc/1.5.3/avro-ipc-1.5.3.jar
[DEBUG] /home/jenkins/.m2/repository/org/jboss/netty/netty/3.2.4.Final/netty-3.2.4.Final.jar
[DEBUG] /home/jenkins/.m2/repository/org/apache/velocity/velocity/1.7/velocity-1.7.jar
[DEBUG] /home/jenkins/.m2/repository/org/apache/zookeeper/zookeeper/3.4.3/zookeeper-3.4.3.jar
[DEBUG] /home/jenkins/.m2/repository/org/apache/thrift/libthrift/0.8.0/libthrift-0.8.0.jar
[DEBUG] /home/jenkins/.m2/repository/org/apache/httpcomponents/httpclient/4.1.2/httpclient-4.1.2.jar
[DEBUG] /home/jenkins/.m2/repository/org/apache/httpcomponents/httpcore/4.1.3/httpcore-4.1.3.jar
[DEBUG] /home/jenkins/.m2/repository/org/jruby/jruby-complete/1.6.5/jruby-complete-1.6.5.jar
[DEBUG] /home/jenkins/.m2/repository/org/mortbay/jetty/jetty/6.1.26/jetty-6.1.26.jar
[DEBUG] /home/jenkins/.m2/repository/org/mortbay/jetty/jetty-util/6.1.26/jetty-util-6.1.26.jar
[DEBUG] /home/jenkins/.m2/repository/org/mortbay/jetty/jsp-2.1/6.1.14/jsp-2.1-6.1.14.jar
[DEBUG] /home/jenkins/.m2/repository/org/eclipse/jdt/core/3.1.1/core-3.1.1.jar
[DEBUG] /home/jenkins/.m2/repository/org/mortbay/jetty/jsp-api-2.1/6.1.14/jsp-api-2.1-6.1.14.jar
[DEBUG] /home/jenkins/.m2/repository/org/mortbay/jetty/servlet-api-2.5/6.1.14/servlet-api-2.5-6.1.14.jar
[DEBUG] /home/jenkins/.m2/repository/org/codehaus/jackson/jackson-core-asl/1.5.5/jackson-core-asl-1.5.5.jar
[DEBUG] /home/jenkins/.m2/repository/org/codehaus/jackson/jackson-mapper-asl/1.5.5/jackson-mapper-asl-1.5.5.jar
[DEBUG] /home/jenkins/.m2/repository/org/codehaus/jackson/jackson-jaxrs/1.5.5/jackson-jaxrs-1.5.5.jar
[DEBUG] /home/jenkins/.m2/repository/org/codehaus/jackson/jackson-xc/1.5.5/jackson-xc-1.5.5.jar
[DEBUG] /home/jenkins/.m2/repository/org/slf4j/slf4j-api/1.5.8/slf4j-api-1.5.8.jar
[DEBUG] /home/jenkins/.m2/repository/org/slf4j/slf4j-log4j12/1.5.8/slf4j-log4j12-1.5.8.jar
[DEBUG] /home/jenkins/.m2/repository/tomcat/jasper-compiler/5.5.23/jasper-compiler-5.5.23.jar
[DEBUG] /home/jenkins/.m2/repository/tomcat/jasper-runtime/5.5.23/jasper-runtime-5.5.23.jar
[DEBUG] /home/jenkins/.m2/repository/commons-el/commons-el/1.0/commons-el-1.0.jar
[DEBUG] /home/jenkins/.m2/repository/org/jamon/jamon-runtime/2.3.1/jamon-runtime-2.3.1.jar
[DEBUG] /home/jenkins/.m2/repository/com/google/protobuf/protobuf-java/2.4.0a/protobuf-java-2.4.0a.jar
[DEBUG] /home/jenkins/.m2/repository/com/sun/jersey/jersey-core/1.4/jersey-core-1.4.jar
[DEBUG] /home/jenkins/.m2/repository/com/sun/jersey/jersey-json/1.4/jersey-json-1.4.jar
[DEBUG] /home/jenkins/.m2/repository/org/codehaus/jettison/jettison/1.1/jettison-1.1.jar
[DEBUG] /home/jenkins/.m2/repository/com/sun/xml/bind/jaxb-impl/2.1.12/jaxb-impl-2.1.12.jar
[DEBUG] /home/jenkins/.m2/repository/com/sun/jersey/jersey-server/1.4/jersey-server-1.4.jar
[DEBUG] /home/jenkins/.m2/repository/asm/asm/3.1/asm-3.1.jar
[DEBUG] /home/jenkins/.m2/repository/javax/xml/bind/jaxb-api/2.1/jaxb-api-2.1.jar
[DEBUG] /home/jenkins/.m2/repository/javax/activation/activation/1.1/activation-1.1.jar
[DEBUG] /home/jenkins/.m2/repository/stax/stax-api/1.0.1/stax-api-1.0.1.jar
[DEBUG] /home/jenkins/.m2/repository/junit/junit/4.10-HBASE-1/junit-4.10-HBASE-1.jar
[DEBUG] /home/jenkins/.m2/repository/org/mockito/mockito-all/1.8.5/mockito-all-1.8.5.jar
[DEBUG] /home/jenkins/.m2/repository/org/apache/commons/commons-math/2.1/commons-math-2.1.jar
[DEBUG] /home/jenkins/.m2/repository/org/apache/hadoop/hadoop-core/1.0.0/hadoop-core-1.0.0.jar
[DEBUG] /home/jenkins/.m2/repository/xmlenc/xmlenc/0.52/xmlenc-0.52.jar
[DEBUG] /home/jenkins/.m2/repository/commons-net/commons-net/1.4.1/commons-net-1.4.1.jar
[DEBUG] /home/jenkins/.m2/repository/org/apache/hadoop/hadoop-test/1.0.0/hadoop-test-1.0.0.jar
[DEBUG] /home/jenkins/.m2/repository/org/apache/ftpserver/ftplet-api/1.0.0/ftplet-api-1.0.0.jar
[DEBUG] /home/jenkins/.m2/repository/org/apache/mina/mina-core/2.0.0-M5/mina-core-2.0.0-M5.jar
[DEBUG] /home/jenkins/.m2/repository/org/apache/ftpserver/ftpserver-core/1.0.0/ftpserver-core-1.0.0.jar
[DEBUG] /home/jenkins/.m2/repository/org/apache/ftpserver/ftpserver-deprecated/1.0.0-M2/ftpserver-deprecated-1.0.0-M2.jar
[DEBUG] provider classpath classpath:
[DEBUG] /home/jenkins/.m2/repository/org/apache/maven/surefire/surefire-junit47/2.12-TRUNK-HBASE-2/surefire-junit47-2.12-TRUNK-HBASE-2.jar
[DEBUG] /home/jenkins/.m2/repository/org/apache/maven/surefire/common-junit48/2.12-TRUNK-HBASE-2/common-junit48-2.12-TRUNK-HBASE-2.jar
[DEBUG] /home/jenkins/.m2/repository/org/apache/maven/surefire/common-junit4/2.12-TRUNK-HBASE-2/common-junit4-2.12-TRUNK-HBASE-2.jar
[DEBUG] /home/jenkins/.m2/repository/org/apache/maven/surefire/common-junit3/2.12-TRUNK-HBASE-2/common-junit3-2.12-TRUNK-HBASE-2.jar
[DEBUG] /home/jenkins/.m2/repository/org/apache/maven/surefire/surefire-api/2.12-TRUNK-HBASE-2/surefire-api-2.12-TRUNK-HBASE-2.jar
-------------------------------------------------------
T E S T S
-------------------------------------------------------
-------------------------------------------------------
T E S T S
-------------------------------------------------------
Results :
Tests run: 0, Failures: 0, Errors: 0, Skipped: 0
[INFO] ------------------------------------------------------------------------
[INFO] BUILD FAILURE
[INFO] ------------------------------------------------------------------------
[INFO] Total time: 27:21.739s
[INFO] Finished at: Wed Apr 04 22:34:11 UTC 2012
[INFO] Final Memory: 47M/1167M
[INFO] ------------------------------------------------------------------------
[ERROR] Failed to execute goal org.apache.maven.plugins:maven-failsafe-plugin:2.12-TRUNK-HBASE-2:integration-test (integration-test) on project hbase: Execution integration-test of goal org.apache.maven.plugins:maven-failsafe-plugin:2.12-TRUNK-HBASE-2:integration-test failed: java.lang.reflect.InvocationTargetException; nested exception is java.lang.reflect.InvocationTargetException: null: NullPointerException -> [Help 1]
org.apache.maven.lifecycle.LifecycleExecutionException: Failed to execute goal org.apache.maven.plugins:maven-failsafe-plugin:2.12-TRUNK-HBASE-2:integration-test (integration-test) on project hbase: Execution integration-test of goal org.apache.maven.plugins:maven-failsafe-plugin:2.12-TRUNK-HBASE-2:integration-test failed: java.lang.reflect.InvocationTargetException; nested exception is java.lang.reflect.InvocationTargetException: null
at org.apache.maven.lifecycle.internal.MojoExecutor.execute(MojoExecutor.java:225)
at org.apache.maven.lifecycle.internal.MojoExecutor.execute(MojoExecutor.java:153)
at org.apache.maven.lifecycle.internal.MojoExecutor.execute(MojoExecutor.java:145)
at org.apache.maven.lifecycle.internal.LifecycleModuleBuilder.buildProject(LifecycleModuleBuilder.java:84)
at org.apache.maven.lifecycle.internal.LifecycleModuleBuilder.buildProject(LifecycleModuleBuilder.java:59)
at org.apache.maven.lifecycle.internal.LifecycleStarter.singleThreadedBuild(LifecycleStarter.java:183)
at org.apache.maven.lifecycle.internal.LifecycleStarter.execute(LifecycleStarter.java:161)
at org.apache.maven.DefaultMaven.doExecute(DefaultMaven.java:319)
at org.apache.maven.DefaultMaven.execute(DefaultMaven.java:156)
at org.apache.maven.cli.MavenCli.execute(MavenCli.java:537)
at org.apache.maven.cli.MavenCli.doMain(MavenCli.java:196)
at org.apache.maven.cli.MavenCli.main(MavenCli.java:141)
at sun.reflect.NativeMethodAccessorImpl.invoke0(Native Method)
at sun.reflect.NativeMethodAccessorImpl.invoke(NativeMethodAccessorImpl.java:39)
at sun.reflect.DelegatingMethodAccessorImpl.invoke(DelegatingMethodAccessorImpl.java:25)
at java.lang.reflect.Method.invoke(Method.java:597)
at org.codehaus.plexus.classworlds.launcher.Launcher.launchEnhanced(Launcher.java:290)
at org.codehaus.plexus.classworlds.launcher.Launcher.launch(Launcher.java:230)
at org.codehaus.plexus.classworlds.launcher.Launcher.mainWithExitCode(Launcher.java:409)
at org.codehaus.plexus.classworlds.launcher.Launcher.main(Launcher.java:352)
Caused by: org.apache.maven.plugin.PluginExecutionException: Execution integration-test of goal org.apache.maven.plugins:maven-failsafe-plugin:2.12-TRUNK-HBASE-2:integration-test failed: java.lang.reflect.InvocationTargetException; nested exception is java.lang.reflect.InvocationTargetException: null
at org.apache.maven.plugin.DefaultBuildPluginManager.executeMojo(DefaultBuildPluginManager.java:110)
at org.apache.maven.lifecycle.internal.MojoExecutor.execute(MojoExecutor.java:209)
... 19 more
Caused by: org.apache.maven.surefire.util.SurefireReflectionException: java.lang.reflect.InvocationTargetException; nested exception is java.lang.reflect.InvocationTargetException: null
at org.apache.maven.surefire.util.ReflectionUtils.invokeMethodWithArray(ReflectionUtils.java:196)
at org.apache.maven.surefire.util.ReflectionUtils.invokeGetter(ReflectionUtils.java:69)
at org.apache.maven.surefire.booter.ProviderFactory$ProviderProxy.getSuites(ProviderFactory.java:149)
at org.apache.maven.plugin.surefire.booterclient.ForkStarter.getSuitesIterator(ForkStarter.java:277)
at org.apache.maven.plugin.surefire.booterclient.ForkStarter.runSuitesForkPerTestSet(ForkStarter.java:133)
at org.apache.maven.plugin.surefire.booterclient.ForkStarter.run(ForkStarter.java:104)
at org.apache.maven.plugin.surefire.AbstractSurefireMojo.executeProvider(AbstractSurefireMojo.java:200)
at org.apache.maven.plugin.surefire.AbstractSurefireMojo.executeAllProviders(AbstractSurefireMojo.java:177)
at org.apache.maven.plugin.surefire.AbstractSurefireMojo.executeAfterPreconditionsChecked(AbstractSurefireMojo.java:135)
at org.apache.maven.plugin.surefire.AbstractSurefireMojo.execute(AbstractSurefireMojo.java:98)
at org.apache.maven.plugin.DefaultBuildPluginManager.executeMojo(DefaultBuildPluginManager.java:101)
... 20 more
Caused by: java.lang.reflect.InvocationTargetException
at sun.reflect.NativeMethodAccessorImpl.invoke0(Native Method)
at sun.reflect.NativeMethodAccessorImpl.invoke(NativeMethodAccessorImpl.java:39)
at sun.reflect.DelegatingMethodAccessorImpl.invoke(DelegatingMethodAccessorImpl.java:25)
at java.lang.reflect.Method.invoke(Method.java:597)
at org.apache.maven.surefire.util.ReflectionUtils.invokeMethodWithArray(ReflectionUtils.java:188)
... 30 more
Caused by: java.lang.NullPointerException
at org.apache.maven.surefire.util.DefaultDirectoryScanner.processIncludesExcludes(DefaultDirectoryScanner.java:136)
at org.apache.maven.surefire.util.DefaultDirectoryScanner.collectTests(DefaultDirectoryScanner.java:113)
at org.apache.maven.surefire.util.DefaultDirectoryScanner.locateTestClasses(DefaultDirectoryScanner.java:62)
at org.apache.maven.surefire.junitcore.JUnitCoreProvider.scanClassPath(JUnitCoreProvider.java:188)
at org.apache.maven.surefire.junitcore.JUnitCoreProvider.getSuitesAsList(JUnitCoreProvider.java:145)
at org.apache.maven.surefire.junitcore.JUnitCoreProvider.getSuites(JUnitCoreProvider.java:103)
... 35 more
[ERROR]
[ERROR]
[ERROR] For more information about the errors and possible solutions, please read the following articles:
[ERROR] [Help 1] http://cwiki.apache.org/confluence/display/MAVEN/PluginExecutionException
Build step 'Invoke top-level Maven targets' marked build as failure
Archiving artifacts
Updating HBASE-5359
Recording test results
Build failed in Jenkins: HBase-TRUNK #2709
Posted by Apache Jenkins Server <je...@builds.apache.org>.
See <https://builds.apache.org/job/HBase-TRUNK/2709/changes>
Changes:
[stack] HBASE-5706 'Dropping fs latency stats since buffer is full' spam
------------------------------------------
[...truncated 13104 lines...]
[DEBUG] Excluded: org.apache.maven:maven-artifact:jar:2.0.9
[DEBUG] Excluded: org.apache.maven:maven-project:jar:2.0.9
[DEBUG] Excluded: org.apache.maven:maven-settings:jar:2.0.9
[DEBUG] Excluded: org.apache.maven:maven-profile:jar:2.0.9
[DEBUG] Excluded: org.apache.maven:maven-model:jar:2.0.9
[DEBUG] Excluded: org.apache.maven:maven-artifact-manager:jar:2.0.9
[DEBUG] Excluded: org.apache.maven:maven-plugin-registry:jar:2.0.9
[DEBUG] Excluded: org.codehaus.plexus:plexus-container-default:jar:1.0-alpha-9-stable-1
[DEBUG] Excluded: junit:junit:jar:3.8.1
[DEBUG] Excluded: org.apache.maven:maven-core:jar:2.0.9
[DEBUG] Excluded: org.apache.maven:maven-plugin-parameter-documenter:jar:2.0.9
[DEBUG] Excluded: org.apache.maven:maven-repository-metadata:jar:2.0.9
[DEBUG] Excluded: org.apache.maven:maven-error-diagnostics:jar:2.0.9
[DEBUG] Excluded: org.apache.maven:maven-plugin-descriptor:jar:2.0.9
[DEBUG] Excluded: org.apache.maven:maven-monitor:jar:2.0.9
[DEBUG] Excluded: classworlds:classworlds:jar:1.1
[DEBUG] Excluded: org.apache.maven:maven-toolchain:jar:2.0.9
[DEBUG] Configuring mojo org.apache.maven.plugins:maven-failsafe-plugin:2.12-TRUNK-HBASE-2:integration-test from plugin realm ClassRealm[plugin>org.apache.maven.plugins:maven-failsafe-plugin:2.12-TRUNK-HBASE-2, parent: sun.misc.Launcher$AppClassLoader@192d342]
[DEBUG] Configuring mojo 'org.apache.maven.plugins:maven-failsafe-plugin:2.12-TRUNK-HBASE-2:integration-test' with basic configurator -->
[DEBUG] (s) basedir = <https://builds.apache.org/job/HBase-TRUNK/ws/trunk>
[DEBUG] (s) childDelegation = false
[DEBUG] (s) classesDirectory = <https://builds.apache.org/job/HBase-TRUNK/ws/trunk/target/classes>
[DEBUG] (s) disableXmlReport = false
[DEBUG] (s) enableAssertions = true
[DEBUG] (s) environmentVariables = {DYLD_LIBRARY_PATH=${env.DYLD_LIBRARY_PATH}:<https://builds.apache.org/job/HBase-TRUNK/ws/trunk/target/nativelib,> LD_LIBRARY_PATH=/home/jenkins/tools/java/jdk1.6.0_27-32/jre/lib/i386/server:/home/jenkins/tools/java/jdk1.6.0_27-32/jre/lib/i386:/home/jenkins/tools/java/jdk1.6.0_27-32/jre/../lib/i386:/usr/lib/jvm/java-6-openjdk/jre/lib/amd64/server:/usr/lib/jvm/java-6-openjdk/jre/lib/amd64:/usr/lib/jvm/java-6-openjdk/jre/../lib/amd64:<https://builds.apache.org/job/HBase-TRUNK/ws/trunk/target/nativelib,> MALLOC_ARENA_MAX=4}
[DEBUG] (s) excludes = [**/Test*.java, **/*$*, null]
[DEBUG] (s) forkMode = always
[DEBUG] (s) includes = [**/IntegrationTest*.java]
[DEBUG] (s) junitArtifactName = junit:junit
[DEBUG] (s) localRepository = id: local
url: file:///home/jenkins/.m2/repository/
layout: none
[DEBUG] (f) parallelMavenExecution = false
[DEBUG] (s) perCoreThreadCount = true
[DEBUG] (s) pluginArtifactMap = {org.apache.maven.plugins:maven-failsafe-plugin=org.apache.maven.plugins:maven-failsafe-plugin:maven-plugin:2.12-TRUNK-HBASE-2:, org.apache.maven.surefire:surefire-junit47=org.apache.maven.surefire:surefire-junit47:jar:2.12-TRUNK-HBASE-2:runtime, org.apache.maven.surefire:common-junit48=org.apache.maven.surefire:common-junit48:jar:2.12-TRUNK-HBASE-2:runtime, org.apache.maven.surefire:common-junit4=org.apache.maven.surefire:common-junit4:jar:2.12-TRUNK-HBASE-2:runtime, org.apache.maven.surefire:common-junit3=org.apache.maven.surefire:common-junit3:jar:2.12-TRUNK-HBASE-2:runtime, org.apache.maven.surefire:surefire-api=org.apache.maven.surefire:surefire-api:jar:2.12-TRUNK-HBASE-2:compile, org.apache.maven.surefire:surefire-booter=org.apache.maven.surefire:surefire-booter:jar:2.12-TRUNK-HBASE-2:compile, org.apache.maven.surefire:maven-surefire-common=org.apache.maven.surefire:maven-surefire-common:jar:2.12-TRUNK-HBASE-2:compile, org.apache.maven.shared:maven-common-artifact-filters=org.apache.maven.shared:maven-common-artifact-filters:jar:1.3:compile, org.codehaus.plexus:plexus-utils=org.codehaus.plexus:plexus-utils:jar:2.1:compile, org.apache.maven.reporting:maven-reporting-api=org.apache.maven.reporting:maven-reporting-api:jar:2.0.9:compile}
[DEBUG] (s) printSummary = true
[DEBUG] (s) project = MavenProject: org.apache.hbase:hbase:0.95-SNAPSHOT @ <https://builds.apache.org/job/HBase-TRUNK/ws/trunk/pom.xml>
[DEBUG] (s) projectArtifactMap = {com.google.guava:guava=com.google.guava:guava:jar:r09:compile, commons-cli:commons-cli=commons-cli:commons-cli:jar:1.2:compile, commons-configuration:commons-configuration=commons-configuration:commons-configuration:jar:1.6:compile, commons-collections:commons-collections=commons-collections:commons-collections:jar:3.2.1:compile, commons-digester:commons-digester=commons-digester:commons-digester:jar:1.8:compile, commons-beanutils:commons-beanutils=commons-beanutils:commons-beanutils:jar:1.7.0:compile, commons-beanutils:commons-beanutils-core=commons-beanutils:commons-beanutils-core:jar:1.8.0:compile, com.github.stephenc.high-scale-lib:high-scale-lib=com.github.stephenc.high-scale-lib:high-scale-lib:jar:1.1.1:compile, commons-codec:commons-codec=commons-codec:commons-codec:jar:1.4:compile, commons-httpclient:commons-httpclient=commons-httpclient:commons-httpclient:jar:3.1:compile, commons-io:commons-io=commons-io:commons-io:jar:2.1:compile, commons-lang:commons-lang=commons-lang:commons-lang:jar:2.5:compile, commons-logging:commons-logging=commons-logging:commons-logging:jar:1.1.1:compile, log4j:log4j=log4j:log4j:jar:1.2.16:compile, org.apache.avro:avro=org.apache.avro:avro:jar:1.5.3:compile, org.xerial.snappy:snappy-java=org.xerial.snappy:snappy-java:jar:1.0.3.2:compile, org.apache.avro:avro-ipc=org.apache.avro:avro-ipc:jar:1.5.3:compile, org.jboss.netty:netty=org.jboss.netty:netty:jar:3.2.4.Final:compile, org.apache.velocity:velocity=org.apache.velocity:velocity:jar:1.7:compile, org.apache.zookeeper:zookeeper=org.apache.zookeeper:zookeeper:jar:3.4.3:compile, org.apache.thrift:libthrift=org.apache.thrift:libthrift:jar:0.8.0:compile, org.apache.httpcomponents:httpclient=org.apache.httpcomponents:httpclient:jar:4.1.2:compile, org.apache.httpcomponents:httpcore=org.apache.httpcomponents:httpcore:jar:4.1.3:compile, org.jruby:jruby-complete=org.jruby:jruby-complete:jar:1.6.5:compile, org.mortbay.jetty:jetty=org.mortbay.jetty:jetty:jar:6.1.26:compile, org.mortbay.jetty:jetty-util=org.mortbay.jetty:jetty-util:jar:6.1.26:compile, org.mortbay.jetty:jsp-2.1=org.mortbay.jetty:jsp-2.1:jar:6.1.14:compile, org.eclipse.jdt:core=org.eclipse.jdt:core:jar:3.1.1:compile, org.mortbay.jetty:jsp-api-2.1=org.mortbay.jetty:jsp-api-2.1:jar:6.1.14:compile, org.mortbay.jetty:servlet-api-2.5=org.mortbay.jetty:servlet-api-2.5:jar:6.1.14:compile, org.codehaus.jackson:jackson-core-asl=org.codehaus.jackson:jackson-core-asl:jar:1.5.5:compile, org.codehaus.jackson:jackson-mapper-asl=org.codehaus.jackson:jackson-mapper-asl:jar:1.5.5:compile, org.codehaus.jackson:jackson-jaxrs=org.codehaus.jackson:jackson-jaxrs:jar:1.5.5:compile, org.codehaus.jackson:jackson-xc=org.codehaus.jackson:jackson-xc:jar:1.5.5:compile, org.slf4j:slf4j-api=org.slf4j:slf4j-api:jar:1.5.8:compile, org.slf4j:slf4j-log4j12=org.slf4j:slf4j-log4j12:jar:1.5.8:compile, tomcat:jasper-compiler=tomcat:jasper-compiler:jar:5.5.23:runtime, tomcat:jasper-runtime=tomcat:jasper-runtime:jar:5.5.23:runtime, commons-el:commons-el=commons-el:commons-el:jar:1.0:compile, org.jamon:jamon-runtime=org.jamon:jamon-runtime:jar:2.3.1:compile, com.google.protobuf:protobuf-java=com.google.protobuf:protobuf-java:jar:2.4.0a:compile, com.sun.jersey:jersey-core=com.sun.jersey:jersey-core:jar:1.4:compile, com.sun.jersey:jersey-json=com.sun.jersey:jersey-json:jar:1.4:compile, org.codehaus.jettison:jettison=org.codehaus.jettison:jettison:jar:1.1:compile, com.sun.xml.bind:jaxb-impl=com.sun.xml.bind:jaxb-impl:jar:2.1.12:compile, com.sun.jersey:jersey-server=com.sun.jersey:jersey-server:jar:1.4:compile, asm:asm=asm:asm:jar:3.1:compile, javax.xml.bind:jaxb-api=javax.xml.bind:jaxb-api:jar:2.1:compile, javax.activation:activation=javax.activation:activation:jar:1.1:compile, stax:stax-api=stax:stax-api:jar:1.0.1:compile, junit:junit=junit:junit:jar:4.10-HBASE-1:test, org.mockito:mockito-all=org.mockito:mockito-all:jar:1.8.5:test, org.apache.commons:commons-math=org.apache.commons:commons-math:jar:2.1:test, org.apache.hadoop:hadoop-core=org.apache.hadoop:hadoop-core:jar:1.0.0:compile, xmlenc:xmlenc=xmlenc:xmlenc:jar:0.52:compile, commons-net:commons-net=commons-net:commons-net:jar:1.4.1:compile, org.apache.hadoop:hadoop-test=org.apache.hadoop:hadoop-test:jar:1.0.0:test, org.apache.ftpserver:ftplet-api=org.apache.ftpserver:ftplet-api:jar:1.0.0:test, org.apache.mina:mina-core=org.apache.mina:mina-core:jar:2.0.0-M5:test, org.apache.ftpserver:ftpserver-core=org.apache.ftpserver:ftpserver-core:jar:1.0.0:test, org.apache.ftpserver:ftpserver-deprecated=org.apache.ftpserver:ftpserver-deprecated:jar:1.0.0-M2:test}
[DEBUG] (s) redirectTestOutputToFile = true
[DEBUG] (s) remoteRepositories = [ id: ghelmling.testing
url: http://people.apache.org/~garyh/mvn/
layout: default
snapshots: [enabled => true, update => daily]
releases: [enabled => true, update => daily]
, id: central
url: http://repo1.maven.org/maven2
layout: default
snapshots: [enabled => false, update => daily]
releases: [enabled => true, update => never]
]
[DEBUG] (s) reportFormat = brief
[DEBUG] (s) reportsDirectory = <https://builds.apache.org/job/HBase-TRUNK/ws/trunk/target/failsafe-reports>
[DEBUG] (s) runOrder = filesystem
[DEBUG] (s) session = org.apache.maven.execution.MavenSession@3f45a8
[DEBUG] (s) skip = false
[DEBUG] (s) skipTests = false
[DEBUG] (s) summaryFile = <https://builds.apache.org/job/HBase-TRUNK/ws/trunk/target/failsafe-reports/failsafe-summary.xml>
[DEBUG] (s) testClassesDirectory = <https://builds.apache.org/job/HBase-TRUNK/ws/trunk/target/test-classes>
[DEBUG] (s) testNGArtifactName = org.testng:testng
[DEBUG] (s) testSourceDirectory = <https://builds.apache.org/job/HBase-TRUNK/ws/trunk/src/test/java>
[DEBUG] (s) trimStackTrace = true
[DEBUG] (s) useFile = true
[DEBUG] (s) useManifestOnlyJar = true
[DEBUG] (s) useSystemClassLoader = true
[DEBUG] (s) useUnlimitedThreads = false
[DEBUG] (s) workingDirectory = <https://builds.apache.org/job/HBase-TRUNK/ws/trunk>
[DEBUG] -- end configuration --
[INFO] Failsafe report directory: <https://builds.apache.org/job/HBase-TRUNK/ws/trunk/target/failsafe-reports>
[INFO] Using configured provider org.apache.maven.surefire.junitcore.JUnitCoreProvider
[DEBUG] dummy:dummy:jar:1.0 (selected for null)
[DEBUG] org.apache.maven.surefire:surefire-booter:jar:2.12-TRUNK-HBASE-2:compile (selected for compile)
[DEBUG] org.apache.maven.surefire:surefire-api:jar:2.12-TRUNK-HBASE-2:compile (selected for compile)
[DEBUG] Adding to failsafe booter test classpath: /home/jenkins/.m2/repository/org/apache/maven/surefire/surefire-booter/2.12-TRUNK-HBASE-2/surefire-booter-2.12-TRUNK-HBASE-2.jar Scope: compile
[DEBUG] Adding to failsafe booter test classpath: /home/jenkins/.m2/repository/org/apache/maven/surefire/surefire-api/2.12-TRUNK-HBASE-2/surefire-api-2.12-TRUNK-HBASE-2.jar Scope: compile
[DEBUG] Setting system property [user.dir]=[<https://builds.apache.org/job/HBase-TRUNK/ws/trunk]>
[DEBUG] Setting system property [localRepository]=[/home/jenkins/.m2/repository]
[DEBUG] Setting system property [basedir]=[<https://builds.apache.org/job/HBase-TRUNK/ws/trunk]>
[DEBUG] Setting system property [maven.test.redirectTestOutputToFile]=[true]
[DEBUG] Using JVM: /home/jenkins/tools/java/jdk1.6.0_27-32/jre/bin/java
[DEBUG] Setting environment variable [DYLD_LIBRARY_PATH]=[${env.DYLD_LIBRARY_PATH}:<https://builds.apache.org/job/HBase-TRUNK/ws/trunk/target/nativelib]>
[DEBUG] Setting environment variable [LD_LIBRARY_PATH]=[/home/jenkins/tools/java/jdk1.6.0_27-32/jre/lib/i386/server:/home/jenkins/tools/java/jdk1.6.0_27-32/jre/lib/i386:/home/jenkins/tools/java/jdk1.6.0_27-32/jre/../lib/i386:/usr/lib/jvm/java-6-openjdk/jre/lib/amd64/server:/usr/lib/jvm/java-6-openjdk/jre/lib/amd64:/usr/lib/jvm/java-6-openjdk/jre/../lib/amd64:<https://builds.apache.org/job/HBase-TRUNK/ws/trunk/target/nativelib]>
[DEBUG] Setting environment variable [MALLOC_ARENA_MAX]=[4]
[DEBUG] dummy:dummy:jar:1.0 (selected for null)
[DEBUG] org.apache.maven.surefire:surefire-junit47:jar:2.12-TRUNK-HBASE-2:test (selected for test)
[DEBUG] org.apache.maven.surefire:common-junit48:jar:2.12-TRUNK-HBASE-2:test (selected for test)
[DEBUG] org.apache.maven.surefire:common-junit4:jar:2.12-TRUNK-HBASE-2:test (selected for test)
[DEBUG] org.apache.maven.surefire:common-junit3:jar:2.12-TRUNK-HBASE-2:test (selected for test)
[DEBUG] org.apache.maven.surefire:surefire-api:jar:2.12-TRUNK-HBASE-2:test (selected for test)
[DEBUG] org.apache.maven.surefire:surefire-api:jar:2.12-TRUNK-HBASE-2:test (selected for test)
[DEBUG] org.apache.maven.surefire:surefire-api:jar:2.12-TRUNK-HBASE-2:test (selected for test)
[DEBUG] org.apache.maven.surefire:surefire-api:jar:2.12-TRUNK-HBASE-2:test (selected for test)
[DEBUG] Adding to failsafe test classpath: /home/jenkins/.m2/repository/org/apache/maven/surefire/surefire-junit47/2.12-TRUNK-HBASE-2/surefire-junit47-2.12-TRUNK-HBASE-2.jar Scope: test
[DEBUG] Adding to failsafe test classpath: /home/jenkins/.m2/repository/org/apache/maven/surefire/common-junit48/2.12-TRUNK-HBASE-2/common-junit48-2.12-TRUNK-HBASE-2.jar Scope: test
[DEBUG] Adding to failsafe test classpath: /home/jenkins/.m2/repository/org/apache/maven/surefire/common-junit4/2.12-TRUNK-HBASE-2/common-junit4-2.12-TRUNK-HBASE-2.jar Scope: test
[DEBUG] Adding to failsafe test classpath: /home/jenkins/.m2/repository/org/apache/maven/surefire/common-junit3/2.12-TRUNK-HBASE-2/common-junit3-2.12-TRUNK-HBASE-2.jar Scope: test
[DEBUG] Adding to failsafe test classpath: /home/jenkins/.m2/repository/org/apache/maven/surefire/surefire-api/2.12-TRUNK-HBASE-2/surefire-api-2.12-TRUNK-HBASE-2.jar Scope: test
[DEBUG] test classpath classpath:
[DEBUG] <https://builds.apache.org/job/HBase-TRUNK/ws/trunk/target/test-classes>
[DEBUG] <https://builds.apache.org/job/HBase-TRUNK/ws/trunk/target/classes>
[DEBUG] /home/jenkins/.m2/repository/com/google/guava/guava/r09/guava-r09.jar
[DEBUG] /home/jenkins/.m2/repository/commons-cli/commons-cli/1.2/commons-cli-1.2.jar
[DEBUG] /home/jenkins/.m2/repository/commons-configuration/commons-configuration/1.6/commons-configuration-1.6.jar
[DEBUG] /home/jenkins/.m2/repository/commons-collections/commons-collections/3.2.1/commons-collections-3.2.1.jar
[DEBUG] /home/jenkins/.m2/repository/commons-digester/commons-digester/1.8/commons-digester-1.8.jar
[DEBUG] /home/jenkins/.m2/repository/commons-beanutils/commons-beanutils/1.7.0/commons-beanutils-1.7.0.jar
[DEBUG] /home/jenkins/.m2/repository/commons-beanutils/commons-beanutils-core/1.8.0/commons-beanutils-core-1.8.0.jar
[DEBUG] /home/jenkins/.m2/repository/com/github/stephenc/high-scale-lib/high-scale-lib/1.1.1/high-scale-lib-1.1.1.jar
[DEBUG] /home/jenkins/.m2/repository/commons-codec/commons-codec/1.4/commons-codec-1.4.jar
[DEBUG] /home/jenkins/.m2/repository/commons-httpclient/commons-httpclient/3.1/commons-httpclient-3.1.jar
[DEBUG] /home/jenkins/.m2/repository/commons-io/commons-io/2.1/commons-io-2.1.jar
[DEBUG] /home/jenkins/.m2/repository/commons-lang/commons-lang/2.5/commons-lang-2.5.jar
[DEBUG] /home/jenkins/.m2/repository/commons-logging/commons-logging/1.1.1/commons-logging-1.1.1.jar
[DEBUG] /home/jenkins/.m2/repository/log4j/log4j/1.2.16/log4j-1.2.16.jar
[DEBUG] /home/jenkins/.m2/repository/org/apache/avro/avro/1.5.3/avro-1.5.3.jar
[DEBUG] /home/jenkins/.m2/repository/org/xerial/snappy/snappy-java/1.0.3.2/snappy-java-1.0.3.2.jar
[DEBUG] /home/jenkins/.m2/repository/org/apache/avro/avro-ipc/1.5.3/avro-ipc-1.5.3.jar
[DEBUG] /home/jenkins/.m2/repository/org/jboss/netty/netty/3.2.4.Final/netty-3.2.4.Final.jar
[DEBUG] /home/jenkins/.m2/repository/org/apache/velocity/velocity/1.7/velocity-1.7.jar
[DEBUG] /home/jenkins/.m2/repository/org/apache/zookeeper/zookeeper/3.4.3/zookeeper-3.4.3.jar
[DEBUG] /home/jenkins/.m2/repository/org/apache/thrift/libthrift/0.8.0/libthrift-0.8.0.jar
[DEBUG] /home/jenkins/.m2/repository/org/apache/httpcomponents/httpclient/4.1.2/httpclient-4.1.2.jar
[DEBUG] /home/jenkins/.m2/repository/org/apache/httpcomponents/httpcore/4.1.3/httpcore-4.1.3.jar
[DEBUG] /home/jenkins/.m2/repository/org/jruby/jruby-complete/1.6.5/jruby-complete-1.6.5.jar
[DEBUG] /home/jenkins/.m2/repository/org/mortbay/jetty/jetty/6.1.26/jetty-6.1.26.jar
[DEBUG] /home/jenkins/.m2/repository/org/mortbay/jetty/jetty-util/6.1.26/jetty-util-6.1.26.jar
[DEBUG] /home/jenkins/.m2/repository/org/mortbay/jetty/jsp-2.1/6.1.14/jsp-2.1-6.1.14.jar
[DEBUG] /home/jenkins/.m2/repository/org/eclipse/jdt/core/3.1.1/core-3.1.1.jar
[DEBUG] /home/jenkins/.m2/repository/org/mortbay/jetty/jsp-api-2.1/6.1.14/jsp-api-2.1-6.1.14.jar
[DEBUG] /home/jenkins/.m2/repository/org/mortbay/jetty/servlet-api-2.5/6.1.14/servlet-api-2.5-6.1.14.jar
[DEBUG] /home/jenkins/.m2/repository/org/codehaus/jackson/jackson-core-asl/1.5.5/jackson-core-asl-1.5.5.jar
[DEBUG] /home/jenkins/.m2/repository/org/codehaus/jackson/jackson-mapper-asl/1.5.5/jackson-mapper-asl-1.5.5.jar
[DEBUG] /home/jenkins/.m2/repository/org/codehaus/jackson/jackson-jaxrs/1.5.5/jackson-jaxrs-1.5.5.jar
[DEBUG] /home/jenkins/.m2/repository/org/codehaus/jackson/jackson-xc/1.5.5/jackson-xc-1.5.5.jar
[DEBUG] /home/jenkins/.m2/repository/org/slf4j/slf4j-api/1.5.8/slf4j-api-1.5.8.jar
[DEBUG] /home/jenkins/.m2/repository/org/slf4j/slf4j-log4j12/1.5.8/slf4j-log4j12-1.5.8.jar
[DEBUG] /home/jenkins/.m2/repository/tomcat/jasper-compiler/5.5.23/jasper-compiler-5.5.23.jar
[DEBUG] /home/jenkins/.m2/repository/tomcat/jasper-runtime/5.5.23/jasper-runtime-5.5.23.jar
[DEBUG] /home/jenkins/.m2/repository/commons-el/commons-el/1.0/commons-el-1.0.jar
[DEBUG] /home/jenkins/.m2/repository/org/jamon/jamon-runtime/2.3.1/jamon-runtime-2.3.1.jar
[DEBUG] /home/jenkins/.m2/repository/com/google/protobuf/protobuf-java/2.4.0a/protobuf-java-2.4.0a.jar
[DEBUG] /home/jenkins/.m2/repository/com/sun/jersey/jersey-core/1.4/jersey-core-1.4.jar
[DEBUG] /home/jenkins/.m2/repository/com/sun/jersey/jersey-json/1.4/jersey-json-1.4.jar
[DEBUG] /home/jenkins/.m2/repository/org/codehaus/jettison/jettison/1.1/jettison-1.1.jar
[DEBUG] /home/jenkins/.m2/repository/com/sun/xml/bind/jaxb-impl/2.1.12/jaxb-impl-2.1.12.jar
[DEBUG] /home/jenkins/.m2/repository/com/sun/jersey/jersey-server/1.4/jersey-server-1.4.jar
[DEBUG] /home/jenkins/.m2/repository/asm/asm/3.1/asm-3.1.jar
[DEBUG] /home/jenkins/.m2/repository/javax/xml/bind/jaxb-api/2.1/jaxb-api-2.1.jar
[DEBUG] /home/jenkins/.m2/repository/javax/activation/activation/1.1/activation-1.1.jar
[DEBUG] /home/jenkins/.m2/repository/stax/stax-api/1.0.1/stax-api-1.0.1.jar
[DEBUG] /home/jenkins/.m2/repository/junit/junit/4.10-HBASE-1/junit-4.10-HBASE-1.jar
[DEBUG] /home/jenkins/.m2/repository/org/mockito/mockito-all/1.8.5/mockito-all-1.8.5.jar
[DEBUG] /home/jenkins/.m2/repository/org/apache/commons/commons-math/2.1/commons-math-2.1.jar
[DEBUG] /home/jenkins/.m2/repository/org/apache/hadoop/hadoop-core/1.0.0/hadoop-core-1.0.0.jar
[DEBUG] /home/jenkins/.m2/repository/xmlenc/xmlenc/0.52/xmlenc-0.52.jar
[DEBUG] /home/jenkins/.m2/repository/commons-net/commons-net/1.4.1/commons-net-1.4.1.jar
[DEBUG] /home/jenkins/.m2/repository/org/apache/hadoop/hadoop-test/1.0.0/hadoop-test-1.0.0.jar
[DEBUG] /home/jenkins/.m2/repository/org/apache/ftpserver/ftplet-api/1.0.0/ftplet-api-1.0.0.jar
[DEBUG] /home/jenkins/.m2/repository/org/apache/mina/mina-core/2.0.0-M5/mina-core-2.0.0-M5.jar
[DEBUG] /home/jenkins/.m2/repository/org/apache/ftpserver/ftpserver-core/1.0.0/ftpserver-core-1.0.0.jar
[DEBUG] /home/jenkins/.m2/repository/org/apache/ftpserver/ftpserver-deprecated/1.0.0-M2/ftpserver-deprecated-1.0.0-M2.jar
[DEBUG] provider classpath classpath:
[DEBUG] /home/jenkins/.m2/repository/org/apache/maven/surefire/surefire-junit47/2.12-TRUNK-HBASE-2/surefire-junit47-2.12-TRUNK-HBASE-2.jar
[DEBUG] /home/jenkins/.m2/repository/org/apache/maven/surefire/common-junit48/2.12-TRUNK-HBASE-2/common-junit48-2.12-TRUNK-HBASE-2.jar
[DEBUG] /home/jenkins/.m2/repository/org/apache/maven/surefire/common-junit4/2.12-TRUNK-HBASE-2/common-junit4-2.12-TRUNK-HBASE-2.jar
[DEBUG] /home/jenkins/.m2/repository/org/apache/maven/surefire/common-junit3/2.12-TRUNK-HBASE-2/common-junit3-2.12-TRUNK-HBASE-2.jar
[DEBUG] /home/jenkins/.m2/repository/org/apache/maven/surefire/surefire-api/2.12-TRUNK-HBASE-2/surefire-api-2.12-TRUNK-HBASE-2.jar
-------------------------------------------------------
T E S T S
-------------------------------------------------------
-------------------------------------------------------
T E S T S
-------------------------------------------------------
Results :
Tests run: 0, Failures: 0, Errors: 0, Skipped: 0
[INFO] ------------------------------------------------------------------------
[INFO] BUILD FAILURE
[INFO] ------------------------------------------------------------------------
[INFO] Total time: 27:44.833s
[INFO] Finished at: Wed Apr 04 16:33:58 UTC 2012
[INFO] Final Memory: 44M/1171M
[INFO] ------------------------------------------------------------------------
[ERROR] Failed to execute goal org.apache.maven.plugins:maven-failsafe-plugin:2.12-TRUNK-HBASE-2:integration-test (integration-test) on project hbase: Execution integration-test of goal org.apache.maven.plugins:maven-failsafe-plugin:2.12-TRUNK-HBASE-2:integration-test failed: java.lang.reflect.InvocationTargetException; nested exception is java.lang.reflect.InvocationTargetException: null: NullPointerException -> [Help 1]
org.apache.maven.lifecycle.LifecycleExecutionException: Failed to execute goal org.apache.maven.plugins:maven-failsafe-plugin:2.12-TRUNK-HBASE-2:integration-test (integration-test) on project hbase: Execution integration-test of goal org.apache.maven.plugins:maven-failsafe-plugin:2.12-TRUNK-HBASE-2:integration-test failed: java.lang.reflect.InvocationTargetException; nested exception is java.lang.reflect.InvocationTargetException: null
at org.apache.maven.lifecycle.internal.MojoExecutor.execute(MojoExecutor.java:225)
at org.apache.maven.lifecycle.internal.MojoExecutor.execute(MojoExecutor.java:153)
at org.apache.maven.lifecycle.internal.MojoExecutor.execute(MojoExecutor.java:145)
at org.apache.maven.lifecycle.internal.LifecycleModuleBuilder.buildProject(LifecycleModuleBuilder.java:84)
at org.apache.maven.lifecycle.internal.LifecycleModuleBuilder.buildProject(LifecycleModuleBuilder.java:59)
at org.apache.maven.lifecycle.internal.LifecycleStarter.singleThreadedBuild(LifecycleStarter.java:183)
at org.apache.maven.lifecycle.internal.LifecycleStarter.execute(LifecycleStarter.java:161)
at org.apache.maven.DefaultMaven.doExecute(DefaultMaven.java:319)
at org.apache.maven.DefaultMaven.execute(DefaultMaven.java:156)
at org.apache.maven.cli.MavenCli.execute(MavenCli.java:537)
at org.apache.maven.cli.MavenCli.doMain(MavenCli.java:196)
at org.apache.maven.cli.MavenCli.main(MavenCli.java:141)
at sun.reflect.NativeMethodAccessorImpl.invoke0(Native Method)
at sun.reflect.NativeMethodAccessorImpl.invoke(NativeMethodAccessorImpl.java:39)
at sun.reflect.DelegatingMethodAccessorImpl.invoke(DelegatingMethodAccessorImpl.java:25)
at java.lang.reflect.Method.invoke(Method.java:597)
at org.codehaus.plexus.classworlds.launcher.Launcher.launchEnhanced(Launcher.java:290)
at org.codehaus.plexus.classworlds.launcher.Launcher.launch(Launcher.java:230)
at org.codehaus.plexus.classworlds.launcher.Launcher.mainWithExitCode(Launcher.java:409)
at org.codehaus.plexus.classworlds.launcher.Launcher.main(Launcher.java:352)
Caused by: org.apache.maven.plugin.PluginExecutionException: Execution integration-test of goal org.apache.maven.plugins:maven-failsafe-plugin:2.12-TRUNK-HBASE-2:integration-test failed: java.lang.reflect.InvocationTargetException; nested exception is java.lang.reflect.InvocationTargetException: null
at org.apache.maven.plugin.DefaultBuildPluginManager.executeMojo(DefaultBuildPluginManager.java:110)
at org.apache.maven.lifecycle.internal.MojoExecutor.execute(MojoExecutor.java:209)
... 19 more
Caused by: org.apache.maven.surefire.util.SurefireReflectionException: java.lang.reflect.InvocationTargetException; nested exception is java.lang.reflect.InvocationTargetException: null
at org.apache.maven.surefire.util.ReflectionUtils.invokeMethodWithArray(ReflectionUtils.java:196)
at org.apache.maven.surefire.util.ReflectionUtils.invokeGetter(ReflectionUtils.java:69)
at org.apache.maven.surefire.booter.ProviderFactory$ProviderProxy.getSuites(ProviderFactory.java:149)
at org.apache.maven.plugin.surefire.booterclient.ForkStarter.getSuitesIterator(ForkStarter.java:277)
at org.apache.maven.plugin.surefire.booterclient.ForkStarter.runSuitesForkPerTestSet(ForkStarter.java:133)
at org.apache.maven.plugin.surefire.booterclient.ForkStarter.run(ForkStarter.java:104)
at org.apache.maven.plugin.surefire.AbstractSurefireMojo.executeProvider(AbstractSurefireMojo.java:200)
at org.apache.maven.plugin.surefire.AbstractSurefireMojo.executeAllProviders(AbstractSurefireMojo.java:177)
at org.apache.maven.plugin.surefire.AbstractSurefireMojo.executeAfterPreconditionsChecked(AbstractSurefireMojo.java:135)
at org.apache.maven.plugin.surefire.AbstractSurefireMojo.execute(AbstractSurefireMojo.java:98)
at org.apache.maven.plugin.DefaultBuildPluginManager.executeMojo(DefaultBuildPluginManager.java:101)
... 20 more
Caused by: java.lang.reflect.InvocationTargetException
at sun.reflect.NativeMethodAccessorImpl.invoke0(Native Method)
at sun.reflect.NativeMethodAccessorImpl.invoke(NativeMethodAccessorImpl.java:39)
at sun.reflect.DelegatingMethodAccessorImpl.invoke(DelegatingMethodAccessorImpl.java:25)
at java.lang.reflect.Method.invoke(Method.java:597)
at org.apache.maven.surefire.util.ReflectionUtils.invokeMethodWithArray(ReflectionUtils.java:188)
... 30 more
Caused by: java.lang.NullPointerException
at org.apache.maven.surefire.util.DefaultDirectoryScanner.processIncludesExcludes(DefaultDirectoryScanner.java:136)
at org.apache.maven.surefire.util.DefaultDirectoryScanner.collectTests(DefaultDirectoryScanner.java:113)
at org.apache.maven.surefire.util.DefaultDirectoryScanner.locateTestClasses(DefaultDirectoryScanner.java:62)
at org.apache.maven.surefire.junitcore.JUnitCoreProvider.scanClassPath(JUnitCoreProvider.java:188)
at org.apache.maven.surefire.junitcore.JUnitCoreProvider.getSuitesAsList(JUnitCoreProvider.java:145)
at org.apache.maven.surefire.junitcore.JUnitCoreProvider.getSuites(JUnitCoreProvider.java:103)
... 35 more
[ERROR]
[ERROR]
[ERROR] For more information about the errors and possible solutions, please read the following articles:
[ERROR] [Help 1] http://cwiki.apache.org/confluence/display/MAVEN/PluginExecutionException
Build step 'Invoke top-level Maven targets' marked build as failure
Archiving artifacts
Updating HBASE-5706
Recording test results
Build failed in Jenkins: HBase-TRUNK #2708
Posted by Apache Jenkins Server <je...@builds.apache.org>.
See <https://builds.apache.org/job/HBase-TRUNK/2708/>
------------------------------------------
[...truncated 13104 lines...]
[DEBUG] Excluded: org.apache.maven:maven-plugin-api:jar:2.0.9
[DEBUG] Excluded: org.apache.maven:maven-artifact:jar:2.0.9
[DEBUG] Excluded: org.apache.maven:maven-project:jar:2.0.9
[DEBUG] Excluded: org.apache.maven:maven-settings:jar:2.0.9
[DEBUG] Excluded: org.apache.maven:maven-profile:jar:2.0.9
[DEBUG] Excluded: org.apache.maven:maven-model:jar:2.0.9
[DEBUG] Excluded: org.apache.maven:maven-artifact-manager:jar:2.0.9
[DEBUG] Excluded: org.apache.maven:maven-plugin-registry:jar:2.0.9
[DEBUG] Excluded: org.codehaus.plexus:plexus-container-default:jar:1.0-alpha-9-stable-1
[DEBUG] Excluded: junit:junit:jar:3.8.1
[DEBUG] Excluded: org.apache.maven:maven-core:jar:2.0.9
[DEBUG] Excluded: org.apache.maven:maven-plugin-parameter-documenter:jar:2.0.9
[DEBUG] Excluded: org.apache.maven:maven-repository-metadata:jar:2.0.9
[DEBUG] Excluded: org.apache.maven:maven-error-diagnostics:jar:2.0.9
[DEBUG] Excluded: org.apache.maven:maven-plugin-descriptor:jar:2.0.9
[DEBUG] Excluded: org.apache.maven:maven-monitor:jar:2.0.9
[DEBUG] Excluded: classworlds:classworlds:jar:1.1
[DEBUG] Excluded: org.apache.maven:maven-toolchain:jar:2.0.9
[DEBUG] Configuring mojo org.apache.maven.plugins:maven-failsafe-plugin:2.12-TRUNK-HBASE-2:integration-test from plugin realm ClassRealm[plugin>org.apache.maven.plugins:maven-failsafe-plugin:2.12-TRUNK-HBASE-2, parent: sun.misc.Launcher$AppClassLoader@192d342]
[DEBUG] Configuring mojo 'org.apache.maven.plugins:maven-failsafe-plugin:2.12-TRUNK-HBASE-2:integration-test' with basic configurator -->
[DEBUG] (s) basedir = <https://builds.apache.org/job/HBase-TRUNK/ws/trunk>
[DEBUG] (s) childDelegation = false
[DEBUG] (s) classesDirectory = <https://builds.apache.org/job/HBase-TRUNK/ws/trunk/target/classes>
[DEBUG] (s) disableXmlReport = false
[DEBUG] (s) enableAssertions = true
[DEBUG] (s) environmentVariables = {DYLD_LIBRARY_PATH=${env.DYLD_LIBRARY_PATH}:<https://builds.apache.org/job/HBase-TRUNK/ws/trunk/target/nativelib,> LD_LIBRARY_PATH=/home/jenkins/tools/java/jdk1.6.0_27-32/jre/lib/i386/server:/home/jenkins/tools/java/jdk1.6.0_27-32/jre/lib/i386:/home/jenkins/tools/java/jdk1.6.0_27-32/jre/../lib/i386:/usr/lib/jvm/java-6-openjdk/jre/lib/amd64/server:/usr/lib/jvm/java-6-openjdk/jre/lib/amd64:/usr/lib/jvm/java-6-openjdk/jre/../lib/amd64:<https://builds.apache.org/job/HBase-TRUNK/ws/trunk/target/nativelib,> MALLOC_ARENA_MAX=4}
[DEBUG] (s) excludes = [**/Test*.java, **/*$*, null]
[DEBUG] (s) forkMode = always
[DEBUG] (s) includes = [**/IntegrationTest*.java]
[DEBUG] (s) junitArtifactName = junit:junit
[DEBUG] (s) localRepository = id: local
url: file:///home/jenkins/.m2/repository/
layout: none
[DEBUG] (f) parallelMavenExecution = false
[DEBUG] (s) perCoreThreadCount = true
[DEBUG] (s) pluginArtifactMap = {org.apache.maven.plugins:maven-failsafe-plugin=org.apache.maven.plugins:maven-failsafe-plugin:maven-plugin:2.12-TRUNK-HBASE-2:, org.apache.maven.surefire:surefire-junit47=org.apache.maven.surefire:surefire-junit47:jar:2.12-TRUNK-HBASE-2:runtime, org.apache.maven.surefire:common-junit48=org.apache.maven.surefire:common-junit48:jar:2.12-TRUNK-HBASE-2:runtime, org.apache.maven.surefire:common-junit4=org.apache.maven.surefire:common-junit4:jar:2.12-TRUNK-HBASE-2:runtime, org.apache.maven.surefire:common-junit3=org.apache.maven.surefire:common-junit3:jar:2.12-TRUNK-HBASE-2:runtime, org.apache.maven.surefire:surefire-api=org.apache.maven.surefire:surefire-api:jar:2.12-TRUNK-HBASE-2:compile, org.apache.maven.surefire:surefire-booter=org.apache.maven.surefire:surefire-booter:jar:2.12-TRUNK-HBASE-2:compile, org.apache.maven.surefire:maven-surefire-common=org.apache.maven.surefire:maven-surefire-common:jar:2.12-TRUNK-HBASE-2:compile, org.apache.maven.shared:maven-common-artifact-filters=org.apache.maven.shared:maven-common-artifact-filters:jar:1.3:compile, org.codehaus.plexus:plexus-utils=org.codehaus.plexus:plexus-utils:jar:2.1:compile, org.apache.maven.reporting:maven-reporting-api=org.apache.maven.reporting:maven-reporting-api:jar:2.0.9:compile}
[DEBUG] (s) printSummary = true
[DEBUG] (s) project = MavenProject: org.apache.hbase:hbase:0.95-SNAPSHOT @ <https://builds.apache.org/job/HBase-TRUNK/ws/trunk/pom.xml>
[DEBUG] (s) projectArtifactMap = {com.google.guava:guava=com.google.guava:guava:jar:r09:compile, commons-cli:commons-cli=commons-cli:commons-cli:jar:1.2:compile, commons-configuration:commons-configuration=commons-configuration:commons-configuration:jar:1.6:compile, commons-collections:commons-collections=commons-collections:commons-collections:jar:3.2.1:compile, commons-digester:commons-digester=commons-digester:commons-digester:jar:1.8:compile, commons-beanutils:commons-beanutils=commons-beanutils:commons-beanutils:jar:1.7.0:compile, commons-beanutils:commons-beanutils-core=commons-beanutils:commons-beanutils-core:jar:1.8.0:compile, com.github.stephenc.high-scale-lib:high-scale-lib=com.github.stephenc.high-scale-lib:high-scale-lib:jar:1.1.1:compile, commons-codec:commons-codec=commons-codec:commons-codec:jar:1.4:compile, commons-httpclient:commons-httpclient=commons-httpclient:commons-httpclient:jar:3.1:compile, commons-io:commons-io=commons-io:commons-io:jar:2.1:compile, commons-lang:commons-lang=commons-lang:commons-lang:jar:2.5:compile, commons-logging:commons-logging=commons-logging:commons-logging:jar:1.1.1:compile, log4j:log4j=log4j:log4j:jar:1.2.16:compile, org.apache.avro:avro=org.apache.avro:avro:jar:1.5.3:compile, org.xerial.snappy:snappy-java=org.xerial.snappy:snappy-java:jar:1.0.3.2:compile, org.apache.avro:avro-ipc=org.apache.avro:avro-ipc:jar:1.5.3:compile, org.jboss.netty:netty=org.jboss.netty:netty:jar:3.2.4.Final:compile, org.apache.velocity:velocity=org.apache.velocity:velocity:jar:1.7:compile, org.apache.zookeeper:zookeeper=org.apache.zookeeper:zookeeper:jar:3.4.3:compile, org.apache.thrift:libthrift=org.apache.thrift:libthrift:jar:0.8.0:compile, org.apache.httpcomponents:httpclient=org.apache.httpcomponents:httpclient:jar:4.1.2:compile, org.apache.httpcomponents:httpcore=org.apache.httpcomponents:httpcore:jar:4.1.3:compile, org.jruby:jruby-complete=org.jruby:jruby-complete:jar:1.6.5:compile, org.mortbay.jetty:jetty=org.mortbay.jetty:jetty:jar:6.1.26:compile, org.mortbay.jetty:jetty-util=org.mortbay.jetty:jetty-util:jar:6.1.26:compile, org.mortbay.jetty:jsp-2.1=org.mortbay.jetty:jsp-2.1:jar:6.1.14:compile, org.eclipse.jdt:core=org.eclipse.jdt:core:jar:3.1.1:compile, org.mortbay.jetty:jsp-api-2.1=org.mortbay.jetty:jsp-api-2.1:jar:6.1.14:compile, org.mortbay.jetty:servlet-api-2.5=org.mortbay.jetty:servlet-api-2.5:jar:6.1.14:compile, org.codehaus.jackson:jackson-core-asl=org.codehaus.jackson:jackson-core-asl:jar:1.5.5:compile, org.codehaus.jackson:jackson-mapper-asl=org.codehaus.jackson:jackson-mapper-asl:jar:1.5.5:compile, org.codehaus.jackson:jackson-jaxrs=org.codehaus.jackson:jackson-jaxrs:jar:1.5.5:compile, org.codehaus.jackson:jackson-xc=org.codehaus.jackson:jackson-xc:jar:1.5.5:compile, org.slf4j:slf4j-api=org.slf4j:slf4j-api:jar:1.5.8:compile, org.slf4j:slf4j-log4j12=org.slf4j:slf4j-log4j12:jar:1.5.8:compile, tomcat:jasper-compiler=tomcat:jasper-compiler:jar:5.5.23:runtime, tomcat:jasper-runtime=tomcat:jasper-runtime:jar:5.5.23:runtime, commons-el:commons-el=commons-el:commons-el:jar:1.0:compile, org.jamon:jamon-runtime=org.jamon:jamon-runtime:jar:2.3.1:compile, com.google.protobuf:protobuf-java=com.google.protobuf:protobuf-java:jar:2.4.0a:compile, com.sun.jersey:jersey-core=com.sun.jersey:jersey-core:jar:1.4:compile, com.sun.jersey:jersey-json=com.sun.jersey:jersey-json:jar:1.4:compile, org.codehaus.jettison:jettison=org.codehaus.jettison:jettison:jar:1.1:compile, com.sun.xml.bind:jaxb-impl=com.sun.xml.bind:jaxb-impl:jar:2.1.12:compile, com.sun.jersey:jersey-server=com.sun.jersey:jersey-server:jar:1.4:compile, asm:asm=asm:asm:jar:3.1:compile, javax.xml.bind:jaxb-api=javax.xml.bind:jaxb-api:jar:2.1:compile, javax.activation:activation=javax.activation:activation:jar:1.1:compile, stax:stax-api=stax:stax-api:jar:1.0.1:compile, junit:junit=junit:junit:jar:4.10-HBASE-1:test, org.mockito:mockito-all=org.mockito:mockito-all:jar:1.8.5:test, org.apache.commons:commons-math=org.apache.commons:commons-math:jar:2.1:test, org.apache.hadoop:hadoop-core=org.apache.hadoop:hadoop-core:jar:1.0.0:compile, xmlenc:xmlenc=xmlenc:xmlenc:jar:0.52:compile, commons-net:commons-net=commons-net:commons-net:jar:1.4.1:compile, org.apache.hadoop:hadoop-test=org.apache.hadoop:hadoop-test:jar:1.0.0:test, org.apache.ftpserver:ftplet-api=org.apache.ftpserver:ftplet-api:jar:1.0.0:test, org.apache.mina:mina-core=org.apache.mina:mina-core:jar:2.0.0-M5:test, org.apache.ftpserver:ftpserver-core=org.apache.ftpserver:ftpserver-core:jar:1.0.0:test, org.apache.ftpserver:ftpserver-deprecated=org.apache.ftpserver:ftpserver-deprecated:jar:1.0.0-M2:test}
[DEBUG] (s) redirectTestOutputToFile = true
[DEBUG] (s) remoteRepositories = [ id: ghelmling.testing
url: http://people.apache.org/~garyh/mvn/
layout: default
snapshots: [enabled => true, update => daily]
releases: [enabled => true, update => daily]
, id: central
url: http://repo1.maven.org/maven2
layout: default
snapshots: [enabled => false, update => daily]
releases: [enabled => true, update => never]
]
[DEBUG] (s) reportFormat = brief
[DEBUG] (s) reportsDirectory = <https://builds.apache.org/job/HBase-TRUNK/ws/trunk/target/failsafe-reports>
[DEBUG] (s) runOrder = filesystem
[DEBUG] (s) session = org.apache.maven.execution.MavenSession@18f5954
[DEBUG] (s) skip = false
[DEBUG] (s) skipTests = false
[DEBUG] (s) summaryFile = <https://builds.apache.org/job/HBase-TRUNK/ws/trunk/target/failsafe-reports/failsafe-summary.xml>
[DEBUG] (s) testClassesDirectory = <https://builds.apache.org/job/HBase-TRUNK/ws/trunk/target/test-classes>
[DEBUG] (s) testNGArtifactName = org.testng:testng
[DEBUG] (s) testSourceDirectory = <https://builds.apache.org/job/HBase-TRUNK/ws/trunk/src/test/java>
[DEBUG] (s) trimStackTrace = true
[DEBUG] (s) useFile = true
[DEBUG] (s) useManifestOnlyJar = true
[DEBUG] (s) useSystemClassLoader = true
[DEBUG] (s) useUnlimitedThreads = false
[DEBUG] (s) workingDirectory = <https://builds.apache.org/job/HBase-TRUNK/ws/trunk>
[DEBUG] -- end configuration --
[INFO] Failsafe report directory: <https://builds.apache.org/job/HBase-TRUNK/ws/trunk/target/failsafe-reports>
[INFO] Using configured provider org.apache.maven.surefire.junitcore.JUnitCoreProvider
[DEBUG] dummy:dummy:jar:1.0 (selected for null)
[DEBUG] org.apache.maven.surefire:surefire-booter:jar:2.12-TRUNK-HBASE-2:compile (selected for compile)
[DEBUG] org.apache.maven.surefire:surefire-api:jar:2.12-TRUNK-HBASE-2:compile (selected for compile)
[DEBUG] Adding to failsafe booter test classpath: /home/jenkins/.m2/repository/org/apache/maven/surefire/surefire-booter/2.12-TRUNK-HBASE-2/surefire-booter-2.12-TRUNK-HBASE-2.jar Scope: compile
[DEBUG] Adding to failsafe booter test classpath: /home/jenkins/.m2/repository/org/apache/maven/surefire/surefire-api/2.12-TRUNK-HBASE-2/surefire-api-2.12-TRUNK-HBASE-2.jar Scope: compile
[DEBUG] Setting system property [user.dir]=[<https://builds.apache.org/job/HBase-TRUNK/ws/trunk]>
[DEBUG] Setting system property [localRepository]=[/home/jenkins/.m2/repository]
[DEBUG] Setting system property [basedir]=[<https://builds.apache.org/job/HBase-TRUNK/ws/trunk]>
[DEBUG] Setting system property [maven.test.redirectTestOutputToFile]=[true]
[DEBUG] Using JVM: /home/jenkins/tools/java/jdk1.6.0_27-32/jre/bin/java
[DEBUG] Setting environment variable [DYLD_LIBRARY_PATH]=[${env.DYLD_LIBRARY_PATH}:<https://builds.apache.org/job/HBase-TRUNK/ws/trunk/target/nativelib]>
[DEBUG] Setting environment variable [LD_LIBRARY_PATH]=[/home/jenkins/tools/java/jdk1.6.0_27-32/jre/lib/i386/server:/home/jenkins/tools/java/jdk1.6.0_27-32/jre/lib/i386:/home/jenkins/tools/java/jdk1.6.0_27-32/jre/../lib/i386:/usr/lib/jvm/java-6-openjdk/jre/lib/amd64/server:/usr/lib/jvm/java-6-openjdk/jre/lib/amd64:/usr/lib/jvm/java-6-openjdk/jre/../lib/amd64:<https://builds.apache.org/job/HBase-TRUNK/ws/trunk/target/nativelib]>
[DEBUG] Setting environment variable [MALLOC_ARENA_MAX]=[4]
[DEBUG] dummy:dummy:jar:1.0 (selected for null)
[DEBUG] org.apache.maven.surefire:surefire-junit47:jar:2.12-TRUNK-HBASE-2:test (selected for test)
[DEBUG] org.apache.maven.surefire:common-junit48:jar:2.12-TRUNK-HBASE-2:test (selected for test)
[DEBUG] org.apache.maven.surefire:common-junit4:jar:2.12-TRUNK-HBASE-2:test (selected for test)
[DEBUG] org.apache.maven.surefire:common-junit3:jar:2.12-TRUNK-HBASE-2:test (selected for test)
[DEBUG] org.apache.maven.surefire:surefire-api:jar:2.12-TRUNK-HBASE-2:test (selected for test)
[DEBUG] org.apache.maven.surefire:surefire-api:jar:2.12-TRUNK-HBASE-2:test (selected for test)
[DEBUG] org.apache.maven.surefire:surefire-api:jar:2.12-TRUNK-HBASE-2:test (selected for test)
[DEBUG] org.apache.maven.surefire:surefire-api:jar:2.12-TRUNK-HBASE-2:test (selected for test)
[DEBUG] Adding to failsafe test classpath: /home/jenkins/.m2/repository/org/apache/maven/surefire/surefire-junit47/2.12-TRUNK-HBASE-2/surefire-junit47-2.12-TRUNK-HBASE-2.jar Scope: test
[DEBUG] Adding to failsafe test classpath: /home/jenkins/.m2/repository/org/apache/maven/surefire/common-junit48/2.12-TRUNK-HBASE-2/common-junit48-2.12-TRUNK-HBASE-2.jar Scope: test
[DEBUG] Adding to failsafe test classpath: /home/jenkins/.m2/repository/org/apache/maven/surefire/common-junit4/2.12-TRUNK-HBASE-2/common-junit4-2.12-TRUNK-HBASE-2.jar Scope: test
[DEBUG] Adding to failsafe test classpath: /home/jenkins/.m2/repository/org/apache/maven/surefire/common-junit3/2.12-TRUNK-HBASE-2/common-junit3-2.12-TRUNK-HBASE-2.jar Scope: test
[DEBUG] Adding to failsafe test classpath: /home/jenkins/.m2/repository/org/apache/maven/surefire/surefire-api/2.12-TRUNK-HBASE-2/surefire-api-2.12-TRUNK-HBASE-2.jar Scope: test
[DEBUG] test classpath classpath:
[DEBUG] <https://builds.apache.org/job/HBase-TRUNK/ws/trunk/target/test-classes>
[DEBUG] <https://builds.apache.org/job/HBase-TRUNK/ws/trunk/target/classes>
[DEBUG] /home/jenkins/.m2/repository/com/google/guava/guava/r09/guava-r09.jar
[DEBUG] /home/jenkins/.m2/repository/commons-cli/commons-cli/1.2/commons-cli-1.2.jar
[DEBUG] /home/jenkins/.m2/repository/commons-configuration/commons-configuration/1.6/commons-configuration-1.6.jar
[DEBUG] /home/jenkins/.m2/repository/commons-collections/commons-collections/3.2.1/commons-collections-3.2.1.jar
[DEBUG] /home/jenkins/.m2/repository/commons-digester/commons-digester/1.8/commons-digester-1.8.jar
[DEBUG] /home/jenkins/.m2/repository/commons-beanutils/commons-beanutils/1.7.0/commons-beanutils-1.7.0.jar
[DEBUG] /home/jenkins/.m2/repository/commons-beanutils/commons-beanutils-core/1.8.0/commons-beanutils-core-1.8.0.jar
[DEBUG] /home/jenkins/.m2/repository/com/github/stephenc/high-scale-lib/high-scale-lib/1.1.1/high-scale-lib-1.1.1.jar
[DEBUG] /home/jenkins/.m2/repository/commons-codec/commons-codec/1.4/commons-codec-1.4.jar
[DEBUG] /home/jenkins/.m2/repository/commons-httpclient/commons-httpclient/3.1/commons-httpclient-3.1.jar
[DEBUG] /home/jenkins/.m2/repository/commons-io/commons-io/2.1/commons-io-2.1.jar
[DEBUG] /home/jenkins/.m2/repository/commons-lang/commons-lang/2.5/commons-lang-2.5.jar
[DEBUG] /home/jenkins/.m2/repository/commons-logging/commons-logging/1.1.1/commons-logging-1.1.1.jar
[DEBUG] /home/jenkins/.m2/repository/log4j/log4j/1.2.16/log4j-1.2.16.jar
[DEBUG] /home/jenkins/.m2/repository/org/apache/avro/avro/1.5.3/avro-1.5.3.jar
[DEBUG] /home/jenkins/.m2/repository/org/xerial/snappy/snappy-java/1.0.3.2/snappy-java-1.0.3.2.jar
[DEBUG] /home/jenkins/.m2/repository/org/apache/avro/avro-ipc/1.5.3/avro-ipc-1.5.3.jar
[DEBUG] /home/jenkins/.m2/repository/org/jboss/netty/netty/3.2.4.Final/netty-3.2.4.Final.jar
[DEBUG] /home/jenkins/.m2/repository/org/apache/velocity/velocity/1.7/velocity-1.7.jar
[DEBUG] /home/jenkins/.m2/repository/org/apache/zookeeper/zookeeper/3.4.3/zookeeper-3.4.3.jar
[DEBUG] /home/jenkins/.m2/repository/org/apache/thrift/libthrift/0.8.0/libthrift-0.8.0.jar
[DEBUG] /home/jenkins/.m2/repository/org/apache/httpcomponents/httpclient/4.1.2/httpclient-4.1.2.jar
[DEBUG] /home/jenkins/.m2/repository/org/apache/httpcomponents/httpcore/4.1.3/httpcore-4.1.3.jar
[DEBUG] /home/jenkins/.m2/repository/org/jruby/jruby-complete/1.6.5/jruby-complete-1.6.5.jar
[DEBUG] /home/jenkins/.m2/repository/org/mortbay/jetty/jetty/6.1.26/jetty-6.1.26.jar
[DEBUG] /home/jenkins/.m2/repository/org/mortbay/jetty/jetty-util/6.1.26/jetty-util-6.1.26.jar
[DEBUG] /home/jenkins/.m2/repository/org/mortbay/jetty/jsp-2.1/6.1.14/jsp-2.1-6.1.14.jar
[DEBUG] /home/jenkins/.m2/repository/org/eclipse/jdt/core/3.1.1/core-3.1.1.jar
[DEBUG] /home/jenkins/.m2/repository/org/mortbay/jetty/jsp-api-2.1/6.1.14/jsp-api-2.1-6.1.14.jar
[DEBUG] /home/jenkins/.m2/repository/org/mortbay/jetty/servlet-api-2.5/6.1.14/servlet-api-2.5-6.1.14.jar
[DEBUG] /home/jenkins/.m2/repository/org/codehaus/jackson/jackson-core-asl/1.5.5/jackson-core-asl-1.5.5.jar
[DEBUG] /home/jenkins/.m2/repository/org/codehaus/jackson/jackson-mapper-asl/1.5.5/jackson-mapper-asl-1.5.5.jar
[DEBUG] /home/jenkins/.m2/repository/org/codehaus/jackson/jackson-jaxrs/1.5.5/jackson-jaxrs-1.5.5.jar
[DEBUG] /home/jenkins/.m2/repository/org/codehaus/jackson/jackson-xc/1.5.5/jackson-xc-1.5.5.jar
[DEBUG] /home/jenkins/.m2/repository/org/slf4j/slf4j-api/1.5.8/slf4j-api-1.5.8.jar
[DEBUG] /home/jenkins/.m2/repository/org/slf4j/slf4j-log4j12/1.5.8/slf4j-log4j12-1.5.8.jar
[DEBUG] /home/jenkins/.m2/repository/tomcat/jasper-compiler/5.5.23/jasper-compiler-5.5.23.jar
[DEBUG] /home/jenkins/.m2/repository/tomcat/jasper-runtime/5.5.23/jasper-runtime-5.5.23.jar
[DEBUG] /home/jenkins/.m2/repository/commons-el/commons-el/1.0/commons-el-1.0.jar
[DEBUG] /home/jenkins/.m2/repository/org/jamon/jamon-runtime/2.3.1/jamon-runtime-2.3.1.jar
[DEBUG] /home/jenkins/.m2/repository/com/google/protobuf/protobuf-java/2.4.0a/protobuf-java-2.4.0a.jar
[DEBUG] /home/jenkins/.m2/repository/com/sun/jersey/jersey-core/1.4/jersey-core-1.4.jar
[DEBUG] /home/jenkins/.m2/repository/com/sun/jersey/jersey-json/1.4/jersey-json-1.4.jar
[DEBUG] /home/jenkins/.m2/repository/org/codehaus/jettison/jettison/1.1/jettison-1.1.jar
[DEBUG] /home/jenkins/.m2/repository/com/sun/xml/bind/jaxb-impl/2.1.12/jaxb-impl-2.1.12.jar
[DEBUG] /home/jenkins/.m2/repository/com/sun/jersey/jersey-server/1.4/jersey-server-1.4.jar
[DEBUG] /home/jenkins/.m2/repository/asm/asm/3.1/asm-3.1.jar
[DEBUG] /home/jenkins/.m2/repository/javax/xml/bind/jaxb-api/2.1/jaxb-api-2.1.jar
[DEBUG] /home/jenkins/.m2/repository/javax/activation/activation/1.1/activation-1.1.jar
[DEBUG] /home/jenkins/.m2/repository/stax/stax-api/1.0.1/stax-api-1.0.1.jar
[DEBUG] /home/jenkins/.m2/repository/junit/junit/4.10-HBASE-1/junit-4.10-HBASE-1.jar
[DEBUG] /home/jenkins/.m2/repository/org/mockito/mockito-all/1.8.5/mockito-all-1.8.5.jar
[DEBUG] /home/jenkins/.m2/repository/org/apache/commons/commons-math/2.1/commons-math-2.1.jar
[DEBUG] /home/jenkins/.m2/repository/org/apache/hadoop/hadoop-core/1.0.0/hadoop-core-1.0.0.jar
[DEBUG] /home/jenkins/.m2/repository/xmlenc/xmlenc/0.52/xmlenc-0.52.jar
[DEBUG] /home/jenkins/.m2/repository/commons-net/commons-net/1.4.1/commons-net-1.4.1.jar
[DEBUG] /home/jenkins/.m2/repository/org/apache/hadoop/hadoop-test/1.0.0/hadoop-test-1.0.0.jar
[DEBUG] /home/jenkins/.m2/repository/org/apache/ftpserver/ftplet-api/1.0.0/ftplet-api-1.0.0.jar
[DEBUG] /home/jenkins/.m2/repository/org/apache/mina/mina-core/2.0.0-M5/mina-core-2.0.0-M5.jar
[DEBUG] /home/jenkins/.m2/repository/org/apache/ftpserver/ftpserver-core/1.0.0/ftpserver-core-1.0.0.jar
[DEBUG] /home/jenkins/.m2/repository/org/apache/ftpserver/ftpserver-deprecated/1.0.0-M2/ftpserver-deprecated-1.0.0-M2.jar
[DEBUG] provider classpath classpath:
[DEBUG] /home/jenkins/.m2/repository/org/apache/maven/surefire/surefire-junit47/2.12-TRUNK-HBASE-2/surefire-junit47-2.12-TRUNK-HBASE-2.jar
[DEBUG] /home/jenkins/.m2/repository/org/apache/maven/surefire/common-junit48/2.12-TRUNK-HBASE-2/common-junit48-2.12-TRUNK-HBASE-2.jar
[DEBUG] /home/jenkins/.m2/repository/org/apache/maven/surefire/common-junit4/2.12-TRUNK-HBASE-2/common-junit4-2.12-TRUNK-HBASE-2.jar
[DEBUG] /home/jenkins/.m2/repository/org/apache/maven/surefire/common-junit3/2.12-TRUNK-HBASE-2/common-junit3-2.12-TRUNK-HBASE-2.jar
[DEBUG] /home/jenkins/.m2/repository/org/apache/maven/surefire/surefire-api/2.12-TRUNK-HBASE-2/surefire-api-2.12-TRUNK-HBASE-2.jar
-------------------------------------------------------
T E S T S
-------------------------------------------------------
-------------------------------------------------------
T E S T S
-------------------------------------------------------
Results :
Tests run: 0, Failures: 0, Errors: 0, Skipped: 0
[INFO] ------------------------------------------------------------------------
[INFO] BUILD FAILURE
[INFO] ------------------------------------------------------------------------
[INFO] Total time: 27:53.924s
[INFO] Finished at: Wed Apr 04 04:35:57 UTC 2012
[INFO] Final Memory: 53M/1182M
[INFO] ------------------------------------------------------------------------
[ERROR] Failed to execute goal org.apache.maven.plugins:maven-failsafe-plugin:2.12-TRUNK-HBASE-2:integration-test (integration-test) on project hbase: Execution integration-test of goal org.apache.maven.plugins:maven-failsafe-plugin:2.12-TRUNK-HBASE-2:integration-test failed: java.lang.reflect.InvocationTargetException; nested exception is java.lang.reflect.InvocationTargetException: null: NullPointerException -> [Help 1]
org.apache.maven.lifecycle.LifecycleExecutionException: Failed to execute goal org.apache.maven.plugins:maven-failsafe-plugin:2.12-TRUNK-HBASE-2:integration-test (integration-test) on project hbase: Execution integration-test of goal org.apache.maven.plugins:maven-failsafe-plugin:2.12-TRUNK-HBASE-2:integration-test failed: java.lang.reflect.InvocationTargetException; nested exception is java.lang.reflect.InvocationTargetException: null
at org.apache.maven.lifecycle.internal.MojoExecutor.execute(MojoExecutor.java:225)
at org.apache.maven.lifecycle.internal.MojoExecutor.execute(MojoExecutor.java:153)
at org.apache.maven.lifecycle.internal.MojoExecutor.execute(MojoExecutor.java:145)
at org.apache.maven.lifecycle.internal.LifecycleModuleBuilder.buildProject(LifecycleModuleBuilder.java:84)
at org.apache.maven.lifecycle.internal.LifecycleModuleBuilder.buildProject(LifecycleModuleBuilder.java:59)
at org.apache.maven.lifecycle.internal.LifecycleStarter.singleThreadedBuild(LifecycleStarter.java:183)
at org.apache.maven.lifecycle.internal.LifecycleStarter.execute(LifecycleStarter.java:161)
at org.apache.maven.DefaultMaven.doExecute(DefaultMaven.java:319)
at org.apache.maven.DefaultMaven.execute(DefaultMaven.java:156)
at org.apache.maven.cli.MavenCli.execute(MavenCli.java:537)
at org.apache.maven.cli.MavenCli.doMain(MavenCli.java:196)
at org.apache.maven.cli.MavenCli.main(MavenCli.java:141)
at sun.reflect.NativeMethodAccessorImpl.invoke0(Native Method)
at sun.reflect.NativeMethodAccessorImpl.invoke(NativeMethodAccessorImpl.java:39)
at sun.reflect.DelegatingMethodAccessorImpl.invoke(DelegatingMethodAccessorImpl.java:25)
at java.lang.reflect.Method.invoke(Method.java:597)
at org.codehaus.plexus.classworlds.launcher.Launcher.launchEnhanced(Launcher.java:290)
at org.codehaus.plexus.classworlds.launcher.Launcher.launch(Launcher.java:230)
at org.codehaus.plexus.classworlds.launcher.Launcher.mainWithExitCode(Launcher.java:409)
at org.codehaus.plexus.classworlds.launcher.Launcher.main(Launcher.java:352)
Caused by: org.apache.maven.plugin.PluginExecutionException: Execution integration-test of goal org.apache.maven.plugins:maven-failsafe-plugin:2.12-TRUNK-HBASE-2:integration-test failed: java.lang.reflect.InvocationTargetException; nested exception is java.lang.reflect.InvocationTargetException: null
at org.apache.maven.plugin.DefaultBuildPluginManager.executeMojo(DefaultBuildPluginManager.java:110)
at org.apache.maven.lifecycle.internal.MojoExecutor.execute(MojoExecutor.java:209)
... 19 more
Caused by: org.apache.maven.surefire.util.SurefireReflectionException: java.lang.reflect.InvocationTargetException; nested exception is java.lang.reflect.InvocationTargetException: null
at org.apache.maven.surefire.util.ReflectionUtils.invokeMethodWithArray(ReflectionUtils.java:196)
at org.apache.maven.surefire.util.ReflectionUtils.invokeGetter(ReflectionUtils.java:69)
at org.apache.maven.surefire.booter.ProviderFactory$ProviderProxy.getSuites(ProviderFactory.java:149)
at org.apache.maven.plugin.surefire.booterclient.ForkStarter.getSuitesIterator(ForkStarter.java:277)
at org.apache.maven.plugin.surefire.booterclient.ForkStarter.runSuitesForkPerTestSet(ForkStarter.java:133)
at org.apache.maven.plugin.surefire.booterclient.ForkStarter.run(ForkStarter.java:104)
at org.apache.maven.plugin.surefire.AbstractSurefireMojo.executeProvider(AbstractSurefireMojo.java:200)
at org.apache.maven.plugin.surefire.AbstractSurefireMojo.executeAllProviders(AbstractSurefireMojo.java:177)
at org.apache.maven.plugin.surefire.AbstractSurefireMojo.executeAfterPreconditionsChecked(AbstractSurefireMojo.java:135)
at org.apache.maven.plugin.surefire.AbstractSurefireMojo.execute(AbstractSurefireMojo.java:98)
at org.apache.maven.plugin.DefaultBuildPluginManager.executeMojo(DefaultBuildPluginManager.java:101)
... 20 more
Caused by: java.lang.reflect.InvocationTargetException
at sun.reflect.NativeMethodAccessorImpl.invoke0(Native Method)
at sun.reflect.NativeMethodAccessorImpl.invoke(NativeMethodAccessorImpl.java:39)
at sun.reflect.DelegatingMethodAccessorImpl.invoke(DelegatingMethodAccessorImpl.java:25)
at java.lang.reflect.Method.invoke(Method.java:597)
at org.apache.maven.surefire.util.ReflectionUtils.invokeMethodWithArray(ReflectionUtils.java:188)
... 30 more
Caused by: java.lang.NullPointerException
at org.apache.maven.surefire.util.DefaultDirectoryScanner.processIncludesExcludes(DefaultDirectoryScanner.java:136)
at org.apache.maven.surefire.util.DefaultDirectoryScanner.collectTests(DefaultDirectoryScanner.java:113)
at org.apache.maven.surefire.util.DefaultDirectoryScanner.locateTestClasses(DefaultDirectoryScanner.java:62)
at org.apache.maven.surefire.junitcore.JUnitCoreProvider.scanClassPath(JUnitCoreProvider.java:188)
at org.apache.maven.surefire.junitcore.JUnitCoreProvider.getSuitesAsList(JUnitCoreProvider.java:145)
at org.apache.maven.surefire.junitcore.JUnitCoreProvider.getSuites(JUnitCoreProvider.java:103)
... 35 more
[ERROR]
[ERROR]
[ERROR] For more information about the errors and possible solutions, please read the following articles:
[ERROR] [Help 1] http://cwiki.apache.org/confluence/display/MAVEN/PluginExecutionException
Build step 'Invoke top-level Maven targets' marked build as failure
Archiving artifacts
Recording test results
Build failed in Jenkins: HBase-TRUNK #2707
Posted by Apache Jenkins Server <je...@builds.apache.org>.
See <https://builds.apache.org/job/HBase-TRUNK/2707/changes>
Changes:
[tedyu] HBASE-5606 SplitLogManger async delete node hangs log splitting when ZK connection is lost
(Prakash)
------------------------------------------
[...truncated 13104 lines...]
[DEBUG] Excluded: org.apache.maven:maven-artifact:jar:2.0.9
[DEBUG] Excluded: org.apache.maven:maven-project:jar:2.0.9
[DEBUG] Excluded: org.apache.maven:maven-settings:jar:2.0.9
[DEBUG] Excluded: org.apache.maven:maven-profile:jar:2.0.9
[DEBUG] Excluded: org.apache.maven:maven-model:jar:2.0.9
[DEBUG] Excluded: org.apache.maven:maven-artifact-manager:jar:2.0.9
[DEBUG] Excluded: org.apache.maven:maven-plugin-registry:jar:2.0.9
[DEBUG] Excluded: org.codehaus.plexus:plexus-container-default:jar:1.0-alpha-9-stable-1
[DEBUG] Excluded: junit:junit:jar:3.8.1
[DEBUG] Excluded: org.apache.maven:maven-core:jar:2.0.9
[DEBUG] Excluded: org.apache.maven:maven-plugin-parameter-documenter:jar:2.0.9
[DEBUG] Excluded: org.apache.maven:maven-repository-metadata:jar:2.0.9
[DEBUG] Excluded: org.apache.maven:maven-error-diagnostics:jar:2.0.9
[DEBUG] Excluded: org.apache.maven:maven-plugin-descriptor:jar:2.0.9
[DEBUG] Excluded: org.apache.maven:maven-monitor:jar:2.0.9
[DEBUG] Excluded: classworlds:classworlds:jar:1.1
[DEBUG] Excluded: org.apache.maven:maven-toolchain:jar:2.0.9
[DEBUG] Configuring mojo org.apache.maven.plugins:maven-failsafe-plugin:2.12-TRUNK-HBASE-2:integration-test from plugin realm ClassRealm[plugin>org.apache.maven.plugins:maven-failsafe-plugin:2.12-TRUNK-HBASE-2, parent: sun.misc.Launcher$AppClassLoader@18fe7c3]
[DEBUG] Configuring mojo 'org.apache.maven.plugins:maven-failsafe-plugin:2.12-TRUNK-HBASE-2:integration-test' with basic configurator -->
[DEBUG] (s) basedir = /x1/jenkins/jenkins-slave/workspace/HBase-TRUNK/trunk
[DEBUG] (s) childDelegation = false
[DEBUG] (s) classesDirectory = /x1/jenkins/jenkins-slave/workspace/HBase-TRUNK/trunk/target/classes
[DEBUG] (s) disableXmlReport = false
[DEBUG] (s) enableAssertions = true
[DEBUG] (s) environmentVariables = {DYLD_LIBRARY_PATH=${env.DYLD_LIBRARY_PATH}:/x1/jenkins/jenkins-slave/workspace/HBase-TRUNK/trunk/target/nativelib, LD_LIBRARY_PATH=/x1/jenkins/tools/java/jdk1.6.0_27-32/jre/lib/i386/server:/x1/jenkins/tools/java/jdk1.6.0_27-32/jre/lib/i386:/x1/jenkins/tools/java/jdk1.6.0_27-32/jre/../lib/i386:/usr/lib/jvm/java-6-sun-1.6.0.26/jre/lib/amd64/server:/usr/lib/jvm/java-6-sun-1.6.0.26/jre/lib/amd64:/usr/lib/jvm/java-6-sun-1.6.0.26/jre/../lib/amd64:/x1/jenkins/jenkins-slave/workspace/HBase-TRUNK/trunk/target/nativelib, MALLOC_ARENA_MAX=4}
[DEBUG] (s) excludes = [**/Test*.java, **/*$*, null]
[DEBUG] (s) forkMode = always
[DEBUG] (s) includes = [**/IntegrationTest*.java]
[DEBUG] (s) junitArtifactName = junit:junit
[DEBUG] (s) localRepository = id: local
url: file:///home/jenkins/.m2/repository/
layout: none
[DEBUG] (f) parallelMavenExecution = false
[DEBUG] (s) perCoreThreadCount = true
[DEBUG] (s) pluginArtifactMap = {org.apache.maven.plugins:maven-failsafe-plugin=org.apache.maven.plugins:maven-failsafe-plugin:maven-plugin:2.12-TRUNK-HBASE-2:, org.apache.maven.surefire:surefire-junit47=org.apache.maven.surefire:surefire-junit47:jar:2.12-TRUNK-HBASE-2:runtime, org.apache.maven.surefire:common-junit48=org.apache.maven.surefire:common-junit48:jar:2.12-TRUNK-HBASE-2:runtime, org.apache.maven.surefire:common-junit4=org.apache.maven.surefire:common-junit4:jar:2.12-TRUNK-HBASE-2:runtime, org.apache.maven.surefire:common-junit3=org.apache.maven.surefire:common-junit3:jar:2.12-TRUNK-HBASE-2:runtime, org.apache.maven.surefire:surefire-api=org.apache.maven.surefire:surefire-api:jar:2.12-TRUNK-HBASE-2:compile, org.apache.maven.surefire:surefire-booter=org.apache.maven.surefire:surefire-booter:jar:2.12-TRUNK-HBASE-2:compile, org.apache.maven.surefire:maven-surefire-common=org.apache.maven.surefire:maven-surefire-common:jar:2.12-TRUNK-HBASE-2:compile, org.apache.maven.shared:maven-common-artifact-filters=org.apache.maven.shared:maven-common-artifact-filters:jar:1.3:compile, org.codehaus.plexus:plexus-utils=org.codehaus.plexus:plexus-utils:jar:2.1:compile, org.apache.maven.reporting:maven-reporting-api=org.apache.maven.reporting:maven-reporting-api:jar:2.0.9:compile}
[DEBUG] (s) printSummary = true
[DEBUG] (s) project = MavenProject: org.apache.hbase:hbase:0.95-SNAPSHOT @ /x1/jenkins/jenkins-slave/workspace/HBase-TRUNK/trunk/pom.xml
[DEBUG] (s) projectArtifactMap = {com.google.guava:guava=com.google.guava:guava:jar:r09:compile, commons-cli:commons-cli=commons-cli:commons-cli:jar:1.2:compile, commons-configuration:commons-configuration=commons-configuration:commons-configuration:jar:1.6:compile, commons-collections:commons-collections=commons-collections:commons-collections:jar:3.2.1:compile, commons-digester:commons-digester=commons-digester:commons-digester:jar:1.8:compile, commons-beanutils:commons-beanutils=commons-beanutils:commons-beanutils:jar:1.7.0:compile, commons-beanutils:commons-beanutils-core=commons-beanutils:commons-beanutils-core:jar:1.8.0:compile, com.github.stephenc.high-scale-lib:high-scale-lib=com.github.stephenc.high-scale-lib:high-scale-lib:jar:1.1.1:compile, commons-codec:commons-codec=commons-codec:commons-codec:jar:1.4:compile, commons-httpclient:commons-httpclient=commons-httpclient:commons-httpclient:jar:3.1:compile, commons-io:commons-io=commons-io:commons-io:jar:2.1:compile, commons-lang:commons-lang=commons-lang:commons-lang:jar:2.5:compile, commons-logging:commons-logging=commons-logging:commons-logging:jar:1.1.1:compile, log4j:log4j=log4j:log4j:jar:1.2.16:compile, org.apache.avro:avro=org.apache.avro:avro:jar:1.5.3:compile, org.xerial.snappy:snappy-java=org.xerial.snappy:snappy-java:jar:1.0.3.2:compile, org.apache.avro:avro-ipc=org.apache.avro:avro-ipc:jar:1.5.3:compile, org.jboss.netty:netty=org.jboss.netty:netty:jar:3.2.4.Final:compile, org.apache.velocity:velocity=org.apache.velocity:velocity:jar:1.7:compile, org.apache.zookeeper:zookeeper=org.apache.zookeeper:zookeeper:jar:3.4.3:compile, org.apache.thrift:libthrift=org.apache.thrift:libthrift:jar:0.8.0:compile, org.apache.httpcomponents:httpclient=org.apache.httpcomponents:httpclient:jar:4.1.2:compile, org.apache.httpcomponents:httpcore=org.apache.httpcomponents:httpcore:jar:4.1.3:compile, org.jruby:jruby-complete=org.jruby:jruby-complete:jar:1.6.5:compile, org.mortbay.jetty:jetty=org.mortbay.jetty:jetty:jar:6.1.26:compile, org.mortbay.jetty:jetty-util=org.mortbay.jetty:jetty-util:jar:6.1.26:compile, org.mortbay.jetty:jsp-2.1=org.mortbay.jetty:jsp-2.1:jar:6.1.14:compile, org.eclipse.jdt:core=org.eclipse.jdt:core:jar:3.1.1:compile, org.mortbay.jetty:jsp-api-2.1=org.mortbay.jetty:jsp-api-2.1:jar:6.1.14:compile, org.mortbay.jetty:servlet-api-2.5=org.mortbay.jetty:servlet-api-2.5:jar:6.1.14:compile, org.codehaus.jackson:jackson-core-asl=org.codehaus.jackson:jackson-core-asl:jar:1.5.5:compile, org.codehaus.jackson:jackson-mapper-asl=org.codehaus.jackson:jackson-mapper-asl:jar:1.5.5:compile, org.codehaus.jackson:jackson-jaxrs=org.codehaus.jackson:jackson-jaxrs:jar:1.5.5:compile, org.codehaus.jackson:jackson-xc=org.codehaus.jackson:jackson-xc:jar:1.5.5:compile, org.slf4j:slf4j-api=org.slf4j:slf4j-api:jar:1.5.8:compile, org.slf4j:slf4j-log4j12=org.slf4j:slf4j-log4j12:jar:1.5.8:compile, tomcat:jasper-compiler=tomcat:jasper-compiler:jar:5.5.23:runtime, tomcat:jasper-runtime=tomcat:jasper-runtime:jar:5.5.23:runtime, commons-el:commons-el=commons-el:commons-el:jar:1.0:compile, org.jamon:jamon-runtime=org.jamon:jamon-runtime:jar:2.3.1:compile, com.google.protobuf:protobuf-java=com.google.protobuf:protobuf-java:jar:2.4.0a:compile, com.sun.jersey:jersey-core=com.sun.jersey:jersey-core:jar:1.4:compile, com.sun.jersey:jersey-json=com.sun.jersey:jersey-json:jar:1.4:compile, org.codehaus.jettison:jettison=org.codehaus.jettison:jettison:jar:1.1:compile, com.sun.xml.bind:jaxb-impl=com.sun.xml.bind:jaxb-impl:jar:2.1.12:compile, com.sun.jersey:jersey-server=com.sun.jersey:jersey-server:jar:1.4:compile, asm:asm=asm:asm:jar:3.1:compile, javax.xml.bind:jaxb-api=javax.xml.bind:jaxb-api:jar:2.1:compile, javax.activation:activation=javax.activation:activation:jar:1.1:compile, stax:stax-api=stax:stax-api:jar:1.0.1:compile, junit:junit=junit:junit:jar:4.10-HBASE-1:test, org.mockito:mockito-all=org.mockito:mockito-all:jar:1.8.5:test, org.apache.commons:commons-math=org.apache.commons:commons-math:jar:2.1:test, org.apache.hadoop:hadoop-core=org.apache.hadoop:hadoop-core:jar:1.0.0:compile, xmlenc:xmlenc=xmlenc:xmlenc:jar:0.52:compile, commons-net:commons-net=commons-net:commons-net:jar:1.4.1:compile, org.apache.hadoop:hadoop-test=org.apache.hadoop:hadoop-test:jar:1.0.0:test, org.apache.ftpserver:ftplet-api=org.apache.ftpserver:ftplet-api:jar:1.0.0:test, org.apache.mina:mina-core=org.apache.mina:mina-core:jar:2.0.0-M5:test, org.apache.ftpserver:ftpserver-core=org.apache.ftpserver:ftpserver-core:jar:1.0.0:test, org.apache.ftpserver:ftpserver-deprecated=org.apache.ftpserver:ftpserver-deprecated:jar:1.0.0-M2:test}
[DEBUG] (s) redirectTestOutputToFile = true
[DEBUG] (s) remoteRepositories = [ id: ghelmling.testing
url: http://people.apache.org/~garyh/mvn/
layout: default
snapshots: [enabled => true, update => daily]
releases: [enabled => true, update => daily]
, id: central
url: http://repo1.maven.org/maven2
layout: default
snapshots: [enabled => false, update => daily]
releases: [enabled => true, update => never]
]
[DEBUG] (s) reportFormat = brief
[DEBUG] (s) reportsDirectory = /x1/jenkins/jenkins-slave/workspace/HBase-TRUNK/trunk/target/failsafe-reports
[DEBUG] (s) runOrder = filesystem
[DEBUG] (s) session = org.apache.maven.execution.MavenSession@3c97db
[DEBUG] (s) skip = false
[DEBUG] (s) skipTests = false
[DEBUG] (s) summaryFile = /x1/jenkins/jenkins-slave/workspace/HBase-TRUNK/trunk/target/failsafe-reports/failsafe-summary.xml
[DEBUG] (s) testClassesDirectory = /x1/jenkins/jenkins-slave/workspace/HBase-TRUNK/trunk/target/test-classes
[DEBUG] (s) testNGArtifactName = org.testng:testng
[DEBUG] (s) testSourceDirectory = /x1/jenkins/jenkins-slave/workspace/HBase-TRUNK/trunk/src/test/java
[DEBUG] (s) trimStackTrace = true
[DEBUG] (s) useFile = true
[DEBUG] (s) useManifestOnlyJar = true
[DEBUG] (s) useSystemClassLoader = true
[DEBUG] (s) useUnlimitedThreads = false
[DEBUG] (s) workingDirectory = /x1/jenkins/jenkins-slave/workspace/HBase-TRUNK/trunk
[DEBUG] -- end configuration --
[INFO] Failsafe report directory: /x1/jenkins/jenkins-slave/workspace/HBase-TRUNK/trunk/target/failsafe-reports
[INFO] Using configured provider org.apache.maven.surefire.junitcore.JUnitCoreProvider
[DEBUG] dummy:dummy:jar:1.0 (selected for null)
[DEBUG] org.apache.maven.surefire:surefire-booter:jar:2.12-TRUNK-HBASE-2:compile (selected for compile)
[DEBUG] org.apache.maven.surefire:surefire-api:jar:2.12-TRUNK-HBASE-2:compile (selected for compile)
[DEBUG] Adding to failsafe booter test classpath: /home/jenkins/.m2/repository/org/apache/maven/surefire/surefire-booter/2.12-TRUNK-HBASE-2/surefire-booter-2.12-TRUNK-HBASE-2.jar Scope: compile
[DEBUG] Adding to failsafe booter test classpath: /home/jenkins/.m2/repository/org/apache/maven/surefire/surefire-api/2.12-TRUNK-HBASE-2/surefire-api-2.12-TRUNK-HBASE-2.jar Scope: compile
[DEBUG] Setting system property [user.dir]=[/x1/jenkins/jenkins-slave/workspace/HBase-TRUNK/trunk]
[DEBUG] Setting system property [localRepository]=[/home/jenkins/.m2/repository]
[DEBUG] Setting system property [basedir]=[/x1/jenkins/jenkins-slave/workspace/HBase-TRUNK/trunk]
[DEBUG] Setting system property [maven.test.redirectTestOutputToFile]=[true]
[DEBUG] Using JVM: /x1/jenkins/tools/java/jdk1.6.0_27-32/jre/bin/java
[DEBUG] Setting environment variable [DYLD_LIBRARY_PATH]=[${env.DYLD_LIBRARY_PATH}:/x1/jenkins/jenkins-slave/workspace/HBase-TRUNK/trunk/target/nativelib]
[DEBUG] Setting environment variable [LD_LIBRARY_PATH]=[/x1/jenkins/tools/java/jdk1.6.0_27-32/jre/lib/i386/server:/x1/jenkins/tools/java/jdk1.6.0_27-32/jre/lib/i386:/x1/jenkins/tools/java/jdk1.6.0_27-32/jre/../lib/i386:/usr/lib/jvm/java-6-sun-1.6.0.26/jre/lib/amd64/server:/usr/lib/jvm/java-6-sun-1.6.0.26/jre/lib/amd64:/usr/lib/jvm/java-6-sun-1.6.0.26/jre/../lib/amd64:/x1/jenkins/jenkins-slave/workspace/HBase-TRUNK/trunk/target/nativelib]
[DEBUG] Setting environment variable [MALLOC_ARENA_MAX]=[4]
[DEBUG] dummy:dummy:jar:1.0 (selected for null)
[DEBUG] org.apache.maven.surefire:surefire-junit47:jar:2.12-TRUNK-HBASE-2:test (selected for test)
[DEBUG] org.apache.maven.surefire:common-junit48:jar:2.12-TRUNK-HBASE-2:test (selected for test)
[DEBUG] org.apache.maven.surefire:common-junit4:jar:2.12-TRUNK-HBASE-2:test (selected for test)
[DEBUG] org.apache.maven.surefire:common-junit3:jar:2.12-TRUNK-HBASE-2:test (selected for test)
[DEBUG] org.apache.maven.surefire:surefire-api:jar:2.12-TRUNK-HBASE-2:test (selected for test)
[DEBUG] org.apache.maven.surefire:surefire-api:jar:2.12-TRUNK-HBASE-2:test (selected for test)
[DEBUG] org.apache.maven.surefire:surefire-api:jar:2.12-TRUNK-HBASE-2:test (selected for test)
[DEBUG] org.apache.maven.surefire:surefire-api:jar:2.12-TRUNK-HBASE-2:test (selected for test)
[DEBUG] Adding to failsafe test classpath: /home/jenkins/.m2/repository/org/apache/maven/surefire/surefire-junit47/2.12-TRUNK-HBASE-2/surefire-junit47-2.12-TRUNK-HBASE-2.jar Scope: test
[DEBUG] Adding to failsafe test classpath: /home/jenkins/.m2/repository/org/apache/maven/surefire/common-junit48/2.12-TRUNK-HBASE-2/common-junit48-2.12-TRUNK-HBASE-2.jar Scope: test
[DEBUG] Adding to failsafe test classpath: /home/jenkins/.m2/repository/org/apache/maven/surefire/common-junit4/2.12-TRUNK-HBASE-2/common-junit4-2.12-TRUNK-HBASE-2.jar Scope: test
[DEBUG] Adding to failsafe test classpath: /home/jenkins/.m2/repository/org/apache/maven/surefire/common-junit3/2.12-TRUNK-HBASE-2/common-junit3-2.12-TRUNK-HBASE-2.jar Scope: test
[DEBUG] Adding to failsafe test classpath: /home/jenkins/.m2/repository/org/apache/maven/surefire/surefire-api/2.12-TRUNK-HBASE-2/surefire-api-2.12-TRUNK-HBASE-2.jar Scope: test
[DEBUG] test classpath classpath:
[DEBUG] /x1/jenkins/jenkins-slave/workspace/HBase-TRUNK/trunk/target/test-classes
[DEBUG] /x1/jenkins/jenkins-slave/workspace/HBase-TRUNK/trunk/target/classes
[DEBUG] /home/jenkins/.m2/repository/com/google/guava/guava/r09/guava-r09.jar
[DEBUG] /home/jenkins/.m2/repository/commons-cli/commons-cli/1.2/commons-cli-1.2.jar
[DEBUG] /home/jenkins/.m2/repository/commons-configuration/commons-configuration/1.6/commons-configuration-1.6.jar
[DEBUG] /home/jenkins/.m2/repository/commons-collections/commons-collections/3.2.1/commons-collections-3.2.1.jar
[DEBUG] /home/jenkins/.m2/repository/commons-digester/commons-digester/1.8/commons-digester-1.8.jar
[DEBUG] /home/jenkins/.m2/repository/commons-beanutils/commons-beanutils/1.7.0/commons-beanutils-1.7.0.jar
[DEBUG] /home/jenkins/.m2/repository/commons-beanutils/commons-beanutils-core/1.8.0/commons-beanutils-core-1.8.0.jar
[DEBUG] /home/jenkins/.m2/repository/com/github/stephenc/high-scale-lib/high-scale-lib/1.1.1/high-scale-lib-1.1.1.jar
[DEBUG] /home/jenkins/.m2/repository/commons-codec/commons-codec/1.4/commons-codec-1.4.jar
[DEBUG] /home/jenkins/.m2/repository/commons-httpclient/commons-httpclient/3.1/commons-httpclient-3.1.jar
[DEBUG] /home/jenkins/.m2/repository/commons-io/commons-io/2.1/commons-io-2.1.jar
[DEBUG] /home/jenkins/.m2/repository/commons-lang/commons-lang/2.5/commons-lang-2.5.jar
[DEBUG] /home/jenkins/.m2/repository/commons-logging/commons-logging/1.1.1/commons-logging-1.1.1.jar
[DEBUG] /home/jenkins/.m2/repository/log4j/log4j/1.2.16/log4j-1.2.16.jar
[DEBUG] /home/jenkins/.m2/repository/org/apache/avro/avro/1.5.3/avro-1.5.3.jar
[DEBUG] /home/jenkins/.m2/repository/org/xerial/snappy/snappy-java/1.0.3.2/snappy-java-1.0.3.2.jar
[DEBUG] /home/jenkins/.m2/repository/org/apache/avro/avro-ipc/1.5.3/avro-ipc-1.5.3.jar
[DEBUG] /home/jenkins/.m2/repository/org/jboss/netty/netty/3.2.4.Final/netty-3.2.4.Final.jar
[DEBUG] /home/jenkins/.m2/repository/org/apache/velocity/velocity/1.7/velocity-1.7.jar
[DEBUG] /home/jenkins/.m2/repository/org/apache/zookeeper/zookeeper/3.4.3/zookeeper-3.4.3.jar
[DEBUG] /home/jenkins/.m2/repository/org/apache/thrift/libthrift/0.8.0/libthrift-0.8.0.jar
[DEBUG] /home/jenkins/.m2/repository/org/apache/httpcomponents/httpclient/4.1.2/httpclient-4.1.2.jar
[DEBUG] /home/jenkins/.m2/repository/org/apache/httpcomponents/httpcore/4.1.3/httpcore-4.1.3.jar
[DEBUG] /home/jenkins/.m2/repository/org/jruby/jruby-complete/1.6.5/jruby-complete-1.6.5.jar
[DEBUG] /home/jenkins/.m2/repository/org/mortbay/jetty/jetty/6.1.26/jetty-6.1.26.jar
[DEBUG] /home/jenkins/.m2/repository/org/mortbay/jetty/jetty-util/6.1.26/jetty-util-6.1.26.jar
[DEBUG] /home/jenkins/.m2/repository/org/mortbay/jetty/jsp-2.1/6.1.14/jsp-2.1-6.1.14.jar
[DEBUG] /home/jenkins/.m2/repository/org/eclipse/jdt/core/3.1.1/core-3.1.1.jar
[DEBUG] /home/jenkins/.m2/repository/org/mortbay/jetty/jsp-api-2.1/6.1.14/jsp-api-2.1-6.1.14.jar
[DEBUG] /home/jenkins/.m2/repository/org/mortbay/jetty/servlet-api-2.5/6.1.14/servlet-api-2.5-6.1.14.jar
[DEBUG] /home/jenkins/.m2/repository/org/codehaus/jackson/jackson-core-asl/1.5.5/jackson-core-asl-1.5.5.jar
[DEBUG] /home/jenkins/.m2/repository/org/codehaus/jackson/jackson-mapper-asl/1.5.5/jackson-mapper-asl-1.5.5.jar
[DEBUG] /home/jenkins/.m2/repository/org/codehaus/jackson/jackson-jaxrs/1.5.5/jackson-jaxrs-1.5.5.jar
[DEBUG] /home/jenkins/.m2/repository/org/codehaus/jackson/jackson-xc/1.5.5/jackson-xc-1.5.5.jar
[DEBUG] /home/jenkins/.m2/repository/org/slf4j/slf4j-api/1.5.8/slf4j-api-1.5.8.jar
[DEBUG] /home/jenkins/.m2/repository/org/slf4j/slf4j-log4j12/1.5.8/slf4j-log4j12-1.5.8.jar
[DEBUG] /home/jenkins/.m2/repository/tomcat/jasper-compiler/5.5.23/jasper-compiler-5.5.23.jar
[DEBUG] /home/jenkins/.m2/repository/tomcat/jasper-runtime/5.5.23/jasper-runtime-5.5.23.jar
[DEBUG] /home/jenkins/.m2/repository/commons-el/commons-el/1.0/commons-el-1.0.jar
[DEBUG] /home/jenkins/.m2/repository/org/jamon/jamon-runtime/2.3.1/jamon-runtime-2.3.1.jar
[DEBUG] /home/jenkins/.m2/repository/com/google/protobuf/protobuf-java/2.4.0a/protobuf-java-2.4.0a.jar
[DEBUG] /home/jenkins/.m2/repository/com/sun/jersey/jersey-core/1.4/jersey-core-1.4.jar
[DEBUG] /home/jenkins/.m2/repository/com/sun/jersey/jersey-json/1.4/jersey-json-1.4.jar
[DEBUG] /home/jenkins/.m2/repository/org/codehaus/jettison/jettison/1.1/jettison-1.1.jar
[DEBUG] /home/jenkins/.m2/repository/com/sun/xml/bind/jaxb-impl/2.1.12/jaxb-impl-2.1.12.jar
[DEBUG] /home/jenkins/.m2/repository/com/sun/jersey/jersey-server/1.4/jersey-server-1.4.jar
[DEBUG] /home/jenkins/.m2/repository/asm/asm/3.1/asm-3.1.jar
[DEBUG] /home/jenkins/.m2/repository/javax/xml/bind/jaxb-api/2.1/jaxb-api-2.1.jar
[DEBUG] /home/jenkins/.m2/repository/javax/activation/activation/1.1/activation-1.1.jar
[DEBUG] /home/jenkins/.m2/repository/stax/stax-api/1.0.1/stax-api-1.0.1.jar
[DEBUG] /home/jenkins/.m2/repository/junit/junit/4.10-HBASE-1/junit-4.10-HBASE-1.jar
[DEBUG] /home/jenkins/.m2/repository/org/mockito/mockito-all/1.8.5/mockito-all-1.8.5.jar
[DEBUG] /home/jenkins/.m2/repository/org/apache/commons/commons-math/2.1/commons-math-2.1.jar
[DEBUG] /home/jenkins/.m2/repository/org/apache/hadoop/hadoop-core/1.0.0/hadoop-core-1.0.0.jar
[DEBUG] /home/jenkins/.m2/repository/xmlenc/xmlenc/0.52/xmlenc-0.52.jar
[DEBUG] /home/jenkins/.m2/repository/commons-net/commons-net/1.4.1/commons-net-1.4.1.jar
[DEBUG] /home/jenkins/.m2/repository/org/apache/hadoop/hadoop-test/1.0.0/hadoop-test-1.0.0.jar
[DEBUG] /home/jenkins/.m2/repository/org/apache/ftpserver/ftplet-api/1.0.0/ftplet-api-1.0.0.jar
[DEBUG] /home/jenkins/.m2/repository/org/apache/mina/mina-core/2.0.0-M5/mina-core-2.0.0-M5.jar
[DEBUG] /home/jenkins/.m2/repository/org/apache/ftpserver/ftpserver-core/1.0.0/ftpserver-core-1.0.0.jar
[DEBUG] /home/jenkins/.m2/repository/org/apache/ftpserver/ftpserver-deprecated/1.0.0-M2/ftpserver-deprecated-1.0.0-M2.jar
[DEBUG] provider classpath classpath:
[DEBUG] /home/jenkins/.m2/repository/org/apache/maven/surefire/surefire-junit47/2.12-TRUNK-HBASE-2/surefire-junit47-2.12-TRUNK-HBASE-2.jar
[DEBUG] /home/jenkins/.m2/repository/org/apache/maven/surefire/common-junit48/2.12-TRUNK-HBASE-2/common-junit48-2.12-TRUNK-HBASE-2.jar
[DEBUG] /home/jenkins/.m2/repository/org/apache/maven/surefire/common-junit4/2.12-TRUNK-HBASE-2/common-junit4-2.12-TRUNK-HBASE-2.jar
[DEBUG] /home/jenkins/.m2/repository/org/apache/maven/surefire/common-junit3/2.12-TRUNK-HBASE-2/common-junit3-2.12-TRUNK-HBASE-2.jar
[DEBUG] /home/jenkins/.m2/repository/org/apache/maven/surefire/surefire-api/2.12-TRUNK-HBASE-2/surefire-api-2.12-TRUNK-HBASE-2.jar
-------------------------------------------------------
T E S T S
-------------------------------------------------------
-------------------------------------------------------
T E S T S
-------------------------------------------------------
Results :
Tests run: 0, Failures: 0, Errors: 0, Skipped: 0
[INFO] ------------------------------------------------------------------------
[INFO] BUILD FAILURE
[INFO] ------------------------------------------------------------------------
[INFO] Total time: 26:08.337s
[INFO] Finished at: Tue Apr 03 23:12:19 UTC 2012
[INFO] Final Memory: 50M/1168M
[INFO] ------------------------------------------------------------------------
[ERROR] Failed to execute goal org.apache.maven.plugins:maven-failsafe-plugin:2.12-TRUNK-HBASE-2:integration-test (integration-test) on project hbase: Execution integration-test of goal org.apache.maven.plugins:maven-failsafe-plugin:2.12-TRUNK-HBASE-2:integration-test failed: java.lang.reflect.InvocationTargetException; nested exception is java.lang.reflect.InvocationTargetException: null: NullPointerException -> [Help 1]
org.apache.maven.lifecycle.LifecycleExecutionException: Failed to execute goal org.apache.maven.plugins:maven-failsafe-plugin:2.12-TRUNK-HBASE-2:integration-test (integration-test) on project hbase: Execution integration-test of goal org.apache.maven.plugins:maven-failsafe-plugin:2.12-TRUNK-HBASE-2:integration-test failed: java.lang.reflect.InvocationTargetException; nested exception is java.lang.reflect.InvocationTargetException: null
at org.apache.maven.lifecycle.internal.MojoExecutor.execute(MojoExecutor.java:225)
at org.apache.maven.lifecycle.internal.MojoExecutor.execute(MojoExecutor.java:153)
at org.apache.maven.lifecycle.internal.MojoExecutor.execute(MojoExecutor.java:145)
at org.apache.maven.lifecycle.internal.LifecycleModuleBuilder.buildProject(LifecycleModuleBuilder.java:84)
at org.apache.maven.lifecycle.internal.LifecycleModuleBuilder.buildProject(LifecycleModuleBuilder.java:59)
at org.apache.maven.lifecycle.internal.LifecycleStarter.singleThreadedBuild(LifecycleStarter.java:183)
at org.apache.maven.lifecycle.internal.LifecycleStarter.execute(LifecycleStarter.java:161)
at org.apache.maven.DefaultMaven.doExecute(DefaultMaven.java:319)
at org.apache.maven.DefaultMaven.execute(DefaultMaven.java:156)
at org.apache.maven.cli.MavenCli.execute(MavenCli.java:537)
at org.apache.maven.cli.MavenCli.doMain(MavenCli.java:196)
at org.apache.maven.cli.MavenCli.main(MavenCli.java:141)
at sun.reflect.NativeMethodAccessorImpl.invoke0(Native Method)
at sun.reflect.NativeMethodAccessorImpl.invoke(NativeMethodAccessorImpl.java:39)
at sun.reflect.DelegatingMethodAccessorImpl.invoke(DelegatingMethodAccessorImpl.java:25)
at java.lang.reflect.Method.invoke(Method.java:597)
at org.codehaus.plexus.classworlds.launcher.Launcher.launchEnhanced(Launcher.java:290)
at org.codehaus.plexus.classworlds.launcher.Launcher.launch(Launcher.java:230)
at org.codehaus.plexus.classworlds.launcher.Launcher.mainWithExitCode(Launcher.java:409)
at org.codehaus.plexus.classworlds.launcher.Launcher.main(Launcher.java:352)
Caused by: org.apache.maven.plugin.PluginExecutionException: Execution integration-test of goal org.apache.maven.plugins:maven-failsafe-plugin:2.12-TRUNK-HBASE-2:integration-test failed: java.lang.reflect.InvocationTargetException; nested exception is java.lang.reflect.InvocationTargetException: null
at org.apache.maven.plugin.DefaultBuildPluginManager.executeMojo(DefaultBuildPluginManager.java:110)
at org.apache.maven.lifecycle.internal.MojoExecutor.execute(MojoExecutor.java:209)
... 19 more
Caused by: org.apache.maven.surefire.util.SurefireReflectionException: java.lang.reflect.InvocationTargetException; nested exception is java.lang.reflect.InvocationTargetException: null
at org.apache.maven.surefire.util.ReflectionUtils.invokeMethodWithArray(ReflectionUtils.java:196)
at org.apache.maven.surefire.util.ReflectionUtils.invokeGetter(ReflectionUtils.java:69)
at org.apache.maven.surefire.booter.ProviderFactory$ProviderProxy.getSuites(ProviderFactory.java:149)
at org.apache.maven.plugin.surefire.booterclient.ForkStarter.getSuitesIterator(ForkStarter.java:277)
at org.apache.maven.plugin.surefire.booterclient.ForkStarter.runSuitesForkPerTestSet(ForkStarter.java:133)
at org.apache.maven.plugin.surefire.booterclient.ForkStarter.run(ForkStarter.java:104)
at org.apache.maven.plugin.surefire.AbstractSurefireMojo.executeProvider(AbstractSurefireMojo.java:200)
at org.apache.maven.plugin.surefire.AbstractSurefireMojo.executeAllProviders(AbstractSurefireMojo.java:177)
at org.apache.maven.plugin.surefire.AbstractSurefireMojo.executeAfterPreconditionsChecked(AbstractSurefireMojo.java:135)
at org.apache.maven.plugin.surefire.AbstractSurefireMojo.execute(AbstractSurefireMojo.java:98)
at org.apache.maven.plugin.DefaultBuildPluginManager.executeMojo(DefaultBuildPluginManager.java:101)
... 20 more
Caused by: java.lang.reflect.InvocationTargetException
at sun.reflect.NativeMethodAccessorImpl.invoke0(Native Method)
at sun.reflect.NativeMethodAccessorImpl.invoke(NativeMethodAccessorImpl.java:39)
at sun.reflect.DelegatingMethodAccessorImpl.invoke(DelegatingMethodAccessorImpl.java:25)
at java.lang.reflect.Method.invoke(Method.java:597)
at org.apache.maven.surefire.util.ReflectionUtils.invokeMethodWithArray(ReflectionUtils.java:188)
... 30 more
Caused by: java.lang.NullPointerException
at org.apache.maven.surefire.util.DefaultDirectoryScanner.processIncludesExcludes(DefaultDirectoryScanner.java:136)
at org.apache.maven.surefire.util.DefaultDirectoryScanner.collectTests(DefaultDirectoryScanner.java:113)
at org.apache.maven.surefire.util.DefaultDirectoryScanner.locateTestClasses(DefaultDirectoryScanner.java:62)
at org.apache.maven.surefire.junitcore.JUnitCoreProvider.scanClassPath(JUnitCoreProvider.java:188)
at org.apache.maven.surefire.junitcore.JUnitCoreProvider.getSuitesAsList(JUnitCoreProvider.java:145)
at org.apache.maven.surefire.junitcore.JUnitCoreProvider.getSuites(JUnitCoreProvider.java:103)
... 35 more
[ERROR]
[ERROR]
[ERROR] For more information about the errors and possible solutions, please read the following articles:
[ERROR] [Help 1] http://cwiki.apache.org/confluence/display/MAVEN/PluginExecutionException
Build step 'Invoke top-level Maven targets' marked build as failure
Archiving artifacts
Updating HBASE-5606
Recording test results
Build failed in Jenkins: HBase-TRUNK #2706
Posted by Apache Jenkins Server <je...@builds.apache.org>.
See <https://builds.apache.org/job/HBase-TRUNK/2706/changes>
Changes:
[stack] HBASE-5451 Switch RPC call envelope/headers to PBs
[stack] HBASE-5701 Put RegionServerDynamicStatistics under RegionServer in MBean hierarchy rather than have it as a peer
[stack] HBASE-5704 HBASE-4398 mistakenly rolled back on trunk
[stack] HBASE-5688 Convert zk root-region-server znode content to pb; DELETE RLE... causing build to fail because of RAT warnings
[stack] HBase-5688 Convert zk root-region-server znode content to pb
[larsh] HBASE-3134 [replication] Add the ability to enable/disable streams (Teruyoshi Zenmyo)
------------------------------------------
[...truncated 13112 lines...]
[DEBUG] Excluded: org.apache.maven:maven-artifact-manager:jar:2.0.9
[DEBUG] Excluded: org.apache.maven:maven-plugin-registry:jar:2.0.9
[DEBUG] Excluded: org.codehaus.plexus:plexus-container-default:jar:1.0-alpha-9-stable-1
[DEBUG] Excluded: junit:junit:jar:3.8.1
[DEBUG] Excluded: org.apache.maven:maven-core:jar:2.0.9
[DEBUG] Excluded: org.apache.maven:maven-plugin-parameter-documenter:jar:2.0.9
[DEBUG] Excluded: org.apache.maven:maven-repository-metadata:jar:2.0.9
[DEBUG] Excluded: org.apache.maven:maven-error-diagnostics:jar:2.0.9
[DEBUG] Excluded: org.apache.maven:maven-plugin-descriptor:jar:2.0.9
[DEBUG] Excluded: org.apache.maven:maven-monitor:jar:2.0.9
[DEBUG] Excluded: classworlds:classworlds:jar:1.1
[DEBUG] Excluded: org.apache.maven:maven-toolchain:jar:2.0.9
[DEBUG] Configuring mojo org.apache.maven.plugins:maven-failsafe-plugin:2.12-TRUNK-HBASE-2:integration-test from plugin realm ClassRealm[plugin>org.apache.maven.plugins:maven-failsafe-plugin:2.12-TRUNK-HBASE-2, parent: sun.misc.Launcher$AppClassLoader@192d342]
[DEBUG] Configuring mojo 'org.apache.maven.plugins:maven-failsafe-plugin:2.12-TRUNK-HBASE-2:integration-test' with basic configurator -->
[DEBUG] (s) basedir = <https://builds.apache.org/job/HBase-TRUNK/ws/trunk>
[DEBUG] (s) childDelegation = false
[DEBUG] (s) classesDirectory = <https://builds.apache.org/job/HBase-TRUNK/ws/trunk/target/classes>
[DEBUG] (s) disableXmlReport = false
[DEBUG] (s) enableAssertions = true
[DEBUG] (s) environmentVariables = {DYLD_LIBRARY_PATH=${env.DYLD_LIBRARY_PATH}:<https://builds.apache.org/job/HBase-TRUNK/ws/trunk/target/nativelib,> LD_LIBRARY_PATH=/home/jenkins/tools/java/jdk1.6.0_27-32/jre/lib/i386/server:/home/jenkins/tools/java/jdk1.6.0_27-32/jre/lib/i386:/home/jenkins/tools/java/jdk1.6.0_27-32/jre/../lib/i386:/usr/lib/jvm/java-6-openjdk/jre/lib/amd64/server:/usr/lib/jvm/java-6-openjdk/jre/lib/amd64:/usr/lib/jvm/java-6-openjdk/jre/../lib/amd64:<https://builds.apache.org/job/HBase-TRUNK/ws/trunk/target/nativelib,> MALLOC_ARENA_MAX=4}
[DEBUG] (s) excludes = [**/Test*.java, **/*$*, null]
[DEBUG] (s) forkMode = always
[DEBUG] (s) includes = [**/IntegrationTest*.java]
[DEBUG] (s) junitArtifactName = junit:junit
[DEBUG] (s) localRepository = id: local
url: file:///home/jenkins/.m2/repository/
layout: none
[DEBUG] (f) parallelMavenExecution = false
[DEBUG] (s) perCoreThreadCount = true
[DEBUG] (s) pluginArtifactMap = {org.apache.maven.plugins:maven-failsafe-plugin=org.apache.maven.plugins:maven-failsafe-plugin:maven-plugin:2.12-TRUNK-HBASE-2:, org.apache.maven.surefire:surefire-junit47=org.apache.maven.surefire:surefire-junit47:jar:2.12-TRUNK-HBASE-2:runtime, org.apache.maven.surefire:common-junit48=org.apache.maven.surefire:common-junit48:jar:2.12-TRUNK-HBASE-2:runtime, org.apache.maven.surefire:common-junit4=org.apache.maven.surefire:common-junit4:jar:2.12-TRUNK-HBASE-2:runtime, org.apache.maven.surefire:common-junit3=org.apache.maven.surefire:common-junit3:jar:2.12-TRUNK-HBASE-2:runtime, org.apache.maven.surefire:surefire-api=org.apache.maven.surefire:surefire-api:jar:2.12-TRUNK-HBASE-2:compile, org.apache.maven.surefire:surefire-booter=org.apache.maven.surefire:surefire-booter:jar:2.12-TRUNK-HBASE-2:compile, org.apache.maven.surefire:maven-surefire-common=org.apache.maven.surefire:maven-surefire-common:jar:2.12-TRUNK-HBASE-2:compile, org.apache.maven.shared:maven-common-artifact-filters=org.apache.maven.shared:maven-common-artifact-filters:jar:1.3:compile, org.codehaus.plexus:plexus-utils=org.codehaus.plexus:plexus-utils:jar:2.1:compile, org.apache.maven.reporting:maven-reporting-api=org.apache.maven.reporting:maven-reporting-api:jar:2.0.9:compile}
[DEBUG] (s) printSummary = true
[DEBUG] (s) project = MavenProject: org.apache.hbase:hbase:0.95-SNAPSHOT @ <https://builds.apache.org/job/HBase-TRUNK/ws/trunk/pom.xml>
[DEBUG] (s) projectArtifactMap = {com.google.guava:guava=com.google.guava:guava:jar:r09:compile, commons-cli:commons-cli=commons-cli:commons-cli:jar:1.2:compile, commons-configuration:commons-configuration=commons-configuration:commons-configuration:jar:1.6:compile, commons-collections:commons-collections=commons-collections:commons-collections:jar:3.2.1:compile, commons-digester:commons-digester=commons-digester:commons-digester:jar:1.8:compile, commons-beanutils:commons-beanutils=commons-beanutils:commons-beanutils:jar:1.7.0:compile, commons-beanutils:commons-beanutils-core=commons-beanutils:commons-beanutils-core:jar:1.8.0:compile, com.github.stephenc.high-scale-lib:high-scale-lib=com.github.stephenc.high-scale-lib:high-scale-lib:jar:1.1.1:compile, commons-codec:commons-codec=commons-codec:commons-codec:jar:1.4:compile, commons-httpclient:commons-httpclient=commons-httpclient:commons-httpclient:jar:3.1:compile, commons-io:commons-io=commons-io:commons-io:jar:2.1:compile, commons-lang:commons-lang=commons-lang:commons-lang:jar:2.5:compile, commons-logging:commons-logging=commons-logging:commons-logging:jar:1.1.1:compile, log4j:log4j=log4j:log4j:jar:1.2.16:compile, org.apache.avro:avro=org.apache.avro:avro:jar:1.5.3:compile, org.xerial.snappy:snappy-java=org.xerial.snappy:snappy-java:jar:1.0.3.2:compile, org.apache.avro:avro-ipc=org.apache.avro:avro-ipc:jar:1.5.3:compile, org.jboss.netty:netty=org.jboss.netty:netty:jar:3.2.4.Final:compile, org.apache.velocity:velocity=org.apache.velocity:velocity:jar:1.7:compile, org.apache.zookeeper:zookeeper=org.apache.zookeeper:zookeeper:jar:3.4.3:compile, org.apache.thrift:libthrift=org.apache.thrift:libthrift:jar:0.8.0:compile, org.apache.httpcomponents:httpclient=org.apache.httpcomponents:httpclient:jar:4.1.2:compile, org.apache.httpcomponents:httpcore=org.apache.httpcomponents:httpcore:jar:4.1.3:compile, org.jruby:jruby-complete=org.jruby:jruby-complete:jar:1.6.5:compile, org.mortbay.jetty:jetty=org.mortbay.jetty:jetty:jar:6.1.26:compile, org.mortbay.jetty:jetty-util=org.mortbay.jetty:jetty-util:jar:6.1.26:compile, org.mortbay.jetty:jsp-2.1=org.mortbay.jetty:jsp-2.1:jar:6.1.14:compile, org.eclipse.jdt:core=org.eclipse.jdt:core:jar:3.1.1:compile, org.mortbay.jetty:jsp-api-2.1=org.mortbay.jetty:jsp-api-2.1:jar:6.1.14:compile, org.mortbay.jetty:servlet-api-2.5=org.mortbay.jetty:servlet-api-2.5:jar:6.1.14:compile, org.codehaus.jackson:jackson-core-asl=org.codehaus.jackson:jackson-core-asl:jar:1.5.5:compile, org.codehaus.jackson:jackson-mapper-asl=org.codehaus.jackson:jackson-mapper-asl:jar:1.5.5:compile, org.codehaus.jackson:jackson-jaxrs=org.codehaus.jackson:jackson-jaxrs:jar:1.5.5:compile, org.codehaus.jackson:jackson-xc=org.codehaus.jackson:jackson-xc:jar:1.5.5:compile, org.slf4j:slf4j-api=org.slf4j:slf4j-api:jar:1.5.8:compile, org.slf4j:slf4j-log4j12=org.slf4j:slf4j-log4j12:jar:1.5.8:compile, tomcat:jasper-compiler=tomcat:jasper-compiler:jar:5.5.23:runtime, tomcat:jasper-runtime=tomcat:jasper-runtime:jar:5.5.23:runtime, commons-el:commons-el=commons-el:commons-el:jar:1.0:compile, org.jamon:jamon-runtime=org.jamon:jamon-runtime:jar:2.3.1:compile, com.google.protobuf:protobuf-java=com.google.protobuf:protobuf-java:jar:2.4.0a:compile, com.sun.jersey:jersey-core=com.sun.jersey:jersey-core:jar:1.4:compile, com.sun.jersey:jersey-json=com.sun.jersey:jersey-json:jar:1.4:compile, org.codehaus.jettison:jettison=org.codehaus.jettison:jettison:jar:1.1:compile, com.sun.xml.bind:jaxb-impl=com.sun.xml.bind:jaxb-impl:jar:2.1.12:compile, com.sun.jersey:jersey-server=com.sun.jersey:jersey-server:jar:1.4:compile, asm:asm=asm:asm:jar:3.1:compile, javax.xml.bind:jaxb-api=javax.xml.bind:jaxb-api:jar:2.1:compile, javax.activation:activation=javax.activation:activation:jar:1.1:compile, stax:stax-api=stax:stax-api:jar:1.0.1:compile, junit:junit=junit:junit:jar:4.10-HBASE-1:test, org.mockito:mockito-all=org.mockito:mockito-all:jar:1.8.5:test, org.apache.commons:commons-math=org.apache.commons:commons-math:jar:2.1:test, org.apache.hadoop:hadoop-core=org.apache.hadoop:hadoop-core:jar:1.0.0:compile, xmlenc:xmlenc=xmlenc:xmlenc:jar:0.52:compile, commons-net:commons-net=commons-net:commons-net:jar:1.4.1:compile, org.apache.hadoop:hadoop-test=org.apache.hadoop:hadoop-test:jar:1.0.0:test, org.apache.ftpserver:ftplet-api=org.apache.ftpserver:ftplet-api:jar:1.0.0:test, org.apache.mina:mina-core=org.apache.mina:mina-core:jar:2.0.0-M5:test, org.apache.ftpserver:ftpserver-core=org.apache.ftpserver:ftpserver-core:jar:1.0.0:test, org.apache.ftpserver:ftpserver-deprecated=org.apache.ftpserver:ftpserver-deprecated:jar:1.0.0-M2:test}
[DEBUG] (s) redirectTestOutputToFile = true
[DEBUG] (s) remoteRepositories = [ id: ghelmling.testing
url: http://people.apache.org/~garyh/mvn/
layout: default
snapshots: [enabled => true, update => daily]
releases: [enabled => true, update => daily]
, id: central
url: http://repo1.maven.org/maven2
layout: default
snapshots: [enabled => false, update => daily]
releases: [enabled => true, update => never]
]
[DEBUG] (s) reportFormat = brief
[DEBUG] (s) reportsDirectory = <https://builds.apache.org/job/HBase-TRUNK/ws/trunk/target/failsafe-reports>
[DEBUG] (s) runOrder = filesystem
[DEBUG] (s) session = org.apache.maven.execution.MavenSession@3a0533
[DEBUG] (s) skip = false
[DEBUG] (s) skipTests = false
[DEBUG] (s) summaryFile = <https://builds.apache.org/job/HBase-TRUNK/ws/trunk/target/failsafe-reports/failsafe-summary.xml>
[DEBUG] (s) testClassesDirectory = <https://builds.apache.org/job/HBase-TRUNK/ws/trunk/target/test-classes>
[DEBUG] (s) testNGArtifactName = org.testng:testng
[DEBUG] (s) testSourceDirectory = <https://builds.apache.org/job/HBase-TRUNK/ws/trunk/src/test/java>
[DEBUG] (s) trimStackTrace = true
[DEBUG] (s) useFile = true
[DEBUG] (s) useManifestOnlyJar = true
[DEBUG] (s) useSystemClassLoader = true
[DEBUG] (s) useUnlimitedThreads = false
[DEBUG] (s) workingDirectory = <https://builds.apache.org/job/HBase-TRUNK/ws/trunk>
[DEBUG] -- end configuration --
[INFO] Failsafe report directory: <https://builds.apache.org/job/HBase-TRUNK/ws/trunk/target/failsafe-reports>
[INFO] Using configured provider org.apache.maven.surefire.junitcore.JUnitCoreProvider
[DEBUG] dummy:dummy:jar:1.0 (selected for null)
[DEBUG] org.apache.maven.surefire:surefire-booter:jar:2.12-TRUNK-HBASE-2:compile (selected for compile)
[DEBUG] org.apache.maven.surefire:surefire-api:jar:2.12-TRUNK-HBASE-2:compile (selected for compile)
[DEBUG] Adding to failsafe booter test classpath: /home/jenkins/.m2/repository/org/apache/maven/surefire/surefire-booter/2.12-TRUNK-HBASE-2/surefire-booter-2.12-TRUNK-HBASE-2.jar Scope: compile
[DEBUG] Adding to failsafe booter test classpath: /home/jenkins/.m2/repository/org/apache/maven/surefire/surefire-api/2.12-TRUNK-HBASE-2/surefire-api-2.12-TRUNK-HBASE-2.jar Scope: compile
[DEBUG] Setting system property [user.dir]=[<https://builds.apache.org/job/HBase-TRUNK/ws/trunk]>
[DEBUG] Setting system property [localRepository]=[/home/jenkins/.m2/repository]
[DEBUG] Setting system property [basedir]=[<https://builds.apache.org/job/HBase-TRUNK/ws/trunk]>
[DEBUG] Setting system property [maven.test.redirectTestOutputToFile]=[true]
[DEBUG] Using JVM: /home/jenkins/tools/java/jdk1.6.0_27-32/jre/bin/java
[DEBUG] Setting environment variable [DYLD_LIBRARY_PATH]=[${env.DYLD_LIBRARY_PATH}:<https://builds.apache.org/job/HBase-TRUNK/ws/trunk/target/nativelib]>
[DEBUG] Setting environment variable [LD_LIBRARY_PATH]=[/home/jenkins/tools/java/jdk1.6.0_27-32/jre/lib/i386/server:/home/jenkins/tools/java/jdk1.6.0_27-32/jre/lib/i386:/home/jenkins/tools/java/jdk1.6.0_27-32/jre/../lib/i386:/usr/lib/jvm/java-6-openjdk/jre/lib/amd64/server:/usr/lib/jvm/java-6-openjdk/jre/lib/amd64:/usr/lib/jvm/java-6-openjdk/jre/../lib/amd64:<https://builds.apache.org/job/HBase-TRUNK/ws/trunk/target/nativelib]>
[DEBUG] Setting environment variable [MALLOC_ARENA_MAX]=[4]
[DEBUG] dummy:dummy:jar:1.0 (selected for null)
[DEBUG] org.apache.maven.surefire:surefire-junit47:jar:2.12-TRUNK-HBASE-2:test (selected for test)
[DEBUG] org.apache.maven.surefire:common-junit48:jar:2.12-TRUNK-HBASE-2:test (selected for test)
[DEBUG] org.apache.maven.surefire:common-junit4:jar:2.12-TRUNK-HBASE-2:test (selected for test)
[DEBUG] org.apache.maven.surefire:common-junit3:jar:2.12-TRUNK-HBASE-2:test (selected for test)
[DEBUG] org.apache.maven.surefire:surefire-api:jar:2.12-TRUNK-HBASE-2:test (selected for test)
[DEBUG] org.apache.maven.surefire:surefire-api:jar:2.12-TRUNK-HBASE-2:test (selected for test)
[DEBUG] org.apache.maven.surefire:surefire-api:jar:2.12-TRUNK-HBASE-2:test (selected for test)
[DEBUG] org.apache.maven.surefire:surefire-api:jar:2.12-TRUNK-HBASE-2:test (selected for test)
[DEBUG] Adding to failsafe test classpath: /home/jenkins/.m2/repository/org/apache/maven/surefire/surefire-junit47/2.12-TRUNK-HBASE-2/surefire-junit47-2.12-TRUNK-HBASE-2.jar Scope: test
[DEBUG] Adding to failsafe test classpath: /home/jenkins/.m2/repository/org/apache/maven/surefire/common-junit48/2.12-TRUNK-HBASE-2/common-junit48-2.12-TRUNK-HBASE-2.jar Scope: test
[DEBUG] Adding to failsafe test classpath: /home/jenkins/.m2/repository/org/apache/maven/surefire/common-junit4/2.12-TRUNK-HBASE-2/common-junit4-2.12-TRUNK-HBASE-2.jar Scope: test
[DEBUG] Adding to failsafe test classpath: /home/jenkins/.m2/repository/org/apache/maven/surefire/common-junit3/2.12-TRUNK-HBASE-2/common-junit3-2.12-TRUNK-HBASE-2.jar Scope: test
[DEBUG] Adding to failsafe test classpath: /home/jenkins/.m2/repository/org/apache/maven/surefire/surefire-api/2.12-TRUNK-HBASE-2/surefire-api-2.12-TRUNK-HBASE-2.jar Scope: test
[DEBUG] test classpath classpath:
[DEBUG] <https://builds.apache.org/job/HBase-TRUNK/ws/trunk/target/test-classes>
[DEBUG] <https://builds.apache.org/job/HBase-TRUNK/ws/trunk/target/classes>
[DEBUG] /home/jenkins/.m2/repository/com/google/guava/guava/r09/guava-r09.jar
[DEBUG] /home/jenkins/.m2/repository/commons-cli/commons-cli/1.2/commons-cli-1.2.jar
[DEBUG] /home/jenkins/.m2/repository/commons-configuration/commons-configuration/1.6/commons-configuration-1.6.jar
[DEBUG] /home/jenkins/.m2/repository/commons-collections/commons-collections/3.2.1/commons-collections-3.2.1.jar
[DEBUG] /home/jenkins/.m2/repository/commons-digester/commons-digester/1.8/commons-digester-1.8.jar
[DEBUG] /home/jenkins/.m2/repository/commons-beanutils/commons-beanutils/1.7.0/commons-beanutils-1.7.0.jar
[DEBUG] /home/jenkins/.m2/repository/commons-beanutils/commons-beanutils-core/1.8.0/commons-beanutils-core-1.8.0.jar
[DEBUG] /home/jenkins/.m2/repository/com/github/stephenc/high-scale-lib/high-scale-lib/1.1.1/high-scale-lib-1.1.1.jar
[DEBUG] /home/jenkins/.m2/repository/commons-codec/commons-codec/1.4/commons-codec-1.4.jar
[DEBUG] /home/jenkins/.m2/repository/commons-httpclient/commons-httpclient/3.1/commons-httpclient-3.1.jar
[DEBUG] /home/jenkins/.m2/repository/commons-io/commons-io/2.1/commons-io-2.1.jar
[DEBUG] /home/jenkins/.m2/repository/commons-lang/commons-lang/2.5/commons-lang-2.5.jar
[DEBUG] /home/jenkins/.m2/repository/commons-logging/commons-logging/1.1.1/commons-logging-1.1.1.jar
[DEBUG] /home/jenkins/.m2/repository/log4j/log4j/1.2.16/log4j-1.2.16.jar
[DEBUG] /home/jenkins/.m2/repository/org/apache/avro/avro/1.5.3/avro-1.5.3.jar
[DEBUG] /home/jenkins/.m2/repository/org/xerial/snappy/snappy-java/1.0.3.2/snappy-java-1.0.3.2.jar
[DEBUG] /home/jenkins/.m2/repository/org/apache/avro/avro-ipc/1.5.3/avro-ipc-1.5.3.jar
[DEBUG] /home/jenkins/.m2/repository/org/jboss/netty/netty/3.2.4.Final/netty-3.2.4.Final.jar
[DEBUG] /home/jenkins/.m2/repository/org/apache/velocity/velocity/1.7/velocity-1.7.jar
[DEBUG] /home/jenkins/.m2/repository/org/apache/zookeeper/zookeeper/3.4.3/zookeeper-3.4.3.jar
[DEBUG] /home/jenkins/.m2/repository/org/apache/thrift/libthrift/0.8.0/libthrift-0.8.0.jar
[DEBUG] /home/jenkins/.m2/repository/org/apache/httpcomponents/httpclient/4.1.2/httpclient-4.1.2.jar
[DEBUG] /home/jenkins/.m2/repository/org/apache/httpcomponents/httpcore/4.1.3/httpcore-4.1.3.jar
[DEBUG] /home/jenkins/.m2/repository/org/jruby/jruby-complete/1.6.5/jruby-complete-1.6.5.jar
[DEBUG] /home/jenkins/.m2/repository/org/mortbay/jetty/jetty/6.1.26/jetty-6.1.26.jar
[DEBUG] /home/jenkins/.m2/repository/org/mortbay/jetty/jetty-util/6.1.26/jetty-util-6.1.26.jar
[DEBUG] /home/jenkins/.m2/repository/org/mortbay/jetty/jsp-2.1/6.1.14/jsp-2.1-6.1.14.jar
[DEBUG] /home/jenkins/.m2/repository/org/eclipse/jdt/core/3.1.1/core-3.1.1.jar
[DEBUG] /home/jenkins/.m2/repository/org/mortbay/jetty/jsp-api-2.1/6.1.14/jsp-api-2.1-6.1.14.jar
[DEBUG] /home/jenkins/.m2/repository/org/mortbay/jetty/servlet-api-2.5/6.1.14/servlet-api-2.5-6.1.14.jar
[DEBUG] /home/jenkins/.m2/repository/org/codehaus/jackson/jackson-core-asl/1.5.5/jackson-core-asl-1.5.5.jar
[DEBUG] /home/jenkins/.m2/repository/org/codehaus/jackson/jackson-mapper-asl/1.5.5/jackson-mapper-asl-1.5.5.jar
[DEBUG] /home/jenkins/.m2/repository/org/codehaus/jackson/jackson-jaxrs/1.5.5/jackson-jaxrs-1.5.5.jar
[DEBUG] /home/jenkins/.m2/repository/org/codehaus/jackson/jackson-xc/1.5.5/jackson-xc-1.5.5.jar
[DEBUG] /home/jenkins/.m2/repository/org/slf4j/slf4j-api/1.5.8/slf4j-api-1.5.8.jar
[DEBUG] /home/jenkins/.m2/repository/org/slf4j/slf4j-log4j12/1.5.8/slf4j-log4j12-1.5.8.jar
[DEBUG] /home/jenkins/.m2/repository/tomcat/jasper-compiler/5.5.23/jasper-compiler-5.5.23.jar
[DEBUG] /home/jenkins/.m2/repository/tomcat/jasper-runtime/5.5.23/jasper-runtime-5.5.23.jar
[DEBUG] /home/jenkins/.m2/repository/commons-el/commons-el/1.0/commons-el-1.0.jar
[DEBUG] /home/jenkins/.m2/repository/org/jamon/jamon-runtime/2.3.1/jamon-runtime-2.3.1.jar
[DEBUG] /home/jenkins/.m2/repository/com/google/protobuf/protobuf-java/2.4.0a/protobuf-java-2.4.0a.jar
[DEBUG] /home/jenkins/.m2/repository/com/sun/jersey/jersey-core/1.4/jersey-core-1.4.jar
[DEBUG] /home/jenkins/.m2/repository/com/sun/jersey/jersey-json/1.4/jersey-json-1.4.jar
[DEBUG] /home/jenkins/.m2/repository/org/codehaus/jettison/jettison/1.1/jettison-1.1.jar
[DEBUG] /home/jenkins/.m2/repository/com/sun/xml/bind/jaxb-impl/2.1.12/jaxb-impl-2.1.12.jar
[DEBUG] /home/jenkins/.m2/repository/com/sun/jersey/jersey-server/1.4/jersey-server-1.4.jar
[DEBUG] /home/jenkins/.m2/repository/asm/asm/3.1/asm-3.1.jar
[DEBUG] /home/jenkins/.m2/repository/javax/xml/bind/jaxb-api/2.1/jaxb-api-2.1.jar
[DEBUG] /home/jenkins/.m2/repository/javax/activation/activation/1.1/activation-1.1.jar
[DEBUG] /home/jenkins/.m2/repository/stax/stax-api/1.0.1/stax-api-1.0.1.jar
[DEBUG] /home/jenkins/.m2/repository/junit/junit/4.10-HBASE-1/junit-4.10-HBASE-1.jar
[DEBUG] /home/jenkins/.m2/repository/org/mockito/mockito-all/1.8.5/mockito-all-1.8.5.jar
[DEBUG] /home/jenkins/.m2/repository/org/apache/commons/commons-math/2.1/commons-math-2.1.jar
[DEBUG] /home/jenkins/.m2/repository/org/apache/hadoop/hadoop-core/1.0.0/hadoop-core-1.0.0.jar
[DEBUG] /home/jenkins/.m2/repository/xmlenc/xmlenc/0.52/xmlenc-0.52.jar
[DEBUG] /home/jenkins/.m2/repository/commons-net/commons-net/1.4.1/commons-net-1.4.1.jar
[DEBUG] /home/jenkins/.m2/repository/org/apache/hadoop/hadoop-test/1.0.0/hadoop-test-1.0.0.jar
[DEBUG] /home/jenkins/.m2/repository/org/apache/ftpserver/ftplet-api/1.0.0/ftplet-api-1.0.0.jar
[DEBUG] /home/jenkins/.m2/repository/org/apache/mina/mina-core/2.0.0-M5/mina-core-2.0.0-M5.jar
[DEBUG] /home/jenkins/.m2/repository/org/apache/ftpserver/ftpserver-core/1.0.0/ftpserver-core-1.0.0.jar
[DEBUG] /home/jenkins/.m2/repository/org/apache/ftpserver/ftpserver-deprecated/1.0.0-M2/ftpserver-deprecated-1.0.0-M2.jar
[DEBUG] provider classpath classpath:
[DEBUG] /home/jenkins/.m2/repository/org/apache/maven/surefire/surefire-junit47/2.12-TRUNK-HBASE-2/surefire-junit47-2.12-TRUNK-HBASE-2.jar
[DEBUG] /home/jenkins/.m2/repository/org/apache/maven/surefire/common-junit48/2.12-TRUNK-HBASE-2/common-junit48-2.12-TRUNK-HBASE-2.jar
[DEBUG] /home/jenkins/.m2/repository/org/apache/maven/surefire/common-junit4/2.12-TRUNK-HBASE-2/common-junit4-2.12-TRUNK-HBASE-2.jar
[DEBUG] /home/jenkins/.m2/repository/org/apache/maven/surefire/common-junit3/2.12-TRUNK-HBASE-2/common-junit3-2.12-TRUNK-HBASE-2.jar
[DEBUG] /home/jenkins/.m2/repository/org/apache/maven/surefire/surefire-api/2.12-TRUNK-HBASE-2/surefire-api-2.12-TRUNK-HBASE-2.jar
-------------------------------------------------------
T E S T S
-------------------------------------------------------
-------------------------------------------------------
T E S T S
-------------------------------------------------------
Results :
Tests run: 0, Failures: 0, Errors: 0, Skipped: 0
[INFO] ------------------------------------------------------------------------
[INFO] BUILD FAILURE
[INFO] ------------------------------------------------------------------------
[INFO] Total time: 26:57.065s
[INFO] Finished at: Tue Apr 03 21:06:24 UTC 2012
[INFO] Final Memory: 45M/1180M
[INFO] ------------------------------------------------------------------------
[ERROR] Failed to execute goal org.apache.maven.plugins:maven-failsafe-plugin:2.12-TRUNK-HBASE-2:integration-test (integration-test) on project hbase: Execution integration-test of goal org.apache.maven.plugins:maven-failsafe-plugin:2.12-TRUNK-HBASE-2:integration-test failed: java.lang.reflect.InvocationTargetException; nested exception is java.lang.reflect.InvocationTargetException: null: NullPointerException -> [Help 1]
org.apache.maven.lifecycle.LifecycleExecutionException: Failed to execute goal org.apache.maven.plugins:maven-failsafe-plugin:2.12-TRUNK-HBASE-2:integration-test (integration-test) on project hbase: Execution integration-test of goal org.apache.maven.plugins:maven-failsafe-plugin:2.12-TRUNK-HBASE-2:integration-test failed: java.lang.reflect.InvocationTargetException; nested exception is java.lang.reflect.InvocationTargetException: null
at org.apache.maven.lifecycle.internal.MojoExecutor.execute(MojoExecutor.java:225)
at org.apache.maven.lifecycle.internal.MojoExecutor.execute(MojoExecutor.java:153)
at org.apache.maven.lifecycle.internal.MojoExecutor.execute(MojoExecutor.java:145)
at org.apache.maven.lifecycle.internal.LifecycleModuleBuilder.buildProject(LifecycleModuleBuilder.java:84)
at org.apache.maven.lifecycle.internal.LifecycleModuleBuilder.buildProject(LifecycleModuleBuilder.java:59)
at org.apache.maven.lifecycle.internal.LifecycleStarter.singleThreadedBuild(LifecycleStarter.java:183)
at org.apache.maven.lifecycle.internal.LifecycleStarter.execute(LifecycleStarter.java:161)
at org.apache.maven.DefaultMaven.doExecute(DefaultMaven.java:319)
at org.apache.maven.DefaultMaven.execute(DefaultMaven.java:156)
at org.apache.maven.cli.MavenCli.execute(MavenCli.java:537)
at org.apache.maven.cli.MavenCli.doMain(MavenCli.java:196)
at org.apache.maven.cli.MavenCli.main(MavenCli.java:141)
at sun.reflect.NativeMethodAccessorImpl.invoke0(Native Method)
at sun.reflect.NativeMethodAccessorImpl.invoke(NativeMethodAccessorImpl.java:39)
at sun.reflect.DelegatingMethodAccessorImpl.invoke(DelegatingMethodAccessorImpl.java:25)
at java.lang.reflect.Method.invoke(Method.java:597)
at org.codehaus.plexus.classworlds.launcher.Launcher.launchEnhanced(Launcher.java:290)
at org.codehaus.plexus.classworlds.launcher.Launcher.launch(Launcher.java:230)
at org.codehaus.plexus.classworlds.launcher.Launcher.mainWithExitCode(Launcher.java:409)
at org.codehaus.plexus.classworlds.launcher.Launcher.main(Launcher.java:352)
Caused by: org.apache.maven.plugin.PluginExecutionException: Execution integration-test of goal org.apache.maven.plugins:maven-failsafe-plugin:2.12-TRUNK-HBASE-2:integration-test failed: java.lang.reflect.InvocationTargetException; nested exception is java.lang.reflect.InvocationTargetException: null
at org.apache.maven.plugin.DefaultBuildPluginManager.executeMojo(DefaultBuildPluginManager.java:110)
at org.apache.maven.lifecycle.internal.MojoExecutor.execute(MojoExecutor.java:209)
... 19 more
Caused by: org.apache.maven.surefire.util.SurefireReflectionException: java.lang.reflect.InvocationTargetException; nested exception is java.lang.reflect.InvocationTargetException: null
at org.apache.maven.surefire.util.ReflectionUtils.invokeMethodWithArray(ReflectionUtils.java:196)
at org.apache.maven.surefire.util.ReflectionUtils.invokeGetter(ReflectionUtils.java:69)
at org.apache.maven.surefire.booter.ProviderFactory$ProviderProxy.getSuites(ProviderFactory.java:149)
at org.apache.maven.plugin.surefire.booterclient.ForkStarter.getSuitesIterator(ForkStarter.java:277)
at org.apache.maven.plugin.surefire.booterclient.ForkStarter.runSuitesForkPerTestSet(ForkStarter.java:133)
at org.apache.maven.plugin.surefire.booterclient.ForkStarter.run(ForkStarter.java:104)
at org.apache.maven.plugin.surefire.AbstractSurefireMojo.executeProvider(AbstractSurefireMojo.java:200)
at org.apache.maven.plugin.surefire.AbstractSurefireMojo.executeAllProviders(AbstractSurefireMojo.java:177)
at org.apache.maven.plugin.surefire.AbstractSurefireMojo.executeAfterPreconditionsChecked(AbstractSurefireMojo.java:135)
at org.apache.maven.plugin.surefire.AbstractSurefireMojo.execute(AbstractSurefireMojo.java:98)
at org.apache.maven.plugin.DefaultBuildPluginManager.executeMojo(DefaultBuildPluginManager.java:101)
... 20 more
Caused by: java.lang.reflect.InvocationTargetException
at sun.reflect.NativeMethodAccessorImpl.invoke0(Native Method)
at sun.reflect.NativeMethodAccessorImpl.invoke(NativeMethodAccessorImpl.java:39)
at sun.reflect.DelegatingMethodAccessorImpl.invoke(DelegatingMethodAccessorImpl.java:25)
at java.lang.reflect.Method.invoke(Method.java:597)
at org.apache.maven.surefire.util.ReflectionUtils.invokeMethodWithArray(ReflectionUtils.java:188)
... 30 more
Caused by: java.lang.NullPointerException
at org.apache.maven.surefire.util.DefaultDirectoryScanner.processIncludesExcludes(DefaultDirectoryScanner.java:136)
at org.apache.maven.surefire.util.DefaultDirectoryScanner.collectTests(DefaultDirectoryScanner.java:113)
at org.apache.maven.surefire.util.DefaultDirectoryScanner.locateTestClasses(DefaultDirectoryScanner.java:62)
at org.apache.maven.surefire.junitcore.JUnitCoreProvider.scanClassPath(JUnitCoreProvider.java:188)
at org.apache.maven.surefire.junitcore.JUnitCoreProvider.getSuitesAsList(JUnitCoreProvider.java:145)
at org.apache.maven.surefire.junitcore.JUnitCoreProvider.getSuites(JUnitCoreProvider.java:103)
... 35 more
[ERROR]
[ERROR]
[ERROR] For more information about the errors and possible solutions, please read the following articles:
[ERROR] [Help 1] http://cwiki.apache.org/confluence/display/MAVEN/PluginExecutionException
Build step 'Invoke top-level Maven targets' marked build as failure
Archiving artifacts
Updating HBASE-3134
Updating HBASE-5688
Updating HBASE-5701
Updating HBASE-5704
Updating HBASE-5451
Updating HBASE-4398
Recording test results