You are viewing a plain text version of this content. The canonical link for it is here.
Posted to yarn-dev@hadoop.apache.org by Apache Jenkins Server <je...@builds.apache.org> on 2015/03/24 22:00:36 UTC

Failed: YARN-3394 PreCommit Build #7094

Jira: https://issues.apache.org/jira/browse/YARN-3394
Build: https://builds.apache.org/job/PreCommit-YARN-Build/7094/

###################################################################################
########################## LAST 60 LINES OF THE CONSOLE ###########################
[...truncated 3112 lines...]

{color:red}-1 overall{color}.  Here are the results of testing the latest attachment 
  http://issues.apache.org/jira/secure/attachment/12706931/YARN-3394.20150324-1.patch
  against trunk revision a16bfff.

    {color:green}+1 @author{color}.  The patch does not contain any @author tags.

    {color:red}-1 tests included{color}.  The patch doesn't appear to include any new or modified tests.
                        Please justify why no new tests are needed for this patch.
                        Also please list what manual steps were performed to verify this patch.

    {color:green}+1 javac{color}.  The applied patch does not increase the total number of javac compiler warnings.

    {color:green}+1 javadoc{color}.  There were no new javadoc warning messages.

    {color:green}+1 eclipse:eclipse{color}.  The patch built with eclipse:eclipse.

    {color:green}+1 findbugs{color}.  The patch does not introduce any new Findbugs (version 2.0.3) warnings.

    {color:green}+1 release audit{color}.  The applied patch does not increase the total number of release audit warnings.

    {color:green}+1 core tests{color}.  The patch passed unit tests in .

Test results: https://builds.apache.org/job/PreCommit-YARN-Build/7094//testReport/
Console output: https://builds.apache.org/job/PreCommit-YARN-Build/7094//console

This message is automatically generated.


======================================================================
======================================================================
    Adding comment to Jira.
======================================================================
======================================================================


Comment added.
8b7807a74ddae8197348031e3095261f0e6efdf2 logged out


======================================================================
======================================================================
    Finished build.
======================================================================
======================================================================


Build step 'Execute shell' marked build as failure
Archiving artifacts
Sending artifact delta relative to PreCommit-YARN-Build #7088
Archived 10 artifacts
Archive block size is 32768
Received 48 blocks and 7179974 bytes
Compression is 18.0%
Took 2.6 sec
[description-setter] Could not determine description.
Recording test results
Email was triggered for: Failure
Sending email for trigger: Failure



###################################################################################
############################## FAILED TESTS (if any) ##############################
No tests ran.

Success: YARN-3395 PreCommit Build #7096

Posted by Apache Jenkins Server <je...@builds.apache.org>.
Jira: https://issues.apache.org/jira/browse/YARN-3395
Build: https://builds.apache.org/job/PreCommit-YARN-Build/7096/

###################################################################################
########################## LAST 60 LINES OF THE CONSOLE ###########################
[...truncated 3437 lines...]




{color:green}+1 overall{color}.  Here are the results of testing the latest attachment 
  http://issues.apache.org/jira/secure/attachment/12707050/YARN-3395.000.patch
  against trunk revision 53a28af.

    {color:green}+1 @author{color}.  The patch does not contain any @author tags.

    {color:green}+1 tests included{color}.  The patch appears to include 1 new or modified test files.

    {color:green}+1 javac{color}.  The applied patch does not increase the total number of javac compiler warnings.

    {color:green}+1 javadoc{color}.  There were no new javadoc warning messages.

    {color:green}+1 eclipse:eclipse{color}.  The patch built with eclipse:eclipse.

    {color:green}+1 findbugs{color}.  The patch does not introduce any new Findbugs (version 2.0.3) warnings.

    {color:green}+1 release audit{color}.  The applied patch does not increase the total number of release audit warnings.

    {color:green}+1 core tests{color}.  The patch passed unit tests in hadoop-yarn-project/hadoop-yarn/hadoop-yarn-server/hadoop-yarn-server-resourcemanager.

Test results: https://builds.apache.org/job/PreCommit-YARN-Build/7096//testReport/
Console output: https://builds.apache.org/job/PreCommit-YARN-Build/7096//console

This message is automatically generated.


======================================================================
======================================================================
    Adding comment to Jira.
======================================================================
======================================================================


Comment added.
de1667acc5633cf593432e1667fe480d90473f01 logged out


======================================================================
======================================================================
    Finished build.
======================================================================
======================================================================


Archiving artifacts
Sending artifact delta relative to PreCommit-YARN-Build #7088
Archived 15 artifacts
Archive block size is 32768
Received 219 blocks and 1892118 bytes
Compression is 79.1%
Took 1.3 sec
Description set: YARN-3395
Recording test results
Email was triggered for: Success
Sending email for trigger: Success



###################################################################################
############################## FAILED TESTS (if any) ##############################
All tests passed

Failed: YARN-3365 PreCommit Build #7095

Posted by Apache Jenkins Server <je...@builds.apache.org>.
Jira: https://issues.apache.org/jira/browse/YARN-3365
Build: https://builds.apache.org/job/PreCommit-YARN-Build/7095/

###################################################################################
########################## LAST 60 LINES OF THE CONSOLE ###########################
[...truncated 23 lines...]

======================================================================
======================================================================
    Testing patch for YARN-3365.
======================================================================
======================================================================


HEAD is now at a16bfff HDFS-7854. Separate class DataStreamer out of DFSOutputStream. Contributed by Li Bo.
Previous HEAD position was a16bfff... HDFS-7854. Separate class DataStreamer out of DFSOutputStream. Contributed by Li Bo.
Switched to branch 'trunk'
Your branch is behind 'origin/trunk' by 47 commits, and can be fast-forwarded.
  (use "git pull" to update your local branch)
First, rewinding head to replay your work on top of it...
Fast-forwarded trunk to a16bfff71bd7f00e06e1f59bfe5445a154bb8c66.
YARN-3365 patch is being downloaded at Tue Mar 24 22:20:14 UTC 2015 from
http://issues.apache.org/jira/secure/attachment/12707006/YARN-3365.001.patch
cp: cannot stat '/home/jenkins/buildSupport/lib/*': No such file or directory
The patch does not appear to apply with p0 to p2
PATCH APPLICATION FAILED




{color:red}-1 overall{color}.  Here are the results of testing the latest attachment 
  http://issues.apache.org/jira/secure/attachment/12707006/YARN-3365.001.patch
  against trunk revision a16bfff.

    {color:red}-1 patch{color}.  The patch command could not apply the patch.

Console output: https://builds.apache.org/job/PreCommit-YARN-Build/7095//console

This message is automatically generated.


======================================================================
======================================================================
    Adding comment to Jira.
======================================================================
======================================================================


Comment added.
56de25b8f7027cdaab50be017c92e8dc28f492fc logged out


======================================================================
======================================================================
    Finished build.
======================================================================
======================================================================


Build step 'Execute shell' marked build as failure
Archiving artifacts
[description-setter] Could not determine description.
Recording test results
Email was triggered for: Failure
Sending email for trigger: Failure



###################################################################################
############################## FAILED TESTS (if any) ##############################
No tests ran.