You are viewing a plain text version of this content. The canonical link for it is here.
Posted to commits@jspwiki.apache.org by Apache Jenkins Server <je...@builds.apache.org> on 2014/04/23 04:03:49 UTC

Build failed in Jenkins: JSPWiki #294

See <https://builds.apache.org/job/JSPWiki/294/changes>

Changes:

[juanpablo] update version for selenium-*-driver

------------------------------------------
[...truncated 1482 lines...]
A         jspwiki-it-tests/jspwiki-selenium-tests/src/main/config/tomcatconf/tomcat-users.xml
A         jspwiki-it-tests/jspwiki-selenium-tests/src/main/config/hsql-userdb-setup.sql
A         jspwiki-it-tests/jspwiki-selenium-tests/src/main/resources
A         jspwiki-it-tests/jspwiki-selenium-tests/src/main/resources/jspwiki-custom.properties
A         jspwiki-it-tests/jspwiki-selenium-tests/src/test
A         jspwiki-it-tests/jspwiki-selenium-tests/src/test/resources
A         jspwiki-it-tests/jspwiki-selenium-tests/src/test/resources/groupdatabase.xml
A         jspwiki-it-tests/jspwiki-selenium-tests/src/test/resources/selenium
A         jspwiki-it-tests/jspwiki-selenium-tests/src/test/resources/selenium/AclJanneEdit.html
A         jspwiki-it-tests/jspwiki-selenium-tests/src/test/resources/selenium/AnonymousView.html
A         jspwiki-it-tests/jspwiki-selenium-tests/src/test/resources/selenium/DeletePageNonAdmin.html
A         jspwiki-it-tests/jspwiki-selenium-tests/src/test/resources/selenium/AnonymousViewImage.html
A         jspwiki-it-tests/jspwiki-selenium-tests/src/test/resources/selenium/RenameProfile.html
A         jspwiki-it-tests/jspwiki-selenium-tests/src/test/resources/selenium/ViewPageSource.html
A         jspwiki-it-tests/jspwiki-selenium-tests/src/test/resources/selenium/AnonymousCreateGroup.html
A         jspwiki-it-tests/jspwiki-selenium-tests/src/test/resources/selenium/TestSuite.html
A         jspwiki-it-tests/jspwiki-selenium-tests/src/test/resources/selenium/DeletePage.html
A         jspwiki-it-tests/jspwiki-selenium-tests/src/test/resources/selenium/CreatePage.html
A         jspwiki-it-tests/jspwiki-selenium-tests/src/test/resources/selenium/RenamePage.html
A         jspwiki-it-tests/jspwiki-selenium-tests/src/test/resources/selenium/CreateGroupFullName.html
A         jspwiki-it-tests/jspwiki-selenium-tests/src/test/resources/selenium/AclJanneEditAllView.html
A         jspwiki-it-tests/jspwiki-selenium-tests/src/test/resources/selenium/CreateGroupWikiName.html
A         jspwiki-it-tests/jspwiki-selenium-tests/src/test/resources/selenium/AssertedPermissions.html
A         jspwiki-it-tests/jspwiki-selenium-tests/src/test/resources/selenium/Login.html
A         jspwiki-it-tests/jspwiki-selenium-tests/src/test/resources/selenium/Logout.html
A         jspwiki-it-tests/jspwiki-selenium-tests/src/test/resources/selenium/CreateGroupLoginName.html
A         jspwiki-it-tests/jspwiki-selenium-tests/src/test/resources/selenium/AssertedName.html
A         jspwiki-it-tests/jspwiki-selenium-tests/src/test/resources/selenium/RedirectAfterLogin.html
A         jspwiki-it-tests/jspwiki-selenium-tests/src/test/resources/test-repo
A         jspwiki-it-tests/jspwiki-selenium-tests/src/test/resources/test-repo/RecentChanges.txt
A         jspwiki-it-tests/jspwiki-selenium-tests/src/test/resources/test-repo/About.txt
A         jspwiki-it-tests/jspwiki-selenium-tests/src/test/resources/test-repo/WikiEtiquette.txt
A         jspwiki-it-tests/jspwiki-selenium-tests/src/test/resources/test-repo/LeftMenu.txt
A         jspwiki-it-tests/jspwiki-selenium-tests/src/test/resources/test-repo/UndefinedPages.txt
A         jspwiki-it-tests/jspwiki-selenium-tests/src/test/resources/test-repo/UnusedPages.txt
A         jspwiki-it-tests/jspwiki-selenium-tests/src/test/resources/test-repo/Main.txt
A         jspwiki-it-tests/jspwiki-selenium-tests/src/test/resources/test-repo/PageIndex.txt
A         jspwiki-it-tests/jspwiki-selenium-tests/src/test/resources/userdatabase.xml
A         jspwiki-it-tests/jspwiki-selenium-tests/pom.xml
A         jspwiki-it-tests/jspwiki-it-test-cma
A         jspwiki-it-tests/jspwiki-it-test-cma/pom.xml
A         jspwiki-it-tests/jspwiki-it-test-cma/src
A         jspwiki-it-tests/jspwiki-it-test-cma/src/main
A         jspwiki-it-tests/jspwiki-it-test-cma/src/main/webapp
A         jspwiki-it-tests/jspwiki-it-test-cma/src/main/webapp/WEB-INF
A         jspwiki-it-tests/jspwiki-it-test-cma/src/main/webapp/WEB-INF/web.xml
A         jspwiki-it-tests/jspwiki-it-test-cma-jdbc
A         jspwiki-it-tests/jspwiki-it-test-cma-jdbc/pom.xml
A         jspwiki-it-tests/jspwiki-it-test-cma-jdbc/src
A         jspwiki-it-tests/jspwiki-it-test-cma-jdbc/src/main
A         jspwiki-it-tests/jspwiki-it-test-cma-jdbc/src/main/webapp
A         jspwiki-it-tests/jspwiki-it-test-cma-jdbc/src/main/webapp/WEB-INF
A         jspwiki-it-tests/jspwiki-it-test-cma-jdbc/src/main/webapp/WEB-INF/web.xml
A         pom.xml
A         KEYS
 U        .
At revision 1589330
[JSPWiki] $ /home/hudson/tools/maven/apache-maven-3.0.4/bin/mvn clean install
[INFO] Scanning for projects...
[WARNING] 
[WARNING] Some problems were encountered while building the effective model for org.apache.jspwiki.it:jspwiki-it-test-custom-jdbc:war:2.10.1-SNAPSHOT
[WARNING] 'build.plugins.plugin.version' for com.btmatthews.maven.plugins.inmemdb:inmemdb-maven-plugin is missing. @ line 46, column 17
[WARNING] 
[WARNING] Some problems were encountered while building the effective model for org.apache.jspwiki.it:jspwiki-it-test-cma-jdbc:war:2.10.1-SNAPSHOT
[WARNING] 'build.plugins.plugin.version' for com.btmatthews.maven.plugins.inmemdb:inmemdb-maven-plugin is missing. @ line 54, column 15
[WARNING] 
[WARNING] It is highly recommended to fix these problems because they threaten the stability of your build.
[WARNING] 
[WARNING] For this reason, future Maven versions might no longer support building such malformed projects.
[WARNING] 
[INFO] ------------------------------------------------------------------------
[INFO] Reactor Build Order:
[INFO] 
[INFO] Apache JSPWiki
[INFO] Apache JSPWiki Main War
[INFO] Apache JSPWiki initial wiki pages builder
[INFO] Apache JSPWiki initial wiki pages (de)
[INFO] Apache JSPWiki initial wiki pages (en)
[INFO] Apache JSPWiki initial wiki pages (es)
[INFO] Apache JSPWiki initial wiki pages (fi)
[INFO] Apache JSPWiki initial wiki pages (fr)
[INFO] Apache JSPWiki initial wiki pages (it)
[INFO] Apache JSPWiki initial wiki pages (nl)
[INFO] Apache JSPWiki initial wiki pages (pt_BR)
[INFO] Apache JSPWiki initial wiki pages (zh_CN)
[INFO] jspwiki-it-builder
[INFO] jspwiki-selenium-tests
[INFO] jspwiki-it-test-custom
[INFO] jspwiki-it-test-custom-absolute-urls
[INFO] jspwiki-it-test-custom-jdbc
[INFO] jspwiki-it-test-cma
[INFO] jspwiki-it-test-cma-jdbc
[INFO]                                                                         
[INFO] ------------------------------------------------------------------------
[INFO] Building Apache JSPWiki 2.10.1-SNAPSHOT
[INFO] ------------------------------------------------------------------------
[INFO] 
[INFO] --- maven-clean-plugin:2.5:clean (default-clean) @ jspwiki-builder ---
[INFO] 
[INFO] --- maven-enforcer-plugin:1.3.1:enforce (enforcer-validations) @ jspwiki-builder ---
[INFO] 
[INFO] --- maven-remote-resources-plugin:1.4:process (default) @ jspwiki-builder ---
[INFO] 
[INFO] --- maven-site-plugin:3.2:attach-descriptor (attach-descriptor) @ jspwiki-builder ---
[INFO] 
[INFO] --- maven-install-plugin:2.5.1:install (default-install) @ jspwiki-builder ---
[INFO] Installing <https://builds.apache.org/job/JSPWiki/ws/pom.xml> to /home/jenkins/.m2/repository/org/apache/jspwiki/jspwiki-builder/2.10.1-SNAPSHOT/jspwiki-builder-2.10.1-SNAPSHOT.pom
[INFO]                                                                         
[INFO] ------------------------------------------------------------------------
[INFO] Building Apache JSPWiki Main War 2.10.1-SNAPSHOT
[INFO] ------------------------------------------------------------------------
[INFO] 
[INFO] --- maven-clean-plugin:2.5:clean (default-clean) @ jspwiki-war ---
[INFO] 
[INFO] --- maven-enforcer-plugin:1.3.1:enforce (enforcer-validations) @ jspwiki-war ---
[INFO] 
[INFO] --- jslint-maven-plugin:1.0.1:jslint (checkJSPWikiFiles) @ jspwiki-war ---
[INFO] Parsing: mootools.js
[INFO] Parsing: fckconfig.js
[WARNING] mootools.js:3:58:Missing radix parameter.
[WARNING] mootools.js:3:127:Expected ';' and instead saw '}'.
[WARNING] mootools.js:3:186:Expected ';' and instead saw '}'.
[WARNING] mootools.js:3:213:Expected ';' and instead saw '}'.
[WARNING] mootools.js:3:241:Expected ';' and instead saw '}'.
[WARNING] mootools.js:3:246:Expected ';' and instead saw '}'.
[WARNING] mootools.js:3:247:Unexpected ';'.
[WARNING] mootools.js:3:318:Expected ';' and instead saw '}'.
[WARNING] mootools.js:3:328:Expected ';' and instead saw '}'.
[WARNING] mootools.js:3:330:Wrap an immediate function invocation in parentheses to assist the reader in understanding that the expression is the result of a function, and not the function itself.
[WARNING] mootools.js:3:1:eval is evil.
[WARNING] mootools.js:3:35759:Expected ';' and instead saw '(end)'.
[WARNING] fckconfig.js:46:1:'FCKConfig' has not been fully defined yet.
[WARNING] fckconfig.js:47:1:'FCKConfig' has not been fully defined yet.
[WARNING] fckconfig.js:49:1:'FCKConfig' has not been fully defined yet.
[WARNING] fckconfig.js:55:1:'FCKConfig' has not been fully defined yet.
[WARNING] fckconfig.js:58:1:'FCKConfig' has not been fully defined yet.
[WARNING] fckconfig.js:60:1:'FCKConfig' has not been fully defined yet.
[WARNING] fckconfig.js:61:1:'FCKConfig' has not been fully defined yet.
[WARNING] fckconfig.js:63:1:'FCKConfig' has not been fully defined yet.
[WARNING] fckconfig.js:63:22:'FCKConfig' has not been fully defined yet.
[WARNING] fckconfig.js:64:1:'FCKConfig' has not been fully defined yet.
[WARNING] fckconfig.js:65:1:'FCKConfig' has not been fully defined yet.
[WARNING] fckconfig.js:67:1:'FCKConfig' has not been fully defined yet.
[WARNING] fckconfig.js:67:29:'FCKConfig' has not been fully defined yet.
[WARNING] fckconfig.js:67:78:'FCKConfig' has not been fully defined yet.
[WARNING] fckconfig.js:69:1:'FCKConfig' has not been fully defined yet.
[WARNING] fckconfig.js:69:25:'FCKConfig' has not been fully defined yet.
[WARNING] fckconfig.js:73:1:'FCKConfig' has not been fully defined yet.
[WARNING] fckconfig.js:79:1:'FCKConfig' has not been fully defined yet.
[WARNING] fckconfig.js:80:1:'FCKConfig' has not been fully defined yet.
[WARNING] fckconfig.js:81:1:'FCKConfig' has not been fully defined yet.
[WARNING] fckconfig.js:83:1:'FCKConfig' has not been fully defined yet.
[WARNING] fckconfig.js:84:1:'FCKConfig' has not been fully defined yet.
[WARNING] fckconfig.js:85:1:'FCKConfig' has not been fully defined yet.
[WARNING] fckconfig.js:87:1:'FCKConfig' has not been fully defined yet.
[WARNING] fckconfig.js:89:1:'FCKConfig' has not been fully defined yet.
[WARNING] fckconfig.js:92:1:'FCKConfig' has not been fully defined yet.
[WARNING] fckconfig.js:96:1:'FCKConfig' has not been fully defined yet.
[WARNING] fckconfig.js:97:1:'FCKConfig' has not been fully defined yet.
[WARNING] fckconfig.js:98:1:'FCKConfig' has not been fully defined yet.
[WARNING] fckconfig.js:102:1:'FCKConfig' has not been fully defined yet.
[WARNING] fckconfig.js:104:1:'FCKConfig' has not been fully defined yet.
[WARNING] fckconfig.js:105:1:'FCKConfig' has not been fully defined yet.
[WARNING] fckconfig.js:106:1:'FCKConfig' has not been fully defined yet.
[WARNING] fckconfig.js:107:1:'FCKConfig' has not been fully defined yet.
[WARNING] fckconfig.js:108:1:'FCKConfig' has not been fully defined yet.
[WARNING] fckconfig.js:109:1:'FCKConfig' has not been fully defined yet.
[WARNING] fckconfig.js:110:1:'FCKConfig' has not been fully defined yet.
[WARNING] fckconfig.js:111:1:'FCKConfig' has not been fully defined yet.
[WARNING] fckconfig.js:112:1:'FCKConfig' has not been fully defined yet.
[WARNING] fckconfig.js:113:1:'FCKConfig' has not been fully defined yet.
[WARNING] fckconfig.js:114:1:'FCKConfig' has not been fully defined yet.
[WARNING] fckconfig.js:115:1:'FCKConfig' has not been fully defined yet.
[WARNING] fckconfig.js:120:1:'FCKConfig' has not been fully defined yet.
[WARNING] fckconfig.js:122:1:'FCKConfig' has not been fully defined yet.
[WARNING] fckconfig.js:126:1:'FCKConfig' has not been fully defined yet.
[WARNING] fckconfig.js:128:1:'FCKConfig' has not been fully defined yet.
[WARNING] fckconfig.js:128:23:['Default'] is better written in dot notation.
[WARNING] fckconfig.js:157:1:'FCKConfig' has not been fully defined yet.
[WARNING] fckconfig.js:157:23:['Basic'] is better written in dot notation.
[WARNING] fckconfig.js:161:1:'FCKConfig' has not been fully defined yet.
[WARNING] fckconfig.js:161:1:Too many errors. (40% scanned).
[INFO] 
[INFO] --- jslint-maven-plugin:1.0.1:jslint (checkThirdParty) @ jspwiki-war ---
[INFO] 
[INFO] --- maven-remote-resources-plugin:1.4:process (default) @ jspwiki-war ---
[INFO] 
[INFO] --- maven-dependency-plugin:2.1:unpack (unpack-wikipages-private) @ jspwiki-war ---
[INFO] Configured Artifact: org.apache.jspwiki.wikipages:jspwiki-wikipages-en:2.10.1-SNAPSHOT:jar
Downloading: http://repository.apache.org/snapshots/org/apache/jspwiki/wikipages/jspwiki-wikipages-en/2.10.1-SNAPSHOT/maven-metadata.xml

Downloading: http://repository.apache.org/snapshots/org/apache/jspwiki/wikipages/jspwiki-wikipages-en/2.10.1-SNAPSHOT/jspwiki-wikipages-en-2.10.1-SNAPSHOT.jar

[INFO] ------------------------------------------------------------------------
[INFO] Reactor Summary:
[INFO] 
[INFO] Apache JSPWiki .................................... SUCCESS [2.645s]
[INFO] Apache JSPWiki Main War ........................... FAILURE [6.340s]
[INFO] Apache JSPWiki initial wiki pages builder ......... SKIPPED
[INFO] Apache JSPWiki initial wiki pages (de) ............ SKIPPED
[INFO] Apache JSPWiki initial wiki pages (en) ............ SKIPPED
[INFO] Apache JSPWiki initial wiki pages (es) ............ SKIPPED
[INFO] Apache JSPWiki initial wiki pages (fi) ............ SKIPPED
[INFO] Apache JSPWiki initial wiki pages (fr) ............ SKIPPED
[INFO] Apache JSPWiki initial wiki pages (it) ............ SKIPPED
[INFO] Apache JSPWiki initial wiki pages (nl) ............ SKIPPED
[INFO] Apache JSPWiki initial wiki pages (pt_BR) ......... SKIPPED
[INFO] Apache JSPWiki initial wiki pages (zh_CN) ......... SKIPPED
[INFO] jspwiki-it-builder ................................ SKIPPED
[INFO] jspwiki-selenium-tests ............................ SKIPPED
[INFO] jspwiki-it-test-custom ............................ SKIPPED
[INFO] jspwiki-it-test-custom-absolute-urls .............. SKIPPED
[INFO] jspwiki-it-test-custom-jdbc ....................... SKIPPED
[INFO] jspwiki-it-test-cma ............................... SKIPPED
[INFO] jspwiki-it-test-cma-jdbc .......................... SKIPPED
[INFO] ------------------------------------------------------------------------
[INFO] BUILD FAILURE
[INFO] ------------------------------------------------------------------------
[INFO] Total time: 9.592s
[INFO] Finished at: Wed Apr 23 02:03:49 UTC 2014
[INFO] Final Memory: 22M/348M
[INFO] ------------------------------------------------------------------------
[ERROR] Failed to execute goal org.apache.maven.plugins:maven-dependency-plugin:2.1:unpack (unpack-wikipages-private) on project jspwiki-war: Unable to find artifact. Could not find artifact org.apache.jspwiki.wikipages:jspwiki-wikipages-en:jar:2.10.1-SNAPSHOT in Nexus (http://repository.apache.org/snapshots)
[ERROR] 
[ERROR] Try downloading the file manually from the project website.
[ERROR] 
[ERROR] Then, install it using the command:
[ERROR] mvn install:install-file -DgroupId=org.apache.jspwiki.wikipages -DartifactId=jspwiki-wikipages-en -Dversion=2.10.1-SNAPSHOT -Dpackaging=jar -Dfile=/path/to/file
[ERROR] 
[ERROR] Alternatively, if you host your own repository you can deploy the file there:
[ERROR] mvn deploy:deploy-file -DgroupId=org.apache.jspwiki.wikipages -DartifactId=jspwiki-wikipages-en -Dversion=2.10.1-SNAPSHOT -Dpackaging=jar -Dfile=/path/to/file -Durl=[url] -DrepositoryId=[id]
[ERROR] 
[ERROR] 
[ERROR] org.apache.jspwiki.wikipages:jspwiki-wikipages-en:jar:2.10.1-SNAPSHOT
[ERROR] 
[ERROR] from the specified remote repositories:
[ERROR] Nexus (http://repository.apache.org/snapshots, releases=false, snapshots=true),
[ERROR] central (http://repo.maven.apache.org/maven2, releases=true, snapshots=false)
[ERROR] -> [Help 1]
[ERROR] 
[ERROR] To see the full stack trace of the errors, re-run Maven with the -e switch.
[ERROR] Re-run Maven using the -X switch to enable full debug logging.
[ERROR] 
[ERROR] For more information about the errors and possible solutions, please read the following articles:
[ERROR] [Help 1] http://cwiki.apache.org/confluence/display/MAVEN/MojoExecutionException
[ERROR] 
[ERROR] After correcting the problems, you can resume the build with the command
[ERROR]   mvn <goals> -rf :jspwiki-war
Build step 'Invoke top-level Maven targets' marked build as failure

Jenkins build is back to normal : JSPWiki #295

Posted by Apache Jenkins Server <je...@builds.apache.org>.
See <https://builds.apache.org/job/JSPWiki/295/changes>