You are viewing a plain text version of this content. The canonical link for it is here.
Posted to issues@tez.apache.org by Apache Jenkins Server <je...@builds.apache.org> on 2016/02/26 18:53:44 UTC

Failed: TEZ-3115 PreCommit Build #1520

Jira: https://issues.apache.org/jira/browse/TEZ-3115
Build: https://builds.apache.org/job/PreCommit-TEZ-Build/1520/

###################################################################################
########################## LAST 60 LINES OF THE CONSOLE ###########################
[...truncated 4552 lines...]
[INFO] Total time: 01:01 h
[INFO] Finished at: 2016-02-26T17:53:41+00:00
[INFO] Final Memory: 64M/1060M
[INFO] ------------------------------------------------------------------------




{color:red}-1 overall{color}.  Here are the results of testing the latest attachment
  http://issues.apache.org/jira/secure/attachment/12790149/TEZ-3115.2.patch
  against master revision 923f7b4.

    {color:green}+1 @author{color}.  The patch does not contain any @author tags.

    {color:green}+1 tests included{color}.  The patch appears to include 1 new or modified test files.

      {color:red}-1 javac{color}.  The applied patch generated 31 javac compiler warnings (more than the master's current 30 warnings).

    {color:green}+1 javadoc{color}.  There were no new javadoc warning messages.

    {color:red}-1 findbugs{color}.  The patch appears to introduce 2 new Findbugs (version 3.0.1) warnings.

    {color:green}+1 release audit{color}.  The applied patch does not increase the total number of release audit warnings.

    {color:green}+1 core tests{color}.  The patch passed unit tests in .

Test results: https://builds.apache.org/job/PreCommit-TEZ-Build/1520//testReport/
Findbugs warnings: https://builds.apache.org/job/PreCommit-TEZ-Build/1520//artifact/patchprocess/newPatchFindbugsWarningstez-api.html
Findbugs warnings: https://builds.apache.org/job/PreCommit-TEZ-Build/1520//artifact/patchprocess/newPatchFindbugsWarningstez-runtime-library.html
Javac warnings: https://builds.apache.org/job/PreCommit-TEZ-Build/1520//artifact/patchprocess/diffJavacWarnings.txt
Console output: https://builds.apache.org/job/PreCommit-TEZ-Build/1520//console

This message is automatically generated.


======================================================================
======================================================================
    Adding comment to Jira.
======================================================================
======================================================================


Comment added.
d89094d8ce7093432d3a9b05956beb3259b487ba logged out


======================================================================
======================================================================
    Finished build.
======================================================================
======================================================================


Build step 'Execute shell' marked build as failure
Archiving artifacts
[description-setter] Could not determine description.
Recording test results
Email was triggered for: Failure - Any
Sending email for trigger: Failure - Any



###################################################################################
############################## FAILED TESTS (if any) ##############################
All tests passed

Success: TEZ-3147 PreCommit Build #1523

Posted by Apache Jenkins Server <je...@builds.apache.org>.
Jira: https://issues.apache.org/jira/browse/TEZ-3147
Build: https://builds.apache.org/job/PreCommit-TEZ-Build/1523/

###################################################################################
########################## LAST 60 LINES OF THE CONSOLE ###########################
[...truncated 4557 lines...]
[INFO] Tez ............................................... SUCCESS [  0.025 s]
[INFO] ------------------------------------------------------------------------
[INFO] BUILD SUCCESS
[INFO] ------------------------------------------------------------------------
[INFO] Total time: 55:46 min
[INFO] Finished at: 2016-02-27T03:49:43+00:00
[INFO] Final Memory: 69M/858M
[INFO] ------------------------------------------------------------------------




{color:green}+1 overall{color}.  Here are the results of testing the latest attachment
  http://issues.apache.org/jira/secure/attachment/12790275/TEZ-3147.1.patch
  against master revision 12695f3.

    {color:green}+1 @author{color}.  The patch does not contain any @author tags.

    {color:green}+1 tests included{color}.  The patch appears to include 1 new or modified test files.

    {color:green}+1 javac{color}.  The applied patch does not increase the total number of javac compiler warnings.

    {color:green}+1 javadoc{color}.  There were no new javadoc warning messages.

    {color:green}+1 findbugs{color}.  The patch does not introduce any new Findbugs (version 3.0.1) warnings.

    {color:green}+1 release audit{color}.  The applied patch does not increase the total number of release audit warnings.

    {color:green}+1 core tests{color}.  The patch passed unit tests in .

Test results: https://builds.apache.org/job/PreCommit-TEZ-Build/1523//testReport/
Console output: https://builds.apache.org/job/PreCommit-TEZ-Build/1523//console

This message is automatically generated.


======================================================================
======================================================================
    Adding comment to Jira.
======================================================================
======================================================================


Comment added.
0c89c2db7947c4b98c0672a5a106386c24a33f10 logged out


======================================================================
======================================================================
    Finished build.
======================================================================
======================================================================


Archiving artifacts
[description-setter] Description set: TEZ-3147
Recording test results
Email was triggered for: Success
Sending email for trigger: Success



###################################################################################
############################## FAILED TESTS (if any) ##############################
All tests passed

Failed: TEZ-3143 PreCommit Build #1522

Posted by Apache Jenkins Server <je...@builds.apache.org>.
Jira: https://issues.apache.org/jira/browse/TEZ-3143
Build: https://builds.apache.org/job/PreCommit-TEZ-Build/1522/

###################################################################################
########################## LAST 60 LINES OF THE CONSOLE ###########################
[...truncated 4560 lines...]
[INFO] Total time: 58:12 min
[INFO] Finished at: 2016-02-26T22:15:04+00:00
[INFO] Final Memory: 65M/878M
[INFO] ------------------------------------------------------------------------




{color:red}-1 overall{color}.  Here are the results of testing the latest attachment
  http://issues.apache.org/jira/secure/attachment/12790194/TEZ-3143.1.patch
  against master revision 980385a.

    {color:green}+1 @author{color}.  The patch does not contain any @author tags.

    {color:red}-1 tests included{color}.  The patch doesn't appear to include any new or modified tests.
                        Please justify why no new tests are needed for this patch.
                        Also please list what manual steps were performed to verify this patch.

    {color:green}+1 javac{color}.  The applied patch does not increase the total number of javac compiler warnings.

    {color:green}+1 javadoc{color}.  There were no new javadoc warning messages.

    {color:red}-1 findbugs{color}.  The patch appears to introduce 1 new Findbugs (version 3.0.1) warnings.

    {color:green}+1 release audit{color}.  The applied patch does not increase the total number of release audit warnings.

    {color:green}+1 core tests{color}.  The patch passed unit tests in .

Test results: https://builds.apache.org/job/PreCommit-TEZ-Build/1522//testReport/
Findbugs warnings: https://builds.apache.org/job/PreCommit-TEZ-Build/1522//artifact/patchprocess/newPatchFindbugsWarningstez-runtime-library.html
Console output: https://builds.apache.org/job/PreCommit-TEZ-Build/1522//console

This message is automatically generated.


======================================================================
======================================================================
    Adding comment to Jira.
======================================================================
======================================================================


Comment added.
eb3d2424f5414cae2ec56b4b72694114380e9e43 logged out


======================================================================
======================================================================
    Finished build.
======================================================================
======================================================================


Build step 'Execute shell' marked build as failure
Archiving artifacts
[description-setter] Could not determine description.
Recording test results
Email was triggered for: Failure - Any
Sending email for trigger: Failure - Any



###################################################################################
############################## FAILED TESTS (if any) ##############################
All tests passed

Failed: TEZ-3077 PreCommit Build #1521

Posted by Apache Jenkins Server <je...@builds.apache.org>.
Jira: https://issues.apache.org/jira/browse/TEZ-3077
Build: https://builds.apache.org/job/PreCommit-TEZ-Build/1521/

###################################################################################
########################## LAST 60 LINES OF THE CONSOLE ###########################
[...truncated 1767 lines...]

  Running tests 
  /home/jenkins/tools/maven/latest/bin/mvn clean install -fn -DTezPatchProcess
cat: /home/jenkins/jenkins-slave/workspace/PreCommit-TEZ-Build@2/../patchprocess/testrun.txt: No such file or directory
awk: cannot open /home/jenkins/jenkins-slave/workspace/PreCommit-TEZ-Build@2/../patchprocess/testrun.txt (No such file or directory)




{color:red}-1 overall{color}.  Here are the results of testing the latest attachment
  http://issues.apache.org/jira/secure/attachment/12790007/TEZ-3077.001.patch
  against master revision 923f7b4.

    {color:green}+1 @author{color}.  The patch does not contain any @author tags.

    {color:green}+1 tests included{color}.  The patch appears to include 1 new or modified test files.

    {color:green}+1 javac{color}.  The applied patch does not increase the total number of javac compiler warnings.

    {color:green}+1 javadoc{color}.  There were no new javadoc warning messages.

    {color:red}-1 findbugs{color}.  The patch appears to introduce 2 new Findbugs (version 3.0.1) warnings.

    {color:green}+1 release audit{color}.  The applied patch does not increase the total number of release audit warnings.

    {color:green}+1 core tests{color}.  The patch passed unit tests in .

Test results: https://builds.apache.org/job/PreCommit-TEZ-Build/1521//testReport/
Findbugs warnings: https://builds.apache.org/job/PreCommit-TEZ-Build/1521//artifact/patchprocess/newPatchFindbugsWarningstez-api.html
Findbugs warnings: https://builds.apache.org/job/PreCommit-TEZ-Build/1521//artifact/patchprocess/newPatchFindbugsWarningstez-runtime-library.html
Console output: https://builds.apache.org/job/PreCommit-TEZ-Build/1521//console

This message is automatically generated.


======================================================================
======================================================================
    Adding comment to Jira.
======================================================================
======================================================================


Comment added.
2a229ced09cc54d5afef47c5fe246cc5142d42fd logged out


======================================================================
======================================================================
    Finished build.
======================================================================
======================================================================


Build step 'Execute shell' marked build as failure
Archiving artifacts
[description-setter] Could not determine description.
Recording test results
Email was triggered for: Failure - Any
Sending email for trigger: Failure - Any



###################################################################################
############################## FAILED TESTS (if any) ##############################
All tests passed