You are viewing a plain text version of this content. The canonical link for it is here.
Posted to dev@geronimo.apache.org by ga...@apache.org on 2009/01/07 23:20:52 UTC
[BUILD] trunk: Failed for Revision: 732462
Geronimo Revision: 732462 built with tests included
See the full build-1500.log file at http://people.apache.org/builds/geronimo/server/binaries/trunk/20090107/build-1500.log
Download the binaries from http://people.apache.org/builds/geronimo/server/binaries/trunk/20090107
[INFO] BUILD SUCCESSFUL
[INFO] ------------------------------------------------------------------------
[INFO] Total time: 40 minutes 18 seconds
[INFO] Finished at: Wed Jan 07 15:44:37 EST 2009
[INFO] Final Memory: 392M/1012M
[INFO] ------------------------------------------------------------------------
TESTSUITE RESULTS (Failures only)
=================================
See detailed results at http://people.apache.org/builds/geronimo/server/testsuite/ResultsSummary.html
Assembly: tomcat
=================================
See the full test.log file at http://people.apache.org/builds/geronimo/server/binaries/trunk/20090107/logs-1500-tomcat/test.log
[INFO] snapshot org.apache.geronimo.assemblies:geronimo-tomcat6-javaee5:2.2-SNAPSHOT: checking for updates from apache.snapshots
[INFO] snapshot org.apache.geronimo.assemblies:geronimo-tomcat6-javaee5:2.2-SNAPSHOT: checking for updates from apache-snapshots
[INFO] snapshot org.apache.geronimo.assemblies:geronimo-tomcat6-javaee5:2.2-SNAPSHOT: checking for updates from codehaus-snapshots
[INFO] Using assembly artifact: org.apache.geronimo.assemblies:geronimo-tomcat6-javaee5:zip:bin:2.2-SNAPSHOT:provided
[INFO] Using geronimoHome: /home/geronimo/geronimo/trunk/testsuite/target/geronimo-tomcat6-javaee5-2.2-SNAPSHOT
[INFO] Installing assembly...
[INFO] Expanding: /home/geronimo/.m2/repository/org/apache/geronimo/assemblies/geronimo-tomcat6-javaee5/2.2-SNAPSHOT/geronimo-tomcat6-javaee5-2.2-SNAPSHOT-bin.zip into /home/geronimo/geronimo/trunk/testsuite/target
[INFO] Starting Geronimo server...
[INFO] Selected option set: default
[INFO] Redirecting output to: /home/geronimo/geronimo/trunk/testsuite/target/geronimo-logs/org.apache.geronimo.mavenplugins.geronimo.server.StartServerMojo.log
[INFO] Waiting for Geronimo server...
[INFO] Geronimo server started in 0:00:46.507
[INFO] [shitty:install {execution: default}]
[INFO] Installing /home/geronimo/geronimo/trunk/testsuite/pom.xml to /home/geronimo/.m2/repository/org/apache/geronimo/testsuite/testsuite/2.2-SNAPSHOT/testsuite-2.2-SNAPSHOT.pom
[INFO] [shitty:test {execution: default}]
[INFO] Starting 35 test builds
[INFO]
[INFO] -------------------------------------------------------------------------------
[INFO]
[INFO] commands-testsuite/deploy RUNNING
[INFO] commands-testsuite/deploy SUCCESS (0:01:13.729)
[INFO] commands-testsuite/gshell RUNNING
[INFO] commands-testsuite/gshell SUCCESS (0:00:30.085)
[INFO] commands-testsuite/jaxws RUNNING
[INFO] commands-testsuite/jaxws SUCCESS (0:00:36.368)
[INFO] commands-testsuite/shutdown RUNNING
[INFO] commands-testsuite/shutdown SUCCESS (0:00:16.310)
[INFO] concurrent-testsuite/concurrent-basic RUNNING
[INFO] concurrent-testsuite/concurrent-basic SUCCESS (0:06:12.691)
[INFO] console-testsuite/advanced RUNNING
[INFO] console-testsuite/advanced SUCCESS (0:01:23.141)
[INFO] console-testsuite/basic RUNNING
[INFO] console-testsuite/basic SUCCESS (0:01:45.845)
[INFO] corba-testsuite/corba-helloworld RUNNING
[INFO] corba-testsuite/corba-helloworld SUCCESS (0:00:45.858)
[INFO] corba-testsuite/corba-marshal RUNNING
[INFO] corba-testsuite/corba-marshal SUCCESS (0:00:53.839)
[INFO] corba-testsuite/corba-mytime RUNNING
[INFO] corba-testsuite/corba-mytime SUCCESS (0:00:45.136)
[INFO] deployment-testsuite/deployment-tests RUNNING
[INFO] deployment-testsuite/deployment-tests SUCCESS (0:00:30.144)
[INFO] deployment-testsuite/jca-cms-tests RUNNING
[INFO] deployment-testsuite/jca-cms-tests SUCCESS (0:00:27.733)
[INFO] deployment-testsuite/manifestcp-tests RUNNING
[INFO] deployment-testsuite/manifestcp-tests SUCCESS (0:00:29.415)
[INFO] enterprise-testsuite/ejb-tests RUNNING
[INFO] enterprise-testsuite/ejb-tests SUCCESS (0:00:47.870)
[INFO] enterprise-testsuite/jms-tests RUNNING
[INFO] enterprise-testsuite/jms-tests FAILURE (0:00:40.225) Java returned: 1
[INFO] enterprise-testsuite/jpa-tests RUNNING
[INFO] enterprise-testsuite/jpa-tests SUCCESS (0:00:47.980)
[INFO] enterprise-testsuite/sec-client RUNNING
[INFO] enterprise-testsuite/sec-client SUCCESS (0:00:26.192)
[INFO] enterprise-testsuite/sec-tests RUNNING
[INFO] enterprise-testsuite/sec-tests SUCCESS (0:00:51.449)
[INFO] security-testsuite/test-security RUNNING
[INFO] security-testsuite/test-security SUCCESS (0:00:42.484)
[INFO] web-testsuite/test-2.1-jsps RUNNING
[INFO] web-testsuite/test-2.1-jsps SUCCESS (0:00:35.939)
[INFO] web-testsuite/test-2.5-servlets RUNNING
[INFO] web-testsuite/test-2.5-servlets SUCCESS (0:00:27.533)
[INFO] web-testsuite/test-myfaces RUNNING
[INFO] web-testsuite/test-myfaces SUCCESS (0:00:33.110)
[INFO] web-testsuite/test-tomcat RUNNING
[INFO] web-testsuite/test-tomcat SUCCESS (0:00:19.008)
[INFO] web-testsuite/test-web-forward RUNNING
[INFO] web-testsuite/test-web-forward SUCCESS (0:00:33.012)
[INFO] web-testsuite/test-web-references RUNNING
[INFO] web-testsuite/test-web-references SUCCESS (0:00:37.520)
[INFO] webservices-testsuite/jaxb-tests RUNNING
[INFO] webservices-testsuite/jaxb-tests SUCCESS (0:00:53.181)
[INFO] webservices-testsuite/jaxr-tests RUNNING
[INFO] webservices-testsuite/jaxr-tests SUCCESS (0:00:51.335)
[INFO] webservices-testsuite/jaxrpc-jaxws-tests RUNNING
[INFO] webservices-testsuite/jaxrpc-jaxws-tests SUCCESS (0:00:30.558)
[INFO] webservices-testsuite/jaxrpc-tests RUNNING
[INFO] webservices-testsuite/jaxrpc-tests SUCCESS (0:00:38.274)
[INFO] webservices-testsuite/jaxws-mtom-tests RUNNING
[INFO] webservices-testsuite/jaxws-mtom-tests SUCCESS (0:00:44.880)
[INFO] webservices-testsuite/jaxws-provider-tests RUNNING
[INFO] webservices-testsuite/jaxws-provider-tests SUCCESS (0:00:47.643)
[INFO] webservices-testsuite/jaxws-tests RUNNING
[INFO] webservices-testsuite/jaxws-tests SUCCESS (0:01:48.989)
[INFO] webservices-testsuite/jaxws-wsa-tests RUNNING
[INFO] webservices-testsuite/jaxws-wsa-tests SUCCESS (0:00:49.702)
[INFO] webservices-testsuite/saaj-tests RUNNING
[INFO] webservices-testsuite/saaj-tests SUCCESS (0:00:38.211)
[INFO] webservices-testsuite/stax-tests RUNNING
[INFO] webservices-testsuite/stax-tests SUCCESS (0:00:51.238)
[INFO]
[INFO] -------------------------------------------------------------------------------
[INFO] Test Summary (0:31:46.843)
[INFO] Passed: 34
[INFO] Failed: 1
[INFO] -------------------------------------------------------------------------------
[INFO]
[INFO] The following tests failed:
[INFO] * enterprise-testsuite/jms-tests - /home/geronimo/geronimo/trunk/testsuite/enterprise-testsuite/jms-tests/build.log
[INFO]
[INFO] ------------------------------------------------------------------------
[ERROR] BUILD ERROR
Assembly: jetty
=================================
See the full test.log file at http://people.apache.org/builds/geronimo/server/binaries/trunk/20090107/logs-1500-jetty/test.log
[INFO] snapshot org.apache.geronimo.assemblies:geronimo-jetty6-javaee5:2.2-SNAPSHOT: checking for updates from apache.snapshots
[INFO] snapshot org.apache.geronimo.assemblies:geronimo-jetty6-javaee5:2.2-SNAPSHOT: checking for updates from apache-snapshots
[INFO] snapshot org.apache.geronimo.assemblies:geronimo-jetty6-javaee5:2.2-SNAPSHOT: checking for updates from codehaus-snapshots
[INFO] Using assembly artifact: org.apache.geronimo.assemblies:geronimo-jetty6-javaee5:zip:bin:2.2-SNAPSHOT:provided
[INFO] Using geronimoHome: /home/geronimo/geronimo/trunk/testsuite/target/geronimo-jetty6-javaee5-2.2-SNAPSHOT
[INFO] Installing assembly...
[INFO] Expanding: /home/geronimo/.m2/repository/org/apache/geronimo/assemblies/geronimo-jetty6-javaee5/2.2-SNAPSHOT/geronimo-jetty6-javaee5-2.2-SNAPSHOT-bin.zip into /home/geronimo/geronimo/trunk/testsuite/target
[INFO] Starting Geronimo server...
[INFO] Selected option set: default
[INFO] Redirecting output to: /home/geronimo/geronimo/trunk/testsuite/target/geronimo-logs/org.apache.geronimo.mavenplugins.geronimo.server.StartServerMojo.log
[INFO] Waiting for Geronimo server...
[INFO] Geronimo server started in 0:00:46.106
[INFO] [shitty:install {execution: default}]
[INFO] Installing /home/geronimo/geronimo/trunk/testsuite/pom.xml to /home/geronimo/.m2/repository/org/apache/geronimo/testsuite/testsuite/2.2-SNAPSHOT/testsuite-2.2-SNAPSHOT.pom
[INFO] [shitty:test {execution: default}]
[INFO] Starting 35 test builds
[INFO]
[INFO] -------------------------------------------------------------------------------
[INFO]
[INFO] commands-testsuite/deploy RUNNING
[INFO] commands-testsuite/deploy SUCCESS (0:01:11.723)
[INFO] commands-testsuite/gshell RUNNING
[INFO] commands-testsuite/gshell SUCCESS (0:00:31.269)
[INFO] commands-testsuite/jaxws RUNNING
[INFO] commands-testsuite/jaxws SUCCESS (0:00:36.313)
[INFO] commands-testsuite/shutdown RUNNING
[INFO] commands-testsuite/shutdown SUCCESS (0:00:16.796)
[INFO] concurrent-testsuite/concurrent-basic RUNNING
[INFO] concurrent-testsuite/concurrent-basic SUCCESS (0:06:07.419)
[INFO] console-testsuite/advanced RUNNING
[INFO] console-testsuite/advanced SUCCESS (0:01:22.538)
[INFO] console-testsuite/basic RUNNING
[INFO] console-testsuite/basic SUCCESS (0:01:52.264)
[INFO] corba-testsuite/corba-helloworld RUNNING
[INFO] corba-testsuite/corba-helloworld SUCCESS (0:00:46.060)
[INFO] corba-testsuite/corba-marshal RUNNING
[INFO] corba-testsuite/corba-marshal SUCCESS (0:01:15.090)
[INFO] corba-testsuite/corba-mytime RUNNING
[INFO] corba-testsuite/corba-mytime SUCCESS (0:00:44.475)
[INFO] deployment-testsuite/deployment-tests RUNNING
[INFO] deployment-testsuite/deployment-tests SUCCESS (0:00:31.071)
[INFO] deployment-testsuite/jca-cms-tests RUNNING
[INFO] deployment-testsuite/jca-cms-tests SUCCESS (0:00:27.651)
[INFO] deployment-testsuite/manifestcp-tests RUNNING
[INFO] deployment-testsuite/manifestcp-tests SUCCESS (0:00:30.213)
[INFO] enterprise-testsuite/ejb-tests RUNNING
[INFO] enterprise-testsuite/ejb-tests SUCCESS (0:00:35.337)
[INFO] enterprise-testsuite/jms-tests RUNNING
[INFO] enterprise-testsuite/jms-tests FAILURE (0:00:40.655) Java returned: 1
[INFO] enterprise-testsuite/jpa-tests RUNNING
[INFO] enterprise-testsuite/jpa-tests SUCCESS (0:00:39.979)
[INFO] enterprise-testsuite/sec-client RUNNING
[INFO] enterprise-testsuite/sec-client SUCCESS (0:00:27.647)
[INFO] enterprise-testsuite/sec-tests RUNNING
[INFO] enterprise-testsuite/sec-tests SUCCESS (0:00:50.768)
[INFO] security-testsuite/test-security RUNNING
[INFO] security-testsuite/test-security SUCCESS (0:00:41.759)
[INFO] web-testsuite/test-2.1-jsps RUNNING
[INFO] web-testsuite/test-2.1-jsps SUCCESS (0:00:36.607)
[INFO] web-testsuite/test-2.5-servlets RUNNING
[INFO] web-testsuite/test-2.5-servlets SUCCESS (0:00:28.266)
[INFO] web-testsuite/test-jetty RUNNING
[INFO] web-testsuite/test-jetty SUCCESS (0:00:19.577)
[INFO] web-testsuite/test-myfaces RUNNING
[INFO] web-testsuite/test-myfaces SUCCESS (0:00:33.102)
[INFO] web-testsuite/test-web-forward RUNNING
[INFO] web-testsuite/test-web-forward SUCCESS (0:00:32.042)
[INFO] web-testsuite/test-web-references RUNNING
[INFO] web-testsuite/test-web-references SUCCESS (0:00:38.478)
[INFO] webservices-testsuite/jaxb-tests RUNNING
[INFO] webservices-testsuite/jaxb-tests SUCCESS (0:00:53.843)
[INFO] webservices-testsuite/jaxr-tests RUNNING
[INFO] webservices-testsuite/jaxr-tests SUCCESS (0:00:51.309)
[INFO] webservices-testsuite/jaxrpc-jaxws-tests RUNNING
[INFO] webservices-testsuite/jaxrpc-jaxws-tests SUCCESS (0:00:28.354)
[INFO] webservices-testsuite/jaxrpc-tests RUNNING
[INFO] webservices-testsuite/jaxrpc-tests SUCCESS (0:00:39.284)
[INFO] webservices-testsuite/jaxws-mtom-tests RUNNING
[INFO] webservices-testsuite/jaxws-mtom-tests SUCCESS (0:00:40.999)
[INFO] webservices-testsuite/jaxws-provider-tests RUNNING
[INFO] webservices-testsuite/jaxws-provider-tests SUCCESS (0:00:58.672)
[INFO] webservices-testsuite/jaxws-tests RUNNING
[INFO] webservices-testsuite/jaxws-tests SUCCESS (0:01:38.398)
[INFO] webservices-testsuite/jaxws-wsa-tests RUNNING
[INFO] webservices-testsuite/jaxws-wsa-tests SUCCESS (0:00:45.637)
[INFO] webservices-testsuite/saaj-tests RUNNING
[INFO] webservices-testsuite/saaj-tests SUCCESS (0:00:37.185)
[INFO] webservices-testsuite/stax-tests RUNNING
[INFO] webservices-testsuite/stax-tests SUCCESS (0:00:53.958)
[INFO]
[INFO] -------------------------------------------------------------------------------
[INFO] Test Summary (0:31:44.954)
[INFO] Passed: 34
[INFO] Failed: 1
[INFO] -------------------------------------------------------------------------------
[INFO]
[INFO] The following tests failed:
[INFO] * enterprise-testsuite/jms-tests - /home/geronimo/geronimo/trunk/testsuite/enterprise-testsuite/jms-tests/build.log
[INFO]
[INFO] ------------------------------------------------------------------------
[ERROR] BUILD ERROR
Samples: trunk
=================================
Log: http://people.apache.org/builds/geronimo/server/binaries/trunk/20090107/samples-1500.log
Build status: OK