You are viewing a plain text version of this content. The canonical link for it is here.
Posted to builds@solr.apache.org by Apache Jenkins Server <je...@builds.apache.org> on 2026/06/14 23:33:47 UTC

[JENKINS] Solr » Solr-TestIntegration-main - Build # 575 - Still Failing!

Build: https://ci-builds.apache.org/job/Solr/job/Solr-TestIntegration-main/575/

No tests ran.

Build Log:
[...truncated 508 lines...]
BUILD FAILED in 23m 45s
130 actionable tasks: 130 executed

Publishing Build Scan to Develocity...
https://develocity.apache.org/s/2hqi4c4r6j2wy

Build step 'Invoke Gradle script' changed build result to FAILURE
Build step 'Invoke Gradle script' marked build as failure
Archiving artifacts
Email was triggered for: Failure - Any
Sending email for trigger: Failure - Any

[JENKINS] Solr » Solr-TestIntegration-main - Build # 579 - Still Failing!

Posted by Apache Jenkins Server <je...@builds.apache.org>.
Build: https://ci-builds.apache.org/job/Solr/job/Solr-TestIntegration-main/579/

No tests ran.

Build Log:
[...truncated 507 lines...]
BUILD FAILED in 23m 57s
130 actionable tasks: 130 executed

Publishing Build Scan to Develocity...
https://develocity.apache.org/s/uvflz2q6wl2bu

Build step 'Invoke Gradle script' changed build result to FAILURE
Build step 'Invoke Gradle script' marked build as failure
Archiving artifacts
Email was triggered for: Failure - Any
Sending email for trigger: Failure - Any

[JENKINS] Solr » Solr-TestIntegration-main - Build # 578 - Still Failing!

Posted by Apache Jenkins Server <je...@builds.apache.org>.
Build: https://ci-builds.apache.org/job/Solr/job/Solr-TestIntegration-main/578/

No tests ran.

Build Log:
[...truncated 507 lines...]
BUILD FAILED in 22m 59s
130 actionable tasks: 130 executed

Publishing Build Scan to Develocity...
https://develocity.apache.org/s/r7eapmnoqlxko

Build step 'Invoke Gradle script' changed build result to FAILURE
Build step 'Invoke Gradle script' marked build as failure
Archiving artifacts
Email was triggered for: Failure - Any
Sending email for trigger: Failure - Any

[JENKINS] Solr » Solr-TestIntegration-main - Build # 577 - Still Failing!

Posted by Apache Jenkins Server <je...@builds.apache.org>.
Build: https://ci-builds.apache.org/job/Solr/job/Solr-TestIntegration-main/577/

No tests ran.

Build Log:
[...truncated 508 lines...]
BUILD FAILED in 23m 13s
130 actionable tasks: 130 executed

Publishing Build Scan to Develocity...
https://develocity.apache.org/s/bvvnlw67uunim

Build step 'Invoke Gradle script' changed build result to FAILURE
Build step 'Invoke Gradle script' marked build as failure
Archiving artifacts
Email was triggered for: Failure - Any
Sending email for trigger: Failure - Any

[JENKINS] Solr » Solr-TestIntegration-main - Build # 576 - Still Failing!

Posted by Apache Jenkins Server <je...@builds.apache.org>.
Build: https://ci-builds.apache.org/job/Solr/job/Solr-TestIntegration-main/576/

No tests ran.

Build Log:
[...truncated 365 lines...]
#   ERROR: KeeperErrorCode = NoNode for /security.json
# --
# 
# Last output:
# WARN  - 2026-06-15 22:23:53.926; org.apache.solr.common.cloud.SolrZkClient; Using default ZkCredentialsInjector. ZkCredentialsInjector is not secure, it creates an empty list of credentials which leads to 'OPEN_ACL_UNSAFE' ACLs to Zookeeper nodes
# WARN  - 2026-06-15 22:23:53.929; org.apache.solr.common.cloud.SolrZkClient; Using default ZkACLProvider. DefaultZkACLProvider is not secure, it creates 'OPEN_ACL_UNSAFE' ACLs to Zookeeper nodes
# WARN  - 2026-06-15 22:23:54.375; org.apache.solr.common.cloud.SolrZkClient; Using default ZkCredentialsInjector. ZkCredentialsInjector is not secure, it creates an empty list of credentials which leads to 'OPEN_ACL_UNSAFE' ACLs to Zookeeper nodes
# WARN  - 2026-06-15 22:23:54.375; org.apache.solr.common.cloud.SolrZkClient; Using default ZkACLProvider. DefaultZkACLProvider is not secure, it creates 'OPEN_ACL_UNSAFE' ACLs to Zookeeper nodes
# 
# ERROR: KeeperErrorCode = NoNode for /security.json
not ok 9 create, config, api, and delete with basic auth # in 17574 ms
# (from function `setup' in test file test/test_basic_auth.bats, line 24)
#   `solr start -Dsolr.packages.enabled=true' failed
# Starting Solr
# 
# Port 33833 is already being used by another process (pid: 1749904)
# Please choose a different port using the -p option.
# 
# Please find the SOLR_HOME snapshot for failed test #1 at: /home/jenkins/jenkins-agent/workspace/Solr/Solr-TestIntegration-main/solr/packaging/build/test-output/failure-snapshots/9-1
# Last output:
# WARN  - 2026-06-15 22:23:55.515; org.apache.solr.common.cloud.SolrZkClient; Using default ZkCredentialsInjector. ZkCredentialsInjector is not secure, it creates an empty list of credentials which leads to 'OPEN_ACL_UNSAFE' ACLs to Zookeeper nodes
# WARN  - 2026-06-15 22:23:55.518; org.apache.solr.common.cloud.SolrZkClient; Using default ZkACLProvider. DefaultZkACLProvider is not secure, it creates 'OPEN_ACL_UNSAFE' ACLs to Zookeeper nodes
# 
# ERROR: java.util.concurrent.TimeoutException: Timeout while waiting for Zookeeper Client to connect: 15000 ms
ok 10 post, postlogs and export with basic auth # in 16934 ms
ok 11 package with basic auth # in 11832 ms
ok 12 admin UI static content is excepted from basic auth # in 10369 ms
ok 13 nothing # in 10 ms
ok 14 server does not compress response without Accept-Encoding header # in 137 ms
ok 15 server compresses response when Accept-Encoding: gzip is requested # in 75 ms
ok 16 compressed response can be decompressed and parsed # in 77 ms
ok 17 setting property # in 10523 ms
ok 18 short form of setting property # in 6143 ms
ok 19 connecting to solr via various connection types # in 10109 ms
ok 20 create for non cloud mode # in 7817 ms
ok 21 create for cloud mode # in 9833 ms
ok 22 multiple connection options are prevented # in 790 ms
ok 23 create collection # in 7435 ms
ok 24 create collection using solrUrl # in 5095 ms
ok 25 create collection using legacy solrUrl # in 5181 ms
ok 26 create collection using Zookeeper # in 5312 ms
ok 27 reject d option with invalid config dir # in 2609 ms
ok 28 accept d option with builtin config # in 4938 ms
ok 29 accept d option with explicit path to config # in 5047 ms
ok 30 accept n option as config name # in 5051 ms
ok 31 allow config reuse when n option specifies same config # in 8830 ms
ok 32 create multisharded collections when s provided # in 5013 ms
ok 33 create replicated collections when rf provided # in 5951 ms
ok 34 can delete collections # in 10328 ms
ok 35 can delete collections with solr-url # in 8246 ms
ok 36 can delete collections with solr-connection # in 7714 ms
ok 37 collection delete also deletes zk config # in 7099 ms
ok 38 deletes accompanying zk config with nondefault name # in 6957 ms
ok 39 delete-config option can opt to leave config in zk # in 6877 ms
ok 40 start -e cloud works with --no-prompt # in 2734 ms
ok 41 start -e cloud works with --jvm-opts # in 99 ms
ok 42 Check export command # in 18490 ms
ok 43 export fails on non cloud mode # in 9054 ms
Waiting for Tika Server to be ready on port 33838
Tika Server is ready on port 33838
ok 44 using curl to extract a single pdf file # in 19222 ms
ok 45 using the bin/solr post tool to extract content from pdf # in 19920 ms
ok 46 using the bin/solr post tool to crawl web site # in 21495 ms
Stopping Tika Server container
ok 47 healthcheck on cloud solr # in 12633 ms
ok 48 healthcheck errors on standalone solr # in 6543 ms
ok 49 solr help flag prints help # in 699 ms
ok 50 solr with no flags prints help # in 702 ms
ok 51 start help flag prints help # in 140 ms
ok 52 start h flag prints help # in 137 ms
ok 53 stop help flag prints help # in 133 ms
ok 54 restart help flag prints help # in 139 ms
ok 55 status help flag prints help # in 745 ms
ok 56 healthcheck help flag prints help # in 707 ms
ok 57 create help flag prints help # in 726 ms
ok 58 delete help flag prints help # in 722 ms
ok 59 zk help flag prints help # in 730 ms
ok 60 auth help flag prints help # in 719 ms
ok 61 assert help flag prints help # in 725 ms
ok 62 post help flag prints help # in 731 ms
ok 63 SQL Module # in 15397 ms
ok 64 icu collation in analysis-extras module # in 12185 ms
ok 65 Check lifecycle of sentiment classification # in 22021 ms
ok 66 Affinity placement plugin using sysprop # in 14983 ms
ok 67 Random placement plugin using ENV # in 14847 ms
ok 68 Check help command # in 2244 ms
ok 69 basic post with a type specified # in 5263 ms
ok 70 basic post with collection instead of url parameter # in 3795 ms
ok 71 basic post with solr-url and collection # in 3733 ms
ok 72 basic post with -s (solr-connection short form) and collection # in 3710 ms
ok 73 basic post WITHOUT a type specified # in 10923 ms
ok 74 crawling a directory as a dry-run # in 764 ms
ok 75 crawling a directory # in 4114 ms
ok 76 skipcommit and optimize and delete # in 3675 ms
ok 77 args mode # in 6688 ms
ok 78 stdin mode # in 3267 ms
ok 79 verbose echo the Solr response # in 3635 ms
ok 80 post solr log into solr via cli # in 9239 ms
# Docker artifacts saved to: /home/jenkins/jenkins-agent/workspace/Solr/Solr-TestIntegration-main/solr/packaging/build/test-output/docker
ok 81 Docker SolrCloud rolling upgrade # in 62527 ms
ok 82 allowPaths - backup # in 15397 ms
ok 83 snapshot lifecycle # in 4714 ms
ok 84 snapshot list # in 3176 ms
ok 85 snapshot list via --solr-connection # in 3203 ms
ok 86 snapshot describe # in 3269 ms
ok 87 snapshot describe via --solr-connection # in 3270 ms
ok 88 start solr with ssl # in 16029 ms
ok 89 use different hostname when not checking peer-name # in 24110 ms
ok 90 start solr with ssl and auth # in 13963 ms
ok 91 start solr with client truststore and security manager # in 15839 ms
ok 92 start solr with mTLS needed # in 45020 ms
ok 93 start solr with mTLS wanted # in 33926 ms
ok 94 test keystore reload # in 56978 ms
ok 95 SOLR-11740 check 'solr stop' connection # in 15692 ms
ok 96 stop command for single port # in 18027 ms
ok 97 check stop command doesn't hang # skip timeout utility is not available
ok 98 SOLR-16976 solr starts with remote JMX enabled # in 8127 ms
not ok 99 deprecated system properties converted to modern properties # in 43725 ms
# (from function `assert_file_contains' in file .gradle/node/node_modules/bats-file/src/file.bash, line 566,
#  in test file test/test_start_solr.bats, line 88)
#   `assert_file_contains "${SOLR_LOGS_DIR}/solr.log" 'You are passing in deprecated system property disable.config.edit and should upgrade to using solr.api.config.edit.enabled instead.'' failed
# Waiting up to 180 seconds to see Solr running on port 33833 [|]   [/]   [-]   [\]   [|]
# Started Solr server on port 33833 (pid=1803150). Happy searching!
# 
#     
# -- file does not contain regex --
# path : /home/jenkins/jenkins-agent/workspace/Solr/Solr-TestIntegration-main/solr/packaging/build/test-output/solr-home/logs/solr.log
# --
# 
# Please find the SOLR_HOME snapshot for failed test #5 at: /home/jenkins/jenkins-agent/workspace/Solr/Solr-TestIntegration-main/solr/packaging/build/test-output/failure-snapshots/99-5
ok 100 start with custom jetty options # in 8023 ms
ok 101 -c flag prints no-op warning and still starts in cloud mode # in 9119 ms
not ok 102 bootstrapping a configset # in 9132 ms
# (from function `config_exists' in file test/bats_helper.bash, line 84,
#  in test file test/test_start_solr.bats, line 118)
#   `config_exists "techproducts"' failed
# Waiting up to 180 seconds to see Solr running on port 33833 [|]   [/]   [-]   [\]   [|]
# Started Solr server on port 33833 (pid=1804718). Happy searching!
# 
#     WARN  - 2026-06-15 22:40:07.217; org.apache.solr.common.cloud.SolrZkClient; Using default ZkCredentialsInjector. ZkCredentialsInjector is not secure, it creates an empty list of credentials which leads to 'OPEN_ACL_UNSAFE' ACLs to Zookeeper nodes
# WARN  - 2026-06-15 22:40:07.221; org.apache.solr.common.cloud.SolrZkClient; Using default ZkACLProvider. DefaultZkACLProvider is not secure, it creates 'OPEN_ACL_UNSAFE' ACLs to Zookeeper nodes
# Please find the SOLR_HOME snapshot for failed test #8 at: /home/jenkins/jenkins-agent/workspace/Solr/Solr-TestIntegration-main/solr/packaging/build/test-output/failure-snapshots/102-8
ok 103 status detects locally running solr # in 2968 ms
ok 104 status with --solr-url from user # in 1303 ms
ok 105 status with --port from user # in 1299 ms
ok 106 multiple connection options are prevented # in 736 ms
ok 107 status with invalid --solr-url from user # in 1047 ms
ok 108 status with --short format # in 727 ms
ok 109 searching solr via locally executed streaming expression # in 1669 ms
ok 110 searching solr via remotely executed streaming expression by solr-url # in 1221 ms
ok 111 searching solr via remotely executed streaming expression by solr connection # in 1090 ms
ok 112 variable interpolation # in 1642 ms
ok 113 searching solr without credentials fails with error # in 1091 ms
ok 114 --version returns Solr version # in 711 ms
ok 115 version as direct tool call still runs # in 716 ms
ok 116 short help # in 766 ms
ok 117 short help is inferred # in 758 ms
ok 118 long help # in 775 ms
ok 119 running subcommands with zk is prevented # in 697 ms
ok 120 listing out files # in 1093 ms
ok 121 connecting to solr via various solr urls and zk hosts # in 8164 ms
ok 122 copying files around # in 7727 ms
ok 123 upconfig # in 1419 ms
ok 124 SOLR-12429 test upconfig fails with symlink # in 1155 ms
ok 125 downconfig # in 1142 ms
ok 126 bin/solr zk cp gets 'solrhome' from '--solr-home' command line option # in 1401 ms
ok 127 env var ZK_HOST is honored # in 2102 ms
ok 128 Cleanup # in 1864 ms

> Task :solr:packaging:integrationTests FAILED

FAILURE: Build failed with an exception.

* Where:
Build file '/home/jenkins/jenkins-agent/workspace/Solr/Solr-TestIntegration-main/solr/packaging/build.gradle' line: 353

* What went wrong:
Execution failed for task ':solr:packaging:integrationTests'.
> Process 'command '/home/jenkins/jenkins-agent/workspace/Solr/Solr-TestIntegration-main/solr/packaging/.gradle/node/node_modules/bats/bin/bats'' finished with non-zero exit value 1

* Try:
> Run with --stacktrace option to get the stack trace.
> Run with --info or --debug option to get more log output.
> Get more help at https://help.gradle.org.

Deprecated Gradle features were used in this build, making it incompatible with Gradle 9.0.

You can use '--warning-mode all' to show the individual deprecation warnings and determine if they come from your own scripts or plugins.

For more on this, please refer to https://docs.gradle.org/8.10/userguide/command_line_interface.html#sec:command_line_warnings in the Gradle documentation.

BUILD FAILED in 23m 58s
130 actionable tasks: 130 executed

Publishing Build Scan to Develocity...
https://develocity.apache.org/s/s2whwbcuczrrg

Build step 'Invoke Gradle script' changed build result to FAILURE
Build step 'Invoke Gradle script' marked build as failure
Archiving artifacts
Email was triggered for: Failure - Any
Sending email for trigger: Failure - Any