You are viewing a plain text version of this content. The canonical link for it is here.
Posted to dev@lucene.apache.org by Policeman Jenkins Server <je...@thetaphi.de> on 2016/07/02 22:03:48 UTC
[JENKINS] Lucene-Solr-master-MacOSX (64bit/jdk1.8.0) - Build # 3381
- Still Failing!
Build: http://jenkins.thetaphi.de/job/Lucene-Solr-master-MacOSX/3381/
Java: 64bit/jdk1.8.0 -XX:-UseCompressedOops -XX:+UseConcMarkSweepGC
1 tests failed.
FAILED: org.apache.solr.handler.TestReplicationHandler.doTestIndexAndConfigAliasReplication
Error Message:
expected:<1> but was:<0>
Stack Trace:
java.lang.AssertionError: expected:<1> but was:<0>
at __randomizedtesting.SeedInfo.seed([C33F59A8F40DBABC:344CB7F032E5155A]:0)
at org.junit.Assert.fail(Assert.java:93)
at org.junit.Assert.failNotEquals(Assert.java:647)
at org.junit.Assert.assertEquals(Assert.java:128)
at org.junit.Assert.assertEquals(Assert.java:472)
at org.junit.Assert.assertEquals(Assert.java:456)
at org.apache.solr.handler.TestReplicationHandler.doTestIndexAndConfigAliasReplication(TestReplicationHandler.java:1327)
at sun.reflect.NativeMethodAccessorImpl.invoke0(Native Method)
at sun.reflect.NativeMethodAccessorImpl.invoke(NativeMethodAccessorImpl.java:62)
at sun.reflect.DelegatingMethodAccessorImpl.invoke(DelegatingMethodAccessorImpl.java:43)
at java.lang.reflect.Method.invoke(Method.java:498)
at com.carrotsearch.randomizedtesting.RandomizedRunner.invoke(RandomizedRunner.java:1764)
at com.carrotsearch.randomizedtesting.RandomizedRunner$8.evaluate(RandomizedRunner.java:871)
at com.carrotsearch.randomizedtesting.RandomizedRunner$9.evaluate(RandomizedRunner.java:907)
at com.carrotsearch.randomizedtesting.RandomizedRunner$10.evaluate(RandomizedRunner.java:921)
at com.carrotsearch.randomizedtesting.rules.SystemPropertiesRestoreRule$1.evaluate(SystemPropertiesRestoreRule.java:57)
at org.apache.lucene.util.TestRuleSetupTeardownChained$1.evaluate(TestRuleSetupTeardownChained.java:49)
at org.apache.lucene.util.AbstractBeforeAfterRule$1.evaluate(AbstractBeforeAfterRule.java:45)
at org.apache.lucene.util.TestRuleThreadAndTestName$1.evaluate(TestRuleThreadAndTestName.java:48)
at org.apache.lucene.util.TestRuleIgnoreAfterMaxFailures$1.evaluate(TestRuleIgnoreAfterMaxFailures.java:64)
at org.apache.lucene.util.TestRuleMarkFailure$1.evaluate(TestRuleMarkFailure.java:47)
at com.carrotsearch.randomizedtesting.rules.StatementAdapter.evaluate(StatementAdapter.java:36)
at com.carrotsearch.randomizedtesting.ThreadLeakControl$StatementRunner.run(ThreadLeakControl.java:367)
at com.carrotsearch.randomizedtesting.ThreadLeakControl.forkTimeoutingTask(ThreadLeakControl.java:809)
at com.carrotsearch.randomizedtesting.ThreadLeakControl$3.evaluate(ThreadLeakControl.java:460)
at com.carrotsearch.randomizedtesting.RandomizedRunner.runSingleTest(RandomizedRunner.java:880)
at com.carrotsearch.randomizedtesting.RandomizedRunner$5.evaluate(RandomizedRunner.java:781)
at com.carrotsearch.randomizedtesting.RandomizedRunner$6.evaluate(RandomizedRunner.java:816)
at com.carrotsearch.randomizedtesting.RandomizedRunner$7.evaluate(RandomizedRunner.java:827)
at com.carrotsearch.randomizedtesting.rules.StatementAdapter.evaluate(StatementAdapter.java:36)
at com.carrotsearch.randomizedtesting.rules.SystemPropertiesRestoreRule$1.evaluate(SystemPropertiesRestoreRule.java:57)
at org.apache.lucene.util.AbstractBeforeAfterRule$1.evaluate(AbstractBeforeAfterRule.java:45)
at com.carrotsearch.randomizedtesting.rules.StatementAdapter.evaluate(StatementAdapter.java:36)
at org.apache.lucene.util.TestRuleStoreClassName$1.evaluate(TestRuleStoreClassName.java:41)
at com.carrotsearch.randomizedtesting.rules.NoShadowingOrOverridesOnMethodsRule$1.evaluate(NoShadowingOrOverridesOnMethodsRule.java:40)
at com.carrotsearch.randomizedtesting.rules.NoShadowingOrOverridesOnMethodsRule$1.evaluate(NoShadowingOrOverridesOnMethodsRule.java:40)
at com.carrotsearch.randomizedtesting.rules.StatementAdapter.evaluate(StatementAdapter.java:36)
at com.carrotsearch.randomizedtesting.rules.StatementAdapter.evaluate(StatementAdapter.java:36)
at com.carrotsearch.randomizedtesting.rules.StatementAdapter.evaluate(StatementAdapter.java:36)
at org.apache.lucene.util.TestRuleAssertionsRequired$1.evaluate(TestRuleAssertionsRequired.java:53)
at org.apache.lucene.util.TestRuleMarkFailure$1.evaluate(TestRuleMarkFailure.java:47)
at org.apache.lucene.util.TestRuleIgnoreAfterMaxFailures$1.evaluate(TestRuleIgnoreAfterMaxFailures.java:64)
at org.apache.lucene.util.TestRuleIgnoreTestSuites$1.evaluate(TestRuleIgnoreTestSuites.java:54)
at com.carrotsearch.randomizedtesting.rules.StatementAdapter.evaluate(StatementAdapter.java:36)
at com.carrotsearch.randomizedtesting.ThreadLeakControl$StatementRunner.run(ThreadLeakControl.java:367)
at java.lang.Thread.run(Thread.java:745)
Build Log:
[...truncated 11481 lines...]
[junit4] Suite: org.apache.solr.handler.TestReplicationHandler
[junit4] 2> Creating dataDir: /Users/jenkins/workspace/Lucene-Solr-master-MacOSX/solr/build/solr-core/test/J1/temp/solr.handler.TestReplicationHandler_C33F59A8F40DBABC-001/init-core-data-001
[junit4] 2> 1821658 INFO (SUITE-TestReplicationHandler-seed#[C33F59A8F40DBABC]-worker) [ ] o.a.s.SolrTestCaseJ4 Randomized ssl (false) and clientAuth (false) via: @org.apache.solr.SolrTestCaseJ4$SuppressSSL(bugUrl=None) w/ MAC_OS_X supressed clientAuth
[junit4] 2> 1821659 INFO (TEST-TestReplicationHandler.doTestDetails-seed#[C33F59A8F40DBABC]) [ ] o.a.s.SolrTestCaseJ4 ###Starting doTestDetails
[junit4] 2> 1821660 INFO (TEST-TestReplicationHandler.doTestDetails-seed#[C33F59A8F40DBABC]) [ ] o.a.s.SolrTestCaseJ4 Writing core.properties file to /Users/jenkins/workspace/Lucene-Solr-master-MacOSX/solr/build/solr-core/test/J1/temp/solr.handler.TestReplicationHandler_C33F59A8F40DBABC-001/solr-instance-001/collection1
[junit4] 2> 1821724 INFO (TEST-TestReplicationHandler.doTestDetails-seed#[C33F59A8F40DBABC]) [ ] o.e.j.s.Server jetty-9.3.8.v20160314
[junit4] 2> 1821726 INFO (TEST-TestReplicationHandler.doTestDetails-seed#[C33F59A8F40DBABC]) [ ] o.e.j.s.h.ContextHandler Started o.e.j.s.ServletContextHandler@7fa0182f{/solr,null,AVAILABLE}
[junit4] 2> 1821727 INFO (TEST-TestReplicationHandler.doTestDetails-seed#[C33F59A8F40DBABC]) [ ] o.e.j.s.ServerConnector Started ServerConnector@2e1c6b41{HTTP/1.1,[http/1.1]}{127.0.0.1:64541}
[junit4] 2> 1821727 INFO (TEST-TestReplicationHandler.doTestDetails-seed#[C33F59A8F40DBABC]) [ ] o.e.j.s.Server Started @1827256ms
[junit4] 2> 1821727 INFO (TEST-TestReplicationHandler.doTestDetails-seed#[C33F59A8F40DBABC]) [ ] o.a.s.c.s.e.JettySolrRunner Jetty properties: {solr.data.dir=/Users/jenkins/workspace/Lucene-Solr-master-MacOSX/solr/build/solr-core/test/J1/temp/solr.handler.TestReplicationHandler_C33F59A8F40DBABC-001/solr-instance-001/collection1/data, hostContext=/solr, hostPort=64541}
[junit4] 2> 1821728 INFO (TEST-TestReplicationHandler.doTestDetails-seed#[C33F59A8F40DBABC]) [ ] o.a.s.s.SolrDispatchFilter SolrDispatchFilter.init(): sun.misc.Launcher$AppClassLoader@4554617c
[junit4] 2> 1821728 INFO (TEST-TestReplicationHandler.doTestDetails-seed#[C33F59A8F40DBABC]) [ ] o.a.s.c.SolrResourceLoader new SolrResourceLoader for directory: '/Users/jenkins/workspace/Lucene-Solr-master-MacOSX/solr/build/solr-core/test/J1/temp/solr.handler.TestReplicationHandler_C33F59A8F40DBABC-001/solr-instance-001'
[junit4] 2> 1821728 INFO (TEST-TestReplicationHandler.doTestDetails-seed#[C33F59A8F40DBABC]) [ ] o.a.s.c.SolrResourceLoader JNDI not configured for solr (NoInitialContextEx)
[junit4] 2> 1821728 INFO (TEST-TestReplicationHandler.doTestDetails-seed#[C33F59A8F40DBABC]) [ ] o.a.s.c.SolrResourceLoader solr home defaulted to 'solr/' (could not find system property or JNDI)
[junit4] 2> 1821728 INFO (TEST-TestReplicationHandler.doTestDetails-seed#[C33F59A8F40DBABC]) [ ] o.a.s.c.SolrXmlConfig Loading container configuration from /Users/jenkins/workspace/Lucene-Solr-master-MacOSX/solr/build/solr-core/test/J1/temp/solr.handler.TestReplicationHandler_C33F59A8F40DBABC-001/solr-instance-001/solr.xml
[junit4] 2> 1821768 INFO (TEST-TestReplicationHandler.doTestDetails-seed#[C33F59A8F40DBABC]) [ ] o.a.s.c.CorePropertiesLocator Config-defined core root directory: /Users/jenkins/workspace/Lucene-Solr-master-MacOSX/solr/build/solr-core/test/J1/temp/solr.handler.TestReplicationHandler_C33F59A8F40DBABC-001/solr-instance-001/.
[junit4] 2> 1821768 INFO (TEST-TestReplicationHandler.doTestDetails-seed#[C33F59A8F40DBABC]) [ ] o.a.s.c.CoreContainer New CoreContainer 112142187
[junit4] 2> 1821768 INFO (TEST-TestReplicationHandler.doTestDetails-seed#[C33F59A8F40DBABC]) [ ] o.a.s.c.CoreContainer Loading cores into CoreContainer [instanceDir=/Users/jenkins/workspace/Lucene-Solr-master-MacOSX/solr/build/solr-core/test/J1/temp/solr.handler.TestReplicationHandler_C33F59A8F40DBABC-001/solr-instance-001]
[junit4] 2> 1821769 WARN (TEST-TestReplicationHandler.doTestDetails-seed#[C33F59A8F40DBABC]) [ ] o.a.s.c.CoreContainer Couldn't add files from /Users/jenkins/workspace/Lucene-Solr-master-MacOSX/solr/build/solr-core/test/J1/temp/solr.handler.TestReplicationHandler_C33F59A8F40DBABC-001/solr-instance-001/lib to classpath: /Users/jenkins/workspace/Lucene-Solr-master-MacOSX/solr/build/solr-core/test/J1/temp/solr.handler.TestReplicationHandler_C33F59A8F40DBABC-001/solr-instance-001/lib
[junit4] 2> 1821769 INFO (TEST-TestReplicationHandler.doTestDetails-seed#[C33F59A8F40DBABC]) [ ] o.a.s.h.c.HttpShardHandlerFactory created with socketTimeout : 90000,urlScheme : ,connTimeout : 15000,maxConnectionsPerHost : 20,maxConnections : 10000,corePoolSize : 0,maximumPoolSize : 2147483647,maxThreadIdleTime : 5,sizeOfQueue : -1,fairnessPolicy : false,
[junit4] 2> 1821772 INFO (TEST-TestReplicationHandler.doTestDetails-seed#[C33F59A8F40DBABC]) [ ] o.a.s.u.UpdateShardHandler Created UpdateShardHandler HTTP client with params: socketTimeout=340000&connTimeout=45000&maxConnections=100000&maxConnectionsPerHost=100000
[junit4] 2> 1821773 INFO (TEST-TestReplicationHandler.doTestDetails-seed#[C33F59A8F40DBABC]) [ ] o.a.s.l.LogWatcher SLF4J impl is org.slf4j.impl.Log4jLoggerFactory
[junit4] 2> 1821773 INFO (TEST-TestReplicationHandler.doTestDetails-seed#[C33F59A8F40DBABC]) [ ] o.a.s.l.LogWatcher Registering Log Listener [Log4j (org.slf4j.impl.Log4jLoggerFactory)]
[junit4] 2> 1821773 INFO (TEST-TestReplicationHandler.doTestDetails-seed#[C33F59A8F40DBABC]) [ ] o.a.s.c.CoreContainer Security conf doesn't exist. Skipping setup for authorization module.
[junit4] 2> 1821773 INFO (TEST-TestReplicationHandler.doTestDetails-seed#[C33F59A8F40DBABC]) [ ] o.a.s.c.CoreContainer No authentication plugin used.
[junit4] 2> 1821778 INFO (TEST-TestReplicationHandler.doTestDetails-seed#[C33F59A8F40DBABC]) [ ] o.a.s.c.CorePropertiesLocator Looking for core definitions underneath /Users/jenkins/workspace/Lucene-Solr-master-MacOSX/solr/build/solr-core/test/J1/temp/solr.handler.TestReplicationHandler_C33F59A8F40DBABC-001/solr-instance-001/.
[junit4] 2> 1821780 INFO (TEST-TestReplicationHandler.doTestDetails-seed#[C33F59A8F40DBABC]) [ ] o.a.s.c.CoreDescriptor Created CoreDescriptor: {name=collection1, config=solrconfig.xml, loadOnStartup=true, schema=schema.xml, configSetProperties=configsetprops.json, transient=false, dataDir=data/}
[junit4] 2> 1821780 INFO (TEST-TestReplicationHandler.doTestDetails-seed#[C33F59A8F40DBABC]) [ ] o.a.s.c.CorePropertiesLocator Found core collection1 in /Users/jenkins/workspace/Lucene-Solr-master-MacOSX/solr/build/solr-core/test/J1/temp/solr.handler.TestReplicationHandler_C33F59A8F40DBABC-001/solr-instance-001/./collection1
[junit4] 2> 1821780 INFO (TEST-TestReplicationHandler.doTestDetails-seed#[C33F59A8F40DBABC]) [ ] o.a.s.c.CorePropertiesLocator Found 1 core definitions
[junit4] 2> 1821781 INFO (coreLoadExecutor-5541-thread-1) [ ] o.a.s.c.SolrResourceLoader new SolrResourceLoader for directory: '/Users/jenkins/workspace/Lucene-Solr-master-MacOSX/solr/build/solr-core/test/J1/temp/solr.handler.TestReplicationHandler_C33F59A8F40DBABC-001/solr-instance-001/collection1'
[junit4] 2> 1821781 INFO (coreLoadExecutor-5541-thread-1) [ ] o.a.s.c.SolrResourceLoader JNDI not configured for solr (NoInitialContextEx)
[junit4] 2> 1821781 INFO (coreLoadExecutor-5541-thread-1) [ ] o.a.s.c.SolrResourceLoader solr home defaulted to 'solr/' (could not find system property or JNDI)
[junit4] 2> 1821784 INFO (TEST-TestReplicationHandler.doTestDetails-seed#[C33F59A8F40DBABC]) [ ] o.a.s.s.SolrDispatchFilter user.dir=/Users/jenkins/workspace/Lucene-Solr-master-MacOSX/solr/build/solr-core/test/J1
[junit4] 2> 1821784 INFO (TEST-TestReplicationHandler.doTestDetails-seed#[C33F59A8F40DBABC]) [ ] o.a.s.s.SolrDispatchFilter SolrDispatchFilter.init() done
[junit4] 2> 1821793 INFO (coreLoadExecutor-5541-thread-1) [ ] o.a.s.c.SolrConfig current version of requestparams : -1
[junit4] 2> 1821796 INFO (coreLoadExecutor-5541-thread-1) [ ] o.a.s.c.SolrConfig Using Lucene MatchVersion: 7.0.0
[junit4] 2> 1821801 INFO (coreLoadExecutor-5541-thread-1) [ ] o.a.s.c.SolrConfig Loaded SolrConfig: solrconfig.xml
[junit4] 2> 1821804 INFO (coreLoadExecutor-5541-thread-1) [ ] o.a.s.s.IndexSchema [collection1] Schema name=test
[junit4] 2> 1821808 INFO (coreLoadExecutor-5541-thread-1) [ ] o.a.s.s.IndexSchema unique key field: id
[junit4] 2> 1821812 INFO (coreLoadExecutor-5541-thread-1) [ ] o.a.s.c.ConfigSetProperties Did not find ConfigSet properties, assuming default properties: Can't find resource 'configsetprops.json' in classpath or '/Users/jenkins/workspace/Lucene-Solr-master-MacOSX/solr/build/solr-core/test/J1/temp/solr.handler.TestReplicationHandler_C33F59A8F40DBABC-001/solr-instance-001/collection1'
[junit4] 2> 1821812 INFO (coreLoadExecutor-5541-thread-1) [ ] o.a.s.c.CoreContainer Creating SolrCore 'collection1' using configuration from instancedir /Users/jenkins/workspace/Lucene-Solr-master-MacOSX/solr/build/solr-core/test/J1/temp/solr.handler.TestReplicationHandler_C33F59A8F40DBABC-001/solr-instance-001/./collection1
[junit4] 2> 1821813 INFO (coreLoadExecutor-5541-thread-1) [ x:collection1] o.a.s.c.SolrCore org.apache.solr.core.MockDirectoryFactory
[junit4] 2> 1821813 INFO (coreLoadExecutor-5541-thread-1) [ x:collection1] o.a.s.c.SolrCore [[collection1] ] Opening new SolrCore at [/Users/jenkins/workspace/Lucene-Solr-master-MacOSX/solr/build/solr-core/test/J1/temp/solr.handler.TestReplicationHandler_C33F59A8F40DBABC-001/solr-instance-001/collection1], dataDir=[/Users/jenkins/workspace/Lucene-Solr-master-MacOSX/solr/build/solr-core/test/J1/temp/solr.handler.TestReplicationHandler_C33F59A8F40DBABC-001/solr-instance-001/./collection1/data/]
[junit4] 2> 1821813 INFO (coreLoadExecutor-5541-thread-1) [ x:collection1] o.a.s.c.SolrCore JMX monitoring not detected for core: collection1
[junit4] 2> 1821813 INFO (coreLoadExecutor-5541-thread-1) [ x:collection1] o.a.s.c.CachingDirectoryFactory return new directory for /Users/jenkins/workspace/Lucene-Solr-master-MacOSX/solr/build/solr-core/test/J1/temp/solr.handler.TestReplicationHandler_C33F59A8F40DBABC-001/solr-instance-001/./collection1/data
[junit4] 2> 1821813 INFO (coreLoadExecutor-5541-thread-1) [ x:collection1] o.a.s.c.SolrCore New index directory detected: old=null new=/Users/jenkins/workspace/Lucene-Solr-master-MacOSX/solr/build/solr-core/test/J1/temp/solr.handler.TestReplicationHandler_C33F59A8F40DBABC-001/solr-instance-001/./collection1/data/index/
[junit4] 2> 1821813 WARN (coreLoadExecutor-5541-thread-1) [ x:collection1] o.a.s.c.SolrCore [collection1] Solr index directory '/Users/jenkins/workspace/Lucene-Solr-master-MacOSX/solr/build/solr-core/test/J1/temp/solr.handler.TestReplicationHandler_C33F59A8F40DBABC-001/solr-instance-001/./collection1/data/index' doesn't exist. Creating new index...
[junit4] 2> 1821814 INFO (coreLoadExecutor-5541-thread-1) [ x:collection1] o.a.s.c.CachingDirectoryFactory return new directory for /Users/jenkins/workspace/Lucene-Solr-master-MacOSX/solr/build/solr-core/test/J1/temp/solr.handler.TestReplicationHandler_C33F59A8F40DBABC-001/solr-instance-001/./collection1/data/index
[junit4] 2> 1821814 INFO (coreLoadExecutor-5541-thread-1) [ x:collection1] o.a.s.u.RandomMergePolicy RandomMergePolicy wrapping class org.apache.lucene.index.TieredMergePolicy: [TieredMergePolicy: maxMergeAtOnce=48, maxMergeAtOnceExplicit=35, maxMergedSegmentMB=15.96875, floorSegmentMB=1.439453125, forceMergeDeletesPctAllowed=6.611409783318349, segmentsPerTier=44.0, maxCFSSegmentSizeMB=8.796093022207999E12, noCFSRatio=0.0
[junit4] 2> 1821814 INFO (coreLoadExecutor-5541-thread-1) [ x:collection1] o.a.s.c.SolrDeletionPolicy SolrDeletionPolicy.onCommit: commits: num=1
[junit4] 2> commit{dir=MockDirectoryWrapper(RAMDirectory@3e130d6f lockFactory=org.apache.lucene.store.SingleInstanceLockFactory@e9a10ff),segFN=segments_1,generation=1}
[junit4] 2> 1821814 INFO (coreLoadExecutor-5541-thread-1) [ x:collection1] o.a.s.c.SolrDeletionPolicy newest commit generation = 1
[junit4] 2> 1821815 INFO (OldIndexDirectoryCleanupThreadForCore-collection1) [ x:collection1] o.a.s.c.SolrCore Looking for old index directories to cleanup for core collection1 in /Users/jenkins/workspace/Lucene-Solr-master-MacOSX/solr/build/solr-core/test/J1/temp/solr.handler.TestReplicationHandler_C33F59A8F40DBABC-001/solr-instance-001/./collection1/data/
[junit4] 2> 1821816 INFO (coreLoadExecutor-5541-thread-1) [ x:collection1] o.a.s.c.SolrCore no updateRequestProcessorChain defined as default, creating implicit default
[junit4] 2> 1821868 INFO (coreLoadExecutor-5541-thread-1) [ x:collection1] o.a.s.h.l.XMLLoader xsltCacheLifetimeSeconds=60
[junit4] 2> 1821869 INFO (coreLoadExecutor-5541-thread-1) [ x:collection1] o.a.s.h.l.XMLLoader xsltCacheLifetimeSeconds=60
[junit4] 2> 1821870 INFO (coreLoadExecutor-5541-thread-1) [ x:collection1] o.a.s.h.l.XMLLoader xsltCacheLifetimeSeconds=60
[junit4] 2> 1821871 INFO (coreLoadExecutor-5541-thread-1) [ x:collection1] o.a.s.h.l.XMLLoader xsltCacheLifetimeSeconds=60
[junit4] 2> 1821873 INFO (coreLoadExecutor-5541-thread-1) [ x:collection1] o.a.s.c.PluginBag requestHandler : 'lazy' created with startup=lazy
[junit4] 2> 1821873 INFO (coreLoadExecutor-5541-thread-1) [ x:collection1] o.a.s.c.RequestHandlers Registered paths: /admin/mbeans,standard,lazy,/update/json/docs,/admin/luke,/export,/get,/admin/properties,/update/json,/admin/threads,/update/csv,/sql,/graph,/admin/segments,/admin/system,/replication,defaults,/config,/stream,/schema,/admin/plugins,/admin/logging,/admin/ping,/update,/admin/file
[junit4] 2> 1821873 INFO (coreLoadExecutor-5541-thread-1) [ x:collection1] o.a.s.c.SolrCore Using default statsCache cache: org.apache.solr.search.stats.LocalStatsCache
[junit4] 2> 1821873 INFO (coreLoadExecutor-5541-thread-1) [ x:collection1] o.a.s.u.CommitTracker Hard AutoCommit: disabled
[junit4] 2> 1821873 INFO (coreLoadExecutor-5541-thread-1) [ x:collection1] o.a.s.u.CommitTracker Soft AutoCommit: disabled
[junit4] 2> 1821874 INFO (coreLoadExecutor-5541-thread-1) [ x:collection1] o.a.s.u.RandomMergePolicy RandomMergePolicy wrapping class org.apache.lucene.index.TieredMergePolicy: [TieredMergePolicy: maxMergeAtOnce=40, maxMergeAtOnceExplicit=44, maxMergedSegmentMB=57.2412109375, floorSegmentMB=1.2783203125, forceMergeDeletesPctAllowed=24.49156858341662, segmentsPerTier=33.0, maxCFSSegmentSizeMB=8.796093022207999E12, noCFSRatio=0.21734025840099438
[junit4] 2> 1821874 INFO (coreLoadExecutor-5541-thread-1) [ x:collection1] o.a.s.c.SolrDeletionPolicy SolrDeletionPolicy.onInit: commits: num=1
[junit4] 2> commit{dir=MockDirectoryWrapper(RAMDirectory@3e130d6f lockFactory=org.apache.lucene.store.SingleInstanceLockFactory@e9a10ff),segFN=segments_1,generation=1}
[junit4] 2> 1821874 INFO (coreLoadExecutor-5541-thread-1) [ x:collection1] o.a.s.c.SolrDeletionPolicy newest commit generation = 1
[junit4] 2> 1821874 INFO (coreLoadExecutor-5541-thread-1) [ x:collection1] o.a.s.s.SolrIndexSearcher Opening [Searcher@150e0f6[collection1] main]
[junit4] 2> 1821874 INFO (coreLoadExecutor-5541-thread-1) [ x:collection1] o.a.s.r.ManagedResourceStorage File-based storage initialized to use dir: /Users/jenkins/workspace/Lucene-Solr-master-MacOSX/solr/build/solr-core/test/J1/temp/solr.handler.TestReplicationHandler_C33F59A8F40DBABC-001/solr-instance-001/collection1/conf
[junit4] 2> 1821874 INFO (coreLoadExecutor-5541-thread-1) [ x:collection1] o.a.s.r.RestManager Initializing RestManager with initArgs: {storageDir=/Users/jenkins/workspace/Lucene-Solr-master-MacOSX/solr/build/solr-core/test/J1/temp/solr.handler.TestReplicationHandler_C33F59A8F40DBABC-001/solr-instance-001/collection1/conf}
[junit4] 2> 1821874 INFO (coreLoadExecutor-5541-thread-1) [ x:collection1] o.a.s.r.ManagedResourceStorage Reading _rest_managed.json using file:dir=/Users/jenkins/workspace/Lucene-Solr-master-MacOSX/solr/build/solr-core/test/J1/temp/solr.handler.TestReplicationHandler_C33F59A8F40DBABC-001/solr-instance-001/collection1/conf
[junit4] 2> 1821875 INFO (coreLoadExecutor-5541-thread-1) [ x:collection1] o.a.s.r.RestManager Initializing 0 registered ManagedResources
[junit4] 2> 1821875 INFO (coreLoadExecutor-5541-thread-1) [ x:collection1] o.a.s.h.ReplicationHandler Replication enabled for following config files: schema.xml,xslt/dummy.xsl
[junit4] 2> 1821875 INFO (coreLoadExecutor-5541-thread-1) [ x:collection1] o.a.s.h.ReplicationHandler Commits will be reserved for 10000
[junit4] 2> 1821875 INFO (searcherExecutor-5542-thread-1-processing-x:collection1) [ x:collection1] o.a.s.c.SolrCore [collection1] Registered new searcher Searcher@150e0f6[collection1] main{ExitableDirectoryReader(UninvertingDirectoryReader())}
[junit4] 2> 1821875 INFO (coreLoadExecutor-5541-thread-1) [ x:collection1] o.a.s.c.CoreContainer registering core: collection1
[junit4] 2> 1822295 INFO (TEST-TestReplicationHandler.doTestDetails-seed#[C33F59A8F40DBABC]) [ ] o.a.s.SolrTestCaseJ4 Writing core.properties file to /Users/jenkins/workspace/Lucene-Solr-master-MacOSX/solr/build/solr-core/test/J1/temp/solr.handler.TestReplicationHandler_C33F59A8F40DBABC-001/solr-instance-002/collection1
[junit4] 2> 1822340 INFO (TEST-TestReplicationHandler.doTestDetails-seed#[C33F59A8F40DBABC]) [ ] o.e.j.s.Server jetty-9.3.8.v20160314
[junit4] 2> 1822359 INFO (TEST-TestReplicationHandler.doTestDetails-seed#[C33F59A8F40DBABC]) [ ] o.e.j.s.h.ContextHandler Started o.e.j.s.ServletContextHandler@1f3a95e2{/solr,null,AVAILABLE}
[junit4] 2> 1822360 INFO (TEST-TestReplicationHandler.doTestDetails-seed#[C33F59A8F40DBABC]) [ ] o.e.j.s.ServerConnector Started ServerConnector@14ec67{HTTP/1.1,[http/1.1]}{127.0.0.1:64542}
[junit4] 2> 1822360 INFO (TEST-TestReplicationHandler.doTestDetails-seed#[C33F59A8F40DBABC]) [ ] o.e.j.s.Server Started @1827889ms
[junit4] 2> 1822360 INFO (TEST-TestReplicationHandler.doTestDetails-seed#[C33F59A8F40DBABC]) [ ] o.a.s.c.s.e.JettySolrRunner Jetty properties: {solr.data.dir=/Users/jenkins/workspace/Lucene-Solr-master-MacOSX/solr/build/solr-core/test/J1/temp/solr.handler.TestReplicationHandler_C33F59A8F40DBABC-001/solr-instance-002/collection1/data, hostContext=/solr, hostPort=64542}
[junit4] 2> 1822361 INFO (TEST-TestReplicationHandler.doTestDetails-seed#[C33F59A8F40DBABC]) [ ] o.a.s.s.SolrDispatchFilter SolrDispatchFilter.init(): sun.misc.Launcher$AppClassLoader@4554617c
[junit4] 2> 1822361 INFO (TEST-TestReplicationHandler.doTestDetails-seed#[C33F59A8F40DBABC]) [ ] o.a.s.c.SolrResourceLoader new SolrResourceLoader for directory: '/Users/jenkins/workspace/Lucene-Solr-master-MacOSX/solr/build/solr-core/test/J1/temp/solr.handler.TestReplicationHandler_C33F59A8F40DBABC-001/solr-instance-002'
[junit4] 2> 1822361 INFO (TEST-TestReplicationHandler.doTestDetails-seed#[C33F59A8F40DBABC]) [ ] o.a.s.c.SolrResourceLoader JNDI not configured for solr (NoInitialContextEx)
[junit4] 2> 1822361 INFO (TEST-TestReplicationHandler.doTestDetails-seed#[C33F59A8F40DBABC]) [ ] o.a.s.c.SolrResourceLoader solr home defaulted to 'solr/' (could not find system property or JNDI)
[junit4] 2> 1822362 INFO (TEST-TestReplicationHandler.doTestDetails-seed#[C33F59A8F40DBABC]) [ ] o.a.s.c.SolrXmlConfig Loading container configuration from /Users/jenkins/workspace/Lucene-Solr-master-MacOSX/solr/build/solr-core/test/J1/temp/solr.handler.TestReplicationHandler_C33F59A8F40DBABC-001/solr-instance-002/solr.xml
[junit4] 2> 1822384 INFO (TEST-TestReplicationHandler.doTestDetails-seed#[C33F59A8F40DBABC]) [ ] o.a.s.c.CorePropertiesLocator Config-defined core root directory: /Users/jenkins/workspace/Lucene-Solr-master-MacOSX/solr/build/solr-core/test/J1/temp/solr.handler.TestReplicationHandler_C33F59A8F40DBABC-001/solr-instance-002/.
[junit4] 2> 1822384 INFO (TEST-TestReplicationHandler.doTestDetails-seed#[C33F59A8F40DBABC]) [ ] o.a.s.c.CoreContainer New CoreContainer 210281689
[junit4] 2> 1822384 INFO (TEST-TestReplicationHandler.doTestDetails-seed#[C33F59A8F40DBABC]) [ ] o.a.s.c.CoreContainer Loading cores into CoreContainer [instanceDir=/Users/jenkins/workspace/Lucene-Solr-master-MacOSX/solr/build/solr-core/test/J1/temp/solr.handler.TestReplicationHandler_C33F59A8F40DBABC-001/solr-instance-002]
[junit4] 2> 1822384 WARN (TEST-TestReplicationHandler.doTestDetails-seed#[C33F59A8F40DBABC]) [ ] o.a.s.c.CoreContainer Couldn't add files from /Users/jenkins/workspace/Lucene-Solr-master-MacOSX/solr/build/solr-core/test/J1/temp/solr.handler.TestReplicationHandler_C33F59A8F40DBABC-001/solr-instance-002/lib to classpath: /Users/jenkins/workspace/Lucene-Solr-master-MacOSX/solr/build/solr-core/test/J1/temp/solr.handler.TestReplicationHandler_C33F59A8F40DBABC-001/solr-instance-002/lib
[junit4] 2> 1822385 INFO (TEST-TestReplicationHandler.doTestDetails-seed#[C33F59A8F40DBABC]) [ ] o.a.s.h.c.HttpShardHandlerFactory created with socketTimeout : 90000,urlScheme : ,connTimeout : 15000,maxConnectionsPerHost : 20,maxConnections : 10000,corePoolSize : 0,maximumPoolSize : 2147483647,maxThreadIdleTime : 5,sizeOfQueue : -1,fairnessPolicy : false,
[junit4] 2> 1822387 INFO (TEST-TestReplicationHandler.doTestDetails-seed#[C33F59A8F40DBABC]) [ ] o.a.s.u.UpdateShardHandler Created UpdateShardHandler HTTP client with params: socketTimeout=340000&connTimeout=45000&maxConnections=100000&maxConnectionsPerHost=100000
[junit4] 2> 1822387 INFO (TEST-TestReplicationHandler.doTestDetails-seed#[C33F59A8F40DBABC]) [ ] o.a.s.l.LogWatcher SLF4J impl is org.slf4j.impl.Log4jLoggerFactory
[junit4] 2> 1822387 INFO (TEST-TestReplicationHandler.doTestDetails-seed#[C33F59A8F40DBABC]) [ ] o.a.s.l.LogWatcher Registering Log Listener [Log4j (org.slf4j.impl.Log4jLoggerFactory)]
[junit4] 2> 1822387 INFO (TEST-TestReplicationHandler.doTestDetails-seed#[C33F59A8F40DBABC]) [ ] o.a.s.c.CoreContainer Security conf doesn't exist. Skipping setup for authorization module.
[junit4] 2> 1822387 INFO (TEST-TestReplicationHandler.doTestDetails-seed#[C33F59A8F40DBABC]) [ ] o.a.s.c.CoreContainer No authentication plugin used.
[junit4] 2> 1822388 INFO (TEST-TestReplicationHandler.doTestDetails-seed#[C33F59A8F40DBABC]) [ ] o.a.s.c.CorePropertiesLocator Looking for core definitions underneath /Users/jenkins/workspace/Lucene-Solr-master-MacOSX/solr/build/solr-core/test/J1/temp/solr.handler.TestReplicationHandler_C33F59A8F40DBABC-001/solr-instance-002/.
[junit4] 2> 1822390 INFO (TEST-TestReplicationHandler.doTestDetails-seed#[C33F59A8F40DBABC]) [ ] o.a.s.c.CoreDescriptor Created CoreDescriptor: {name=collection1, config=solrconfig.xml, loadOnStartup=true, schema=schema.xml, configSetProperties=configsetprops.json, transient=false, dataDir=data/}
[junit4] 2> 1822390 INFO (TEST-TestReplicationHandler.doTestDetails-seed#[C33F59A8F40DBABC]) [ ] o.a.s.c.CorePropertiesLocator Found core collection1 in /Users/jenkins/workspace/Lucene-Solr-master-MacOSX/solr/build/solr-core/test/J1/temp/solr.handler.TestReplicationHandler_C33F59A8F40DBABC-001/solr-instance-002/./collection1
[junit4] 2> 1822390 INFO (TEST-TestReplicationHandler.doTestDetails-seed#[C33F59A8F40DBABC]) [ ] o.a.s.c.CorePropertiesLocator Found 1 core definitions
[junit4] 2> 1822390 INFO (coreLoadExecutor-5551-thread-1) [ ] o.a.s.c.SolrResourceLoader new SolrResourceLoader for directory: '/Users/jenkins/workspace/Lucene-Solr-master-MacOSX/solr/build/solr-core/test/J1/temp/solr.handler.TestReplicationHandler_C33F59A8F40DBABC-001/solr-instance-002/collection1'
[junit4] 2> 1822390 INFO (TEST-TestReplicationHandler.doTestDetails-seed#[C33F59A8F40DBABC]) [ ] o.a.s.s.SolrDispatchFilter user.dir=/Users/jenkins/workspace/Lucene-Solr-master-MacOSX/solr/build/solr-core/test/J1
[junit4] 2> 1822391 INFO (TEST-TestReplicationHandler.doTestDetails-seed#[C33F59A8F40DBABC]) [ ] o.a.s.s.SolrDispatchFilter SolrDispatchFilter.init() done
[junit4] 2> 1822391 INFO (coreLoadExecutor-5551-thread-1) [ ] o.a.s.c.SolrResourceLoader JNDI not configured for solr (NoInitialContextEx)
[junit4] 2> 1822391 INFO (coreLoadExecutor-5551-thread-1) [ ] o.a.s.c.SolrResourceLoader solr home defaulted to 'solr/' (could not find system property or JNDI)
[junit4] 2> 1822398 INFO (coreLoadExecutor-5551-thread-1) [ ] o.a.s.c.SolrConfig current version of requestparams : -1
[junit4] 2> 1822400 INFO (coreLoadExecutor-5551-thread-1) [ ] o.a.s.c.SolrConfig Using Lucene MatchVersion: 7.0.0
[junit4] 2> 1822405 INFO (coreLoadExecutor-5551-thread-1) [ ] o.a.s.c.SolrConfig Loaded SolrConfig: solrconfig.xml
[junit4] 2> 1822407 INFO (coreLoadExecutor-5551-thread-1) [ ] o.a.s.s.IndexSchema [collection1] Schema name=test
[junit4] 2> 1822409 INFO (coreLoadExecutor-5551-thread-1) [ ] o.a.s.s.IndexSchema unique key field: id
[junit4] 2> 1822411 INFO (coreLoadExecutor-5551-thread-1) [ ] o.a.s.c.ConfigSetProperties Did not find ConfigSet properties, assuming default properties: Can't find resource 'configsetprops.json' in classpath or '/Users/jenkins/workspace/Lucene-Solr-master-MacOSX/solr/build/solr-core/test/J1/temp/solr.handler.TestReplicationHandler_C33F59A8F40DBABC-001/solr-instance-002/collection1'
[junit4] 2> 1822411 INFO (coreLoadExecutor-5551-thread-1) [ ] o.a.s.c.CoreContainer Creating SolrCore 'collection1' using configuration from instancedir /Users/jenkins/workspace/Lucene-Solr-master-MacOSX/solr/build/solr-core/test/J1/temp/solr.handler.TestReplicationHandler_C33F59A8F40DBABC-001/solr-instance-002/./collection1
[junit4] 2> 1822411 INFO (coreLoadExecutor-5551-thread-1) [ x:collection1] o.a.s.c.SolrCore org.apache.solr.core.MockDirectoryFactory
[junit4] 2> 1822411 INFO (coreLoadExecutor-5551-thread-1) [ x:collection1] o.a.s.c.SolrCore [[collection1] ] Opening new SolrCore at [/Users/jenkins/workspace/Lucene-Solr-master-MacOSX/solr/build/solr-core/test/J1/temp/solr.handler.TestReplicationHandler_C33F59A8F40DBABC-001/solr-instance-002/collection1], dataDir=[/Users/jenkins/workspace/Lucene-Solr-master-MacOSX/solr/build/solr-core/test/J1/temp/solr.handler.TestReplicationHandler_C33F59A8F40DBABC-001/solr-instance-002/./collection1/data/]
[junit4] 2> 1822411 INFO (coreLoadExecutor-5551-thread-1) [ x:collection1] o.a.s.c.SolrCore JMX monitoring not detected for core: collection1
[junit4] 2> 1822411 INFO (coreLoadExecutor-5551-thread-1) [ x:collection1] o.a.s.c.CachingDirectoryFactory return new directory for /Users/jenkins/workspace/Lucene-Solr-master-MacOSX/solr/build/solr-core/test/J1/temp/solr.handler.TestReplicationHandler_C33F59A8F40DBABC-001/solr-instance-002/./collection1/data
[junit4] 2> 1822411 INFO (coreLoadExecutor-5551-thread-1) [ x:collection1] o.a.s.c.SolrCore New index directory detected: old=null new=/Users/jenkins/workspace/Lucene-Solr-master-MacOSX/solr/build/solr-core/test/J1/temp/solr.handler.TestReplicationHandler_C33F59A8F40DBABC-001/solr-instance-002/./collection1/data/index/
[junit4] 2> 1822411 WARN (coreLoadExecutor-5551-thread-1) [ x:collection1] o.a.s.c.SolrCore [collection1] Solr index directory '/Users/jenkins/workspace/Lucene-Solr-master-MacOSX/solr/build/solr-core/test/J1/temp/solr.handler.TestReplicationHandler_C33F59A8F40DBABC-001/solr-instance-002/./collection1/data/index' doesn't exist. Creating new index...
[junit4] 2> 1822412 INFO (coreLoadExecutor-5551-thread-1) [ x:collection1] o.a.s.c.CachingDirectoryFactory return new directory for /Users/jenkins/workspace/Lucene-Solr-master-MacOSX/solr/build/solr-core/test/J1/temp/solr.handler.TestReplicationHandler_C33F59A8F40DBABC-001/solr-instance-002/./collection1/data/index
[junit4] 2> 1822412 INFO (coreLoadExecutor-5551-thread-1) [ x:collection1] o.a.s.u.RandomMergePolicy RandomMergePolicy wrapping class org.apache.lucene.index.TieredMergePolicy: [TieredMergePolicy: maxMergeAtOnce=48, maxMergeAtOnceExplicit=35, maxMergedSegmentMB=15.96875, floorSegmentMB=1.439453125, forceMergeDeletesPctAllowed=6.611409783318349, segmentsPerTier=44.0, maxCFSSegmentSizeMB=8.796093022207999E12, noCFSRatio=0.0
[junit4] 2> 1822412 INFO (coreLoadExecutor-5551-thread-1) [ x:collection1] o.a.s.c.SolrDeletionPolicy SolrDeletionPolicy.onCommit: commits: num=1
[junit4] 2> commit{dir=MockDirectoryWrapper(RAMDirectory@1afb04a9 lockFactory=org.apache.lucene.store.SingleInstanceLockFactory@1e4ee4df),segFN=segments_1,generation=1}
[junit4] 2> 1822412 INFO (coreLoadExecutor-5551-thread-1) [ x:collection1] o.a.s.c.SolrDeletionPolicy newest commit generation = 1
[junit4] 2> 1822412 INFO (OldIndexDirectoryCleanupThreadForCore-collection1) [ x:collection1] o.a.s.c.SolrCore Looking for old index directories to cleanup for core collection1 in /Users/jenkins/workspace/Lucene-Solr-master-MacOSX/solr/build/solr-core/test/J1/temp/solr.handler.TestReplicationHandler_C33F59A8F40DBABC-001/solr-instance-002/./collection1/data/
[junit4] 2> 1822414 INFO (coreLoadExecutor-5551-thread-1) [ x:collection1] o.a.s.c.SolrCore no updateRequestProcessorChain defined as default, creating implicit default
[junit4] 2> 1822415 INFO (coreLoadExecutor-5551-thread-1) [ x:collection1] o.a.s.h.l.XMLLoader xsltCacheLifetimeSeconds=60
[junit4] 2> 1822416 INFO (coreLoadExecutor-5551-thread-1) [ x:collection1] o.a.s.h.l.XMLLoader xsltCacheLifetimeSeconds=60
[junit4] 2> 1822416 INFO (coreLoadExecutor-5551-thread-1) [ x:collection1] o.a.s.h.l.XMLLoader xsltCacheLifetimeSeconds=60
[junit4] 2> 1822417 INFO (coreLoadExecutor-5551-thread-1) [ x:collection1] o.a.s.h.l.XMLLoader xsltCacheLifetimeSeconds=60
[junit4] 2> 1822419 INFO (coreLoadExecutor-5551-thread-1) [ x:collection1] o.a.s.c.PluginBag requestHandler : 'lazy' created with startup=lazy
[junit4] 2> 1822419 INFO (coreLoadExecutor-5551-thread-1) [ x:collection1] o.a.s.c.RequestHandlers Registered paths: /admin/mbeans,standard,lazy,/update/json/docs,/admin/luke,/export,/get,/admin/properties,/update/json,/admin/threads,/update/csv,/sql,/graph,/admin/segments,/admin/system,/replication,defaults,/config,/stream,/schema,/admin/plugins,/admin/logging,/admin/ping,/update,/admin/file
[junit4] 2> 1822419 INFO (coreLoadExecutor-5551-thread-1) [ x:collection1] o.a.s.c.SolrCore Using default statsCache cache: org.apache.solr.search.stats.LocalStatsCache
[junit4] 2> 1822419 INFO (coreLoadExecutor-5551-thread-1) [ x:collection1] o.a.s.u.CommitTracker Hard AutoCommit: disabled
[junit4] 2> 1822419 INFO (coreLoadExecutor-5551-thread-1) [ x:collection1] o.a.s.u.CommitTracker Soft AutoCommit: disabled
[junit4] 2> 1822420 INFO (coreLoadExecutor-5551-thread-1) [ x:collection1] o.a.s.u.RandomMergePolicy RandomMergePolicy wrapping class org.apache.lucene.index.TieredMergePolicy: [TieredMergePolicy: maxMergeAtOnce=40, maxMergeAtOnceExplicit=44, maxMergedSegmentMB=57.2412109375, floorSegmentMB=1.2783203125, forceMergeDeletesPctAllowed=24.49156858341662, segmentsPerTier=33.0, maxCFSSegmentSizeMB=8.796093022207999E12, noCFSRatio=0.21734025840099438
[junit4] 2> 1822420 INFO (coreLoadExecutor-5551-thread-1) [ x:collection1] o.a.s.c.SolrDeletionPolicy SolrDeletionPolicy.onInit: commits: num=1
[junit4] 2> commit{dir=MockDirectoryWrapper(RAMDirectory@1afb04a9 lockFactory=org.apache.lucene.store.SingleInstanceLockFactory@1e4ee4df),segFN=segments_1,generation=1}
[junit4] 2> 1822420 INFO (coreLoadExecutor-5551-thread-1) [ x:collection1] o.a.s.c.SolrDeletionPolicy newest commit generation = 1
[junit4] 2> 1822420 INFO (coreLoadExecutor-5551-thread-1) [ x:collection1] o.a.s.s.SolrIndexSearcher Opening [Searcher@e5cf6e9[collection1] main]
[junit4] 2> 1822420 INFO (coreLoadExecutor-5551-thread-1) [ x:collection1] o.a.s.r.ManagedResourceStorage File-based storage initialized to use dir: /Users/jenkins/workspace/Lucene-Solr-master-MacOSX/solr/build/solr-core/test/J1/temp/solr.handler.TestReplicationHandler_C33F59A8F40DBABC-001/solr-instance-002/collection1/conf
[junit4] 2> 1822420 INFO (coreLoadExecutor-5551-thread-1) [ x:collection1] o.a.s.r.RestManager Initializing RestManager with initArgs: {storageDir=/Users/jenkins/workspace/Lucene-Solr-master-MacOSX/solr/build/solr-core/test/J1/temp/solr.handler.TestReplicationHandler_C33F59A8F40DBABC-001/solr-instance-002/collection1/conf}
[junit4] 2> 1822420 INFO (coreLoadExecutor-5551-thread-1) [ x:collection1] o.a.s.r.ManagedResourceStorage Reading _rest_managed.json using file:dir=/Users/jenkins/workspace/Lucene-Solr-master-MacOSX/solr/build/solr-core/test/J1/temp/solr.handler.TestReplicationHandler_C33F59A8F40DBABC-001/solr-instance-002/collection1/conf
[junit4] 2> 1822420 INFO (coreLoadExecutor-5551-thread-1) [ x:collection1] o.a.s.r.RestManager Initializing 0 registered ManagedResources
[junit4] 2> 1822422 INFO (coreLoadExecutor-5551-thread-1) [ x:collection1] o.a.s.h.ReplicationHandler Poll scheduled at an interval of 1000ms
[junit4] 2> 1822422 INFO (searcherExecutor-5552-thread-1-processing-x:collection1) [ x:collection1] o.a.s.c.SolrCore [collection1] Registered new searcher Searcher@e5cf6e9[collection1] main{ExitableDirectoryReader(UninvertingDirectoryReader())}
[junit4] 2> 1822422 INFO (coreLoadExecutor-5551-thread-1) [ x:collection1] o.a.s.c.CoreContainer registering core: collection1
[junit4] 2> 1822833 INFO (qtp1336489633-12942) [ x:collection1] o.a.s.c.S.Request [collection1] webapp=/solr path=/replication params={qt=/replication&wt=javabin&version=2&command=indexversion} status=0 QTime=0
[junit4] 2> 1822895 INFO (qtp1336489633-12944) [ x:collection1] o.a.s.c.S.Request [collection1] webapp=/solr path=/select params={q=*:*&sort=id+desc&wt=javabin&version=2} hits=0 status=0 QTime=0
[junit4] 2> 1822897 INFO (qtp1336489633-12945) [ x:collection1] o.a.s.c.S.Request [collection1] webapp=/solr path=/replication params={_trace=getDetails&qt=/replication&wt=javabin&version=2&command=details} status=0 QTime=0
[junit4] 2> 1822900 INFO (qtp1336489633-12946) [ x:collection1] o.a.s.c.S.Request [collection1] webapp=/solr path=/replication params={slave=false&qt=/replication&wt=javabin&version=2&command=details} status=0 QTime=0
[junit4] 2> 1822901 INFO (qtp662528020-12961) [ x:collection1] o.a.s.c.S.Request [collection1] webapp=/solr path=/replication params={_trace=getDetails&qt=/replication&wt=javabin&version=2&command=details} status=0 QTime=1
[junit4] 2> 1822902 INFO (qtp1336489633-12947) [ x:collection1] o.a.s.u.p.LogUpdateProcessorFactory [collection1] webapp=/solr path=/update params={wt=javabin&version=2}{add=[0]} 0 0
[junit4] 2> 1822903 INFO (qtp1336489633-12940) [ x:collection1] o.a.s.u.DirectUpdateHandler2 start commit{,optimize=false,openSearcher=true,waitSearcher=true,expungeDeletes=false,softCommit=false,prepareCommit=false}
[junit4] 2> 1822904 INFO (qtp1336489633-12940) [ x:collection1] o.a.s.c.SolrDeletionPolicy SolrDeletionPolicy.onCommit: commits: num=2
[junit4] 2> commit{dir=MockDirectoryWrapper(RAMDirectory@3e130d6f lockFactory=org.apache.lucene.store.SingleInstanceLockFactory@e9a10ff),segFN=segments_1,generation=1}
[junit4] 2> commit{dir=MockDirectoryWrapper(RAMDirectory@3e130d6f lockFactory=org.apache.lucene.store.SingleInstanceLockFactory@e9a10ff),segFN=segments_2,generation=2}
[junit4] 2> 1822905 INFO (qtp1336489633-12940) [ x:collection1] o.a.s.c.SolrDeletionPolicy newest commit generation = 2
[junit4] 2> 1822905 INFO (qtp1336489633-12940) [ x:collection1] o.a.s.s.SolrIndexSearcher Opening [Searcher@7b46cbaa[collection1] main]
[junit4] 2> 1822905 INFO (qtp1336489633-12940) [ x:collection1] o.a.s.u.DirectUpdateHandler2 end_commit_flush
[junit4] 2> 1822906 INFO (searcherExecutor-5542-thread-1-processing-x:collection1) [ x:collection1] o.a.s.c.SolrCore [collection1] Registered new searcher Searcher@7b46cbaa[collection1] main{ExitableDirectoryReader(UninvertingDirectoryReader(Uninverting(_0(7.0.0):c1)))}
[junit4] 2> 1822906 INFO (qtp1336489633-12940) [ x:collection1] o.a.s.u.p.LogUpdateProcessorFactory [collection1] webapp=/solr path=/update params={waitSearcher=true&commit=true&softCommit=false&wt=javabin&version=2}{commit=} 0 3
[junit4] 2> 1822911 WARN (explicit-fetchindex-cmd) [ x:collection1] o.a.s.h.IndexFetcher 'masterUrl' must be specified without the /replication suffix
[junit4] 2> 1822912 INFO (qtp1336489633-12942) [ x:collection1] o.a.s.c.S.Request [collection1] webapp=/solr path=/replication params={qt=/replication&wt=javabin&version=2&command=indexversion} status=0 QTime=0
[junit4] 2> 1822912 INFO (explicit-fetchindex-cmd) [ x:collection1] o.a.s.h.IndexFetcher Master's generation: 2
[junit4] 2> 1822912 INFO (explicit-fetchindex-cmd) [ x:collection1] o.a.s.h.IndexFetcher Slave's generation: 1
[junit4] 2> 1822912 INFO (explicit-fetchindex-cmd) [ x:collection1] o.a.s.h.IndexFetcher Starting replication process
[junit4] 2> 1822914 INFO (qtp1336489633-12943) [ x:collection1] o.a.s.c.S.Request [collection1] webapp=/solr path=/replication params={generation=2&qt=/replication&wt=javabin&version=2&command=filelist} status=0 QTime=1
[junit4] 2> 1822914 INFO (explicit-fetchindex-cmd) [ x:collection1] o.a.s.h.IndexFetcher Number of files in latest index in master: 4
[junit4] 2> 1822915 INFO (explicit-fetchindex-cmd) [ x:collection1] o.a.s.c.CachingDirectoryFactory return new directory for /Users/jenkins/workspace/Lucene-Solr-master-MacOSX/solr/build/solr-core/test/J1/temp/solr.handler.TestReplicationHandler_C33F59A8F40DBABC-001/solr-instance-002/./collection1/data/index.20160702143904729
[junit4] 2> 1822915 INFO (explicit-fetchindex-cmd) [ x:collection1] o.a.s.u.DefaultSolrCoreState Rollback old IndexWriter... core=collection1
[junit4] 2> 1822915 INFO (explicit-fetchindex-cmd) [ x:collection1] o.a.s.u.RandomMergePolicy RandomMergePolicy wrapping class org.apache.lucene.index.LogByteSizeMergePolicy: [LogByteSizeMergePolicy: minMergeSize=1677721, mergeFactor=20, maxMergeSize=2147483648, maxMergeSizeForForcedMerge=9223372036854775807, calibrateSizeByDeletes=true, maxMergeDocs=2147483647, maxCFSSegmentSizeMB=8.796093022207999E12, noCFSRatio=0.0]
[junit4] 2> 1822916 INFO (explicit-fetchindex-cmd) [ x:collection1] o.a.s.c.SolrDeletionPolicy SolrDeletionPolicy.onInit: commits: num=1
[junit4] 2> commit{dir=MockDirectoryWrapper(RAMDirectory@1afb04a9 lockFactory=org.apache.lucene.store.SingleInstanceLockFactory@1e4ee4df),segFN=segments_1,generation=1}
[junit4] 2> 1822916 INFO (explicit-fetchindex-cmd) [ x:collection1] o.a.s.c.SolrDeletionPolicy newest commit generation = 1
[junit4] 2> 1822916 INFO (explicit-fetchindex-cmd) [ x:collection1] o.a.s.u.DefaultSolrCoreState New IndexWriter is ready to be used.
[junit4] 2> 1822917 INFO (explicit-fetchindex-cmd) [ x:collection1] o.a.s.c.SolrDeletionPolicy SolrDeletionPolicy.onCommit: commits: num=1
[junit4] 2> commit{dir=MockDirectoryWrapper(RAMDirectory@1afb04a9 lockFactory=org.apache.lucene.store.SingleInstanceLockFactory@1e4ee4df),segFN=segments_1,generation=1}
[junit4] 2> 1822917 INFO (explicit-fetchindex-cmd) [ x:collection1] o.a.s.c.SolrDeletionPolicy newest commit generation = 1
[junit4] 2> 1822917 INFO (explicit-fetchindex-cmd) [ x:collection1] o.a.s.u.DefaultSolrCoreState Rollback old IndexWriter... core=collection1
[junit4] 2> 1822917 INFO (explicit-fetchindex-cmd) [ x:collection1] o.a.s.h.IndexFetcher Starting download (fullCopy=false) to MockDirectoryWrapper(RAMDirectory@698f323e lockFactory=org.apache.lucene.store.SingleInstanceLockFactory@3c783b92)
[junit4] 2> 1822918 INFO (qtp1336489633-12944) [ x:collection1] o.a.s.c.S.Request [collection1] webapp=/solr path=/replication params={generation=2&qt=/replication&file=_0.cfe&checksum=true&wt=filestream&command=filecontent} status=0 QTime=0
[junit4] 2> 1822920 INFO (qtp1336489633-12945) [ x:collection1] o.a.s.c.S.Request [collection1] webapp=/solr path=/replication params={generation=2&qt=/replication&file=_0.si&checksum=true&wt=filestream&command=filecontent} status=0 QTime=0
[junit4] 2> 1822922 INFO (qtp1336489633-12946) [ x:collection1] o.a.s.c.S.Request [collection1] webapp=/solr path=/replication params={generation=2&qt=/replication&file=_0.cfs&checksum=true&wt=filestream&command=filecontent} status=0 QTime=0
[junit4] 2> 1822923 INFO (qtp1336489633-12947) [ x:collection1] o.a.s.c.S.Request [collection1] webapp=/solr path=/replication params={generation=2&qt=/replication&file=segments_2&checksum=true&wt=filestream&command=filecontent} status=0 QTime=0
[junit4] 2> 1822924 INFO (explicit-fetchindex-cmd) [ x:collection1] o.a.s.h.IndexFetcher Total time taken for download (fullCopy=false,bytesDownloaded=1897) : 0 secs (null bytes/sec) to MockDirectoryWrapper(RAMDirectory@698f323e lockFactory=org.apache.lucene.store.SingleInstanceLockFactory@3c783b92)
[junit4] 2> 1822925 INFO (explicit-fetchindex-cmd) [ x:collection1] o.a.s.u.RandomMergePolicy RandomMergePolicy wrapping class org.apache.lucene.index.TieredMergePolicy: [TieredMergePolicy: maxMergeAtOnce=48, maxMergeAtOnceExplicit=26, maxMergedSegmentMB=65.9228515625, floorSegmentMB=0.8330078125, forceMergeDeletesPctAllowed=2.9902338197920955, segmentsPerTier=20.0, maxCFSSegmentSizeMB=8.796093022207999E12, noCFSRatio=0.31486047874177914
[junit4] 2> 1822925 INFO (explicit-fetchindex-cmd) [ x:collection1] o.a.s.c.SolrDeletionPolicy SolrDeletionPolicy.onInit: commits: num=2
[junit4] 2> commit{dir=MockDirectoryWrapper(RAMDirectory@1afb04a9 lockFactory=org.apache.lucene.store.SingleInstanceLockFactory@1e4ee4df),segFN=segments_1,generation=1}
[junit4] 2> commit{dir=MockDirectoryWrapper(RAMDirectory@1afb04a9 lockFactory=org.apache.lucene.store.SingleInstanceLockFactory@1e4ee4df),segFN=segments_2,generation=2}
[junit4] 2> 1822925 INFO (explicit-fetchindex-cmd) [ x:collection1] o.a.s.c.SolrDeletionPolicy newest commit generation = 2
[junit4] 2> 1822926 INFO (explicit-fetchindex-cmd) [ x:collection1] o.a.s.u.DefaultSolrCoreState New IndexWriter is ready to be used.
[junit4] 2> 1822926 INFO (explicit-fetchindex-cmd) [ x:collection1] o.a.s.s.SolrIndexSearcher Opening [Searcher@680860ba[collection1] main]
[junit4] 2> 1822926 INFO (searcherExecutor-5552-thread-1-processing-x:collection1) [ x:collection1] o.a.s.c.SolrCore [collection1] Registered new searcher Searcher@680860ba[collection1] main{ExitableDirectoryReader(UninvertingDirectoryReader(Uninverting(_0(7.0.0):c1)))}
[junit4] 2> 1822926 INFO (explicit-fetchindex-cmd) [ x:collection1] o.a.s.c.CachingDirectoryFactory looking to close /Users/jenkins/workspace/Lucene-Solr-master-MacOSX/solr/build/solr-core/test/J1/temp/solr.handler.TestReplicationHandler_C33F59A8F40DBABC-001/solr-instance-002/./collection1/data/index.20160702143904729 [CachedDir<<refCount=0;path=/Users/jenkins/workspace/Lucene-Solr-master-MacOSX/solr/build/solr-core/test/J1/temp/solr.handler.TestReplicationHandler_C33F59A8F40DBABC-001/solr-instance-002/./collection1/data/index.20160702143904729;done=true>>]
[junit4] 2> 1822926 INFO (explicit-fetchindex-cmd) [ x:collection1] o.a.s.c.CachingDirectoryFactory Closing directory, CoreContainer#isShutdown=false
[junit4] 2> 1822927 INFO (explicit-fetchindex-cmd) [ x:collection1] o.a.s.c.CachingDirectoryFactory Closing directory: /Users/jenkins/workspace/Lucene-Solr-master-MacOSX/solr/build/solr-core/test/J1/temp/solr.handler.TestReplicationHandler_C33F59A8F40DBABC-001/solr-instance-002/./collection1/data/index.20160702143904729
[junit4] 2> 1822927 INFO (qtp662528020-12962) [ x:collection1] o.a.s.c.S.Request [collection1] webapp=/solr path=/replication params={wait=true&masterUrl=http://127.0.0.1:64541/solr/collection1/replication&command=fetchindex} status=0 QTime=16
[junit4] 2> 1822964 INFO (qtp1336489633-12940) [ x:collection1] o.a.s.c.S.Request [collection1] webapp=/solr path=/replication params={slave=false&qt=/replication&wt=javabin&version=2&command=details} status=0 QTime=0
[junit4] 2> 1822964 INFO (qtp662528020-12964) [ x:collection1] o.a.s.c.S.Request [collection1] webapp=/solr path=/replication params={_trace=getDetails&qt=/replication&wt=javabin&version=2&command=details} status=0 QTime=1
[junit4] 2> 1822966 INFO (qtp1336489633-12942) [ x:collection1] o.a.s.u.p.LogUpdateProcessorFactory [collection1] webapp=/solr path=/update params={wt=javabin&version=2}{add=[1]} 0 1
[junit4] 2> 1822967 INFO (qtp1336489633-12943) [ x:collection1] o.a.s.u.DirectUpdateHandler2 start commit{,optimize=false,openSearcher=true,waitSearcher=true,expungeDeletes=false,softCommit=false,prepareCommit=false}
[junit4] 2> 1822971 INFO (qtp1336489633-12943) [ x:collection1] o.a.s.c.SolrDeletionPolicy SolrDeletionPolicy.onCommit: commits: num=3
[junit4] 2> commit{dir=MockDirectoryWrapper(RAMDirectory@3e130d6f lockFactory=org.apache.lucene.store.SingleInstanceLockFactory@e9a10ff),segFN=segments_1,generation=1}
[junit4] 2> commit{dir=MockDirectoryWrapper(RAMDirectory@3e130d6f lockFactory=org.apache.lucene.store.SingleInstanceLockFactory@e9a10ff),segFN=segments_2,generation=2}
[junit4] 2> commit{dir=MockDirectoryWrapper(RAMDirectory@3e130d6f lockFactory=org.apache.lucene.store.SingleInstanceLockFactory@e9a10ff),segFN=segments_3,generation=3}
[junit4] 2> 1822971 INFO (qtp1336489633-12943) [ x:collection1] o.a.s.c.SolrDeletionPolicy newest commit generation = 3
[junit4] 2> 1822971 INFO (qtp1336489633-12943) [ x:collection1] o.a.s.s.SolrIndexSearcher Opening [Searcher@191f27bf[collection1] main]
[junit4] 2> 1822971 INFO (qtp1336489633-12943) [ x:collection1] o.a.s.u.DirectUpdateHandler2 end_commit_flush
[junit4] 2> 1822971 INFO (searcherExecutor-5542-thread-1-processing-x:collection1) [ x:collection1] o.a.s.c.SolrCore [collection1] Registered new searcher Searcher@191f27bf[collection1] main{ExitableDirectoryReader(UninvertingDirectoryReader(Uninverting(_0(7.0.0):c1) Uninverting(_1(7.0.0):c1)))}
[junit4] 2> 1822971 INFO (qtp1336489633-12943) [ x:collection1] o.a.s.u.p.LogUpdateProcessorFactory [collection1] webapp=/solr path=/update params={waitSearcher=true&commit=true&softCommit=false&wt=javabin&version=2}{commit=} 0 4
[junit4] 2> 1822973 WARN (explicit-fetchindex-cmd) [ x:collection1] o.a.s.h.IndexFetcher 'masterUrl' must be specified without the /replication suffix
[junit4] 2> 1822974 INFO (qtp1336489633-12944) [ x:collection1] o.a.s.c.S.Request [collection1] webapp=/solr path=/replication params={qt=/replication&wt=javabin&version=2&command=indexversion} status=0 QTime=0
[junit4] 2> 1822974 INFO (explicit-fetchindex-cmd) [ x:collection1] o.a.s.h.IndexFetcher Master's generation: 3
[junit4] 2> 1822974 INFO (explicit-fetchindex-cmd) [ x:collection1] o.a.s.h.IndexFetcher Slave's generation: 2
[junit4] 2> 1822974 INFO (explicit-fetchindex-cmd) [ x:collection1] o.a.s.h.IndexFetcher Starting replication process
[junit4] 2> 1822976 INFO (qtp1336489633-12945) [ x:collection1] o.a.s.c.S.Request [collection1] webapp=/solr path=/replication params={generation=3&qt=/replication&wt=javabin&version=2&command=filelist} status=0 QTime=1
[junit4] 2> 1822976 INFO (explicit-fetchindex-cmd) [ x:collection1] o.a.s.h.IndexFetcher Number of files in latest index in master: 7
[junit4] 2> 1822976 INFO (explicit-fetchindex-cmd) [ x:collection1] o.a.s.c.CachingDirectoryFactory return new directory for /Users/jenkins/workspace/Lucene-Solr-master-MacOSX/solr/build/solr-core/test/J1/temp/solr.handler.TestReplicationHandler_C33F59A8F40DBABC-001/solr-instance-002/./collection1/data/index.20160702143904791
[junit4] 2> 1822977 INFO (explicit-fetchindex-cmd) [ x:collection1] o.a.s.u.DefaultSolrCoreState Rollback old IndexWriter... core=collection1
[junit4] 2> 1822978 INFO (explicit-fetchindex-cmd) [ x:collection1] o.a.s.u.RandomMergePolicy RandomMergePolicy wrapping class org.apache.lucene.index.LogByteSizeMergePolicy: [LogByteSizeMergePolicy: minMergeSize=1677721, mergeFactor=20, maxMergeSize=2147483648, maxMergeSizeForForcedMerge=9223372036854775807, calibrateSizeByDeletes=true, maxMergeDocs=2147483647, maxCFSSegmentSizeMB=8.796093022207999E12, noCFSRatio=0.0]
[junit4] 2> 1822978 INFO (explicit-fetchindex-cmd) [ x:collection1] o.a.s.c.SolrDeletionPolicy SolrDeletionPolicy.onInit: commits: num=1
[junit4] 2> commit{dir=MockDirectoryWrapper(RAMDirectory@1afb04a9 lockFactory=org.apache.lucene.store.SingleInstanceLockFactory@1e4ee4df),segFN=segments_2,generation=2}
[junit4] 2> 1822978 INFO (explicit-fetchindex-cmd) [ x:collection1] o.a.s.c.SolrDeletionPolicy newest commit generation = 2
[junit4] 2> 1822978 INFO (explicit-fetchindex-cmd) [ x:collection1] o.a.s.u.DefaultSolrCoreState New IndexWriter is ready to be used.
[junit4] 2> 1822978 INFO (explicit-fetchindex-cmd) [ x:collection1] o.a.s.c.SolrDeletionPolicy SolrDeletionPolicy.onCommit: commits: num=1
[junit4] 2> commit{dir=MockDirectoryWrapper(RAMDirectory@1afb04a9 lockFactory=org.apache.lucene.store.SingleInstanceLockFactory@1e4ee4df),segFN=segments_2,generation=2}
[junit4] 2> 1822978 INFO (explicit-fetchindex-cmd) [ x:collection1] o.a.s.c.SolrDeletionPolicy newest commit generation = 2
[junit4] 2> 1822978 INFO (explicit-fetchindex-cmd) [ x:collection1] o.a.s.u.DefaultSolrCoreState Rollback old IndexWriter... core=collection1
[junit4] 2> 1822978 INFO (explicit-fetchindex-cmd) [ x:collection1] o.a.s.h.IndexFetcher Starting download (fullCopy=false) to MockDirectoryWrapper(RAMDirectory@78072883 lockFactory=org.apache.lucene.store.SingleInstanceLockFactory@5e4ee440)
[junit4] 2> 1822978 INFO (explicit-fetchindex-cmd) [ x:collection1] o.a.s.h.IndexFetcher Skipping download for _0.cfe because it already exists
[junit4] 2> 1822978 INFO (explicit-fetchindex-cmd) [ x:collection1] o.a.s.h.IndexFetcher Skipping download for _0.si because it already exists
[junit4] 2> 1822979 INFO (explicit-fetchindex-cmd) [ x:collection1] o.a.s.h.IndexFetcher Skipping download for _0.cfs because it already exists
[junit4] 2> 1822979 INFO (qtp1336489633-12946) [ x:collection1] o.a.s.c.S.Request [collection1] webapp=/solr path=/replication params={generation=3&qt=/replication&file=_1.cfs&checksum=true&wt=filestream&command=filecontent} status=0 QTime=0
[junit4] 2> 1822980 INFO (qtp1336489633-12947) [ x:collection1] o.a.s.c.S.Request [collection1] webapp=/solr path=/replication params={generation=3&qt=/replication&file=_1.cfe&checksum=true&wt=filestream&command=filecontent} status=0 QTime=0
[junit4] 2> 1822982 INFO (qtp1336489633-12940) [ x:collection1] o.a.s.c.S.Request [collection1] webapp=/solr path=/replication params={generation=3&qt=/replication&file=_1.si&checksum=true&wt=filestream&command=filecontent} status=0 QTime=0
[junit4] 2> 1822983 INFO (qtp1336489633-12942) [ x:collection1] o.a.s.c.S.Request [collection1] webapp=/solr path=/replication params={generation=3&qt=/replication&file=segments_3&checksum=true&wt=filestream&command=filecontent} status=0 QTime=0
[junit4] 2> 1822984 INFO (explicit-fetchindex-cmd) [ x:collection1] o.a.s.h.IndexFetcher Total time taken for download (fullCopy=false,bytesDownloaded=1960) : 0 secs (null bytes/sec) to MockDirectoryWrapper(RAMDirectory@78072883 lockFactory=org.apache.lucene.store.SingleInstanceLockFactory@5e4ee440)
[junit4] 2> 1822985 WARN (explicit-fetchindex-cmd) [ x:collection1] o.a.s.h.IndexFetcher Exception while updating statistics
[junit4] 2> java.io.IOException: file "replication.properties" was already written to
[junit4] 2> at org.apache.lucene.store.MockDirectoryWrapper.createOutput(MockDirectoryWrapper.java:640)
[junit4] 2> at org.apache.solr.handler.IndexFetcher.logReplicationTimeAndConfFiles(IndexFetcher.java:683)
[junit4] 2> at org.apache.solr.handler.IndexFetcher.fetchLatestIndex(IndexFetcher.java:495)
[junit4] 2> at org.apache.solr.handler.IndexFetcher.fetchLatestIndex(IndexFetcher.java:265)
[junit4] 2> at org.apache.solr.handler.ReplicationHandler.doFetch(ReplicationHandler.java:393)
[junit4] 2> at org.apache.solr.handler.ReplicationHandler$1.run(ReplicationHandler.java:281)
[junit4] 2> 1822985 INFO (explicit-fetchindex-cmd) [ x:collection1] o.a.s.u.RandomMergePolicy RandomMergePolicy wrapping class org.apache.lucene.index.TieredMergePolicy: [TieredMergePolicy: maxMergeAtOnce=48, maxMergeAtOnceExplicit=26, maxMergedSegmentMB=65.9228515625, floorSegmentMB=0.8330078125, forceMergeDeletesPctAllowed=2.9902338197920955, segmentsPerTier=20.0, maxCFSSegmentSizeMB=8.796093022207999E12, noCFSRatio=0.31486047874177914
[junit4] 2> 1822985 INFO (explicit-fetchindex-cmd) [ x:collection1] o.a.s.c.SolrDeletionPolicy SolrDeletionPolicy.onInit: commits: num=2
[junit4] 2> commit{dir=MockDirectoryWrapper(RAMDirectory@1afb04a9 lockFactory=org.apache.lucene.store.SingleInstanceLockFactory@1e4ee4df),segFN=segments_2,generation=2}
[junit4] 2> commit{dir=MockDirectoryWrapper(RAMDirectory@1afb04a9 lockFactory=org.apache.lucene.store.SingleInstanceLockFactory@1e4ee4df),segFN=segments_3,generation=3}
[junit4] 2> 1822985 INFO (explicit-fetchindex-cmd) [ x:collection1] o.a.s.c.SolrDeletionPolicy newest commit generation = 3
[junit4] 2> 1822986 INFO (explicit-fetchindex-cmd) [ x:collection1] o.a.s.u.DefaultSolrCoreState New IndexWriter is ready to be used.
[junit4] 2> 1822986 INFO (explicit-fetchindex-cmd) [ x:collection1] o.a.s.s.SolrIndexSearcher Opening [Searcher@12ee0596[collection1] main]
[junit4] 2> 1822986 INFO (searcherExecutor-5552-thread-1-processing-x:collection1) [ x:collection1] o.a.s.c.SolrCore [collection1] Registered new searcher Searcher@12ee0596[collection1] main{ExitableDirectoryReader(UninvertingDirectoryReader(Uninverting(_0(7.0.0):c1) Uninverting(_1(7.0.0):c1)))}
[junit4] 2> 1822987 INFO (explicit-fetchindex-cmd) [ x:collection1] o.a.s.c.CachingDirectoryFactory looking to close /Users/jenkins/workspace/Lucene-Solr-master-MacOSX/solr/build/solr-core/test/J1/temp/solr.handler.TestReplicationHandler_C33F59A8F40DBABC-001/solr-instance-002/./collection1/data/index.20160702143904791 [CachedDir<<refCount=0;path=/Users/jenkins/workspace/Lucene-Solr-master-MacOSX/solr/build/solr-core/test/J1/temp/solr.handler.TestReplicationHandler_C33F59A8F40DBABC-001/solr-instance-002/./collection1/data/index.20160702143904791;done=true>>]
[junit4] 2> 1822987 INFO (explicit-fetchindex-cmd) [ x:collection1] o.a.s.c.CachingDirectoryFactory Closing directory, CoreContainer#isShutdown=false
[junit4] 2> 1822987 INFO (explicit-fetchindex-cmd) [ x:collection1] o.a.s.c.CachingDirectoryFactory Closing directory: /Users/jenkins/workspace/Lucene-Solr-master-MacOSX/solr/build/solr-core/test/J1/temp/solr.handler.TestReplicationHandler_C33F59A8F40DBABC-001/solr-instance-002/./collection1/data/index.20160702143904791
[junit4] 2> 1822987 INFO (qtp662528020-12965) [ x:collection1] o.a.s.c.S.Request [collection1] webapp=/solr path=/replication params={wait=true&masterUrl=http://127.0.0.1:64541/solr/collection1/replication&command=fetchindex} status=0 QTime=14
[junit4] 2> 1822990 INFO (qtp1336489633-12943) [ x:collection1] o.a.s.c.S.Request [collection1] webapp=/solr path=/replication params={slave=false&qt=/replication&wt=javabin&version=2&command=details} status=0 QTime=0
[junit4] 2> 1822990 INFO (qtp662528020-12966) [ x:collection1] o.a.s.c.S.Request [collection1] webapp=/solr path=/replication params={_trace=getDetails&qt=/replication&wt=javabin&version=2&command=details} status=0 QTime=1
[junit4] 2> 1822991 INFO (qtp1336489633-12944) [ x:collection1] o.a.s.u.p.LogUpdateProcessorFactory [collection1] webapp=/solr path=/update params={wt=javabin&version=2}{add=[2]} 0 0
[junit4] 2> 1822992 INFO (qtp1336489633-12945) [ x:collection1] o.a.s.u.DirectUpdateHandler2 start commit{,optimize=false,openSearcher=true,waitSearcher=true,expungeDeletes=false,softCommit=false,prepareCommit=false}
[junit4] 2> 1822993 INFO (qtp1336489633-12945) [ x:collection1] o.a.s.c.SolrDeletionPolicy SolrDeletionPolicy.onCommit: commits: num=4
[junit4] 2> commit{dir=MockDirectoryWrapper(RAMDirectory@3e130d6f lockFactory=org.apache.lucene.store.SingleInstanceLockFactory@e9a10ff),segFN=segments_1,generation=1}
[junit4] 2> commit{dir=MockDirectoryWrapper(RAMDirectory@3e130d6f lockFactory=org.apache.lucene.store.SingleInstanceLockFactory@e9a10ff),segFN=segments_2,generation=2}
[junit4] 2> commit{dir=MockDirectoryWrapper(RAMDirectory@3e130d6f lockFactory=org.apache.lucene.store.SingleInstanceLockFactory@e9a10ff),segFN=segments_3,generation=3}
[junit4] 2> commit{dir=MockDirectoryWrapper(RAMDirectory@3e130d6f lockFactory=org.apache.lucene.store.SingleInstanceLockFactory@e9a10ff),segFN=segments_4,generation=4}
[junit4] 2> 1822993 INFO (qtp1336489633-12945) [ x:collection1] o.a.s.c.SolrDeletionPolicy newest commit generation = 4
[junit4] 2> 1822993 INFO (qtp1336489633-12945) [ x:collection1] o.a.s.s.SolrIndexSearcher Opening [Searcher@60a2f595[collection1] main]
[junit4] 2> 1822994 INFO (qtp1336489633-12945) [ x:collection1] o.a.s.u.DirectUpdateHandler2 end_commit_flush
[junit4] 2> 1822994 INFO (searcherExecutor-5542-thread-1-processing-x:collection1) [ x:collection1] o.a.s.c.SolrCore [collection1] Registered new searcher Searcher@60a2f595[collection1] main{ExitableDirectoryReader(UninvertingDirectoryReader(Uninverting(_0(7.0.0):c1) Uninverting(_1(7.0.0):c1) Uninverting(_2(7.0.0):c1)))}
[junit4] 2> 1822994 INFO (qtp1336489633-12945) [ x:collection1] o.a.s.u.p.LogUpdateProcessorFactory [collection1] webapp=/solr path=/update params={waitSearcher=true&commit=true&softCommit=false&wt=javabin&version=2}{commit=} 0 2
[junit4] 2> 1822995 WARN (explicit-fetchindex-cmd) [ x:collection1] o.a.s.h.IndexFetcher 'masterUrl' must be specified without the /replication suffix
[junit4] 2> 1822996 INFO (qtp1336489633-12946) [ x:collection1] o.a.s.c.S.Request [collection1] webapp=/solr path=/replication params={qt=/replication&wt=javabin&version=2&command=indexversion} status=0 QTime=0
[junit4] 2> 1822997 INFO (explicit-fetchindex-cmd) [ x:collection1] o.a.s.h.IndexFetcher Master's generation: 4
[junit4] 2> 1822997 INFO (explicit-fetchindex-cmd) [ x:collection1] o.a.s.h.IndexFetcher Slave's generation: 3
[junit4] 2> 1822997 INFO (explicit-fetchindex-cmd) [ x:collection1] o.a.s.h.IndexFetcher Starting replication process
[junit4] 2> 1822997 INFO (qtp1336489633-12947) [ x:collection1] o.a.s.c.S.Request [collection1] webapp=/solr path=/replication params={generation=4&qt=/replication&wt=javabin&version=2&command=filelist} status=0 QTime=0
[junit4] 2> 1822998 INFO (explicit-fetchindex-cmd) [ x:collection1] o.a.s.h.IndexFetcher Number of files in latest index in master: 10
[junit4] 2> 1822999 INFO (explicit-fetchindex-cmd) [ x:collection1] o.a.s.c.CachingDirectoryFactory return new directory for /Users/jenkins/workspace/Lucene-Solr-master-MacOSX/solr/build/solr-core/test/J1/temp/solr.handler.TestReplicationHandler_C33F59A8F40DBABC-001/solr-instance-002/./collection1/data/index.20160702143904813
[junit4] 2> 1822999 INFO (explicit-fetchindex-cmd) [ x:collection1] o.a.s.u.DefaultSolrCoreState Rollback old IndexWriter... core=collection1
[junit4] 2> 1822999 INFO (explicit-fetchindex-cmd) [ x:collection1] o.a.s.u.RandomMergePolicy RandomMergePolicy wrapping class org.apache.lucene.index.LogByteSizeMergePolicy: [LogByteSizeMergePolicy: minMergeSize=1677721, mergeFactor=20, maxMergeSize=2147483648, maxMergeSizeForForcedMerge=9223372036854775807, calibrateSizeByDeletes=true, maxMergeDocs=2147483647, maxCFSSegmentSizeMB=8.796093022207999E12, noCFSRatio=0.0]
[junit4] 2> 1822999 INFO (explicit-fetchindex-cmd) [ x:collection1] o.a.s.c.SolrDeletionPolicy SolrDeletionPolicy.onInit: commits: num=1
[junit4] 2> commit{dir=MockDirectoryWrapper(RAMDirectory@1afb04a9 lockFactory=org.apache.lucene.store.SingleInstanceLockFactory@1e4ee4df),segFN=segments_3,generation=3}
[junit4] 2> 1822999 INFO (explicit-fetchindex-cmd) [ x:collection1] o.a.s.c.SolrDeletionPolicy newest commit generation = 3
[junit4] 2> 1822999 INFO (explicit-fetchindex-cmd) [ x:collection1] o.a.s.u.DefaultSolrCoreState New IndexWriter is ready to be used.
[junit4] 2> 1822999 INFO (explicit-fetchindex-cmd) [ x:collection1] o.a.s.c.SolrDeletionPolicy SolrDeletionPolicy.onCommit: commits: num=1
[junit4] 2> commit{dir=MockDirectoryWrapper(RAMDirectory@1afb04a9 lockFactory=org.apache.lucene.store.SingleInstanceLockFactory@1e4ee4df),segFN=segments_3,generation=3}
[junit4] 2> 1822999 INFO (explicit-fetchindex-cmd) [ x:collection1] o.a.s.c.SolrDeletionPolicy newest commit generation = 3
[junit4] 2> 1823000 INFO (explicit-fetchindex-cmd) [ x:collection1] o.a.s.u.DefaultSolrCoreState Rollback old IndexWriter... core=collection1
[junit4] 2> 1823000 INFO (explicit-fetchindex-cmd) [ x:collection1] o.a.s.h.IndexFetcher Starting download (fullCopy=false) to MockDirectoryWrapper(RAMDirectory@3a368f1 lockFactory=org.apache.lucene.store.SingleInstanceLockFactory@47580c56)
[junit4] 2> 1823000 INFO (explicit-fetchindex-cmd) [ x:collection1] o.a.s.h.IndexFetcher Skipping download for _0.cfe because it already exists
[junit4] 2> 1823000 INFO (explicit-fetchindex-cmd) [ x:collection1] o.a.s.h.IndexFetcher Skipping download for _0.si because it already exists
[junit4] 2> 1823000 INFO (explicit-fetchindex-cmd) [ x:collection1] o.a.s.h.IndexFetcher Skipping download for _0.cfs because it already exists
[junit4] 2> 1823000 INFO (explicit-fetchindex-cmd) [ x:collection1] o.a.s.h.IndexFetcher Skipping download for _1.cfs because it already exists
[junit4] 2> 1823000 INFO (explicit-fetchindex-cmd) [ x:collection1] o.a.s.h.IndexFetcher Skipping download for _1.cfe because it already exists
[junit4] 2> 1823000 INFO (explicit-fetchindex-cmd) [ x:collection1] o.a.s.h.IndexFetcher Skipping download for _1.si because it already exists
[junit4] 2> 1823000 INFO (qtp1336489633-12940) [ x:collection1] o.a.s.c.S.Request [collection1] webapp=/solr path=/replication params={generation=4&qt=/replication&file=_2.si&checksum=true&wt=filestream&command=filecontent} status=0 QTime=0
[junit4] 2> 1823002 INFO (qtp1336489633-12942) [ x:collection1] o.a.s.c.S.Request [collection1] webapp=/solr path=/replication params={generation=4&qt=/replication&file=_2.cfe&checksum=true&wt=filestream&command=filecontent} status=0 QTime=0
[junit4] 2> 1823003 INFO (qtp1336489633-12943) [ x:collection1] o.a.s.c.S.Request [collection1] webapp=/solr path=/replication params={generation=4&qt=/replication&file=_2.cfs&checksum=true&wt=filestream&command=filecontent} status=0 QTime=0
[junit4] 2> 1823004 INFO (qtp1336489633-12944) [ x:collection1] o.a.s.c.S.Request [collection1] webapp=/solr path=/replication params={generation=4&qt=/replication&file=segments_4&checksum=true&wt=filestream&command=filecontent} status=0 QTime=0
[junit4] 2> 1823004 INFO (explicit-fetchindex-cmd) [ x:collection1] o.a.s.h.IndexFetcher Total time taken for download (fullCopy=false,bytesDownloaded=2023) : 0 secs (null bytes/sec) to MockDirectoryWrapper(RAMDirectory@3a368f1 lockFactory=org.apache.lucene.store.SingleInstanceLockFactory@47580c56)
[junit4] 2> 1823006 WARN (explicit-fetchindex-cmd) [ x:collection1] o.a.s.h.IndexFetcher Exception while updating statistics
[junit4] 2> java.io.IOException: file "replication.properties" was already written to
[junit4] 2> at org.apache.lucene.store.MockDirectoryWrapper.createOutput(MockDirectoryWrapper.java:640)
[junit4] 2> at org.apache.solr.handler.IndexFetcher.logReplicationTimeAndConfFiles(IndexFetcher.java:683)
[junit4] 2> at org.apache.solr.handler.IndexFetcher.fetchLatestIndex(IndexFetcher.java:495)
[junit4] 2> at org.apache.solr.handler.IndexFetcher.fetchLatestIndex(IndexFetcher.java:265)
[junit4] 2> at org.apache.solr.handler.ReplicationHandler.doFetch(ReplicationHandler.java:393)
[junit4] 2> at org.apache.solr.handler.ReplicationHandler$1.run(ReplicationHandler.java:281)
[junit4] 2> 1823006 INFO (explicit-fetchindex-cmd) [ x:collection1] o.a.s.u.RandomMergePolicy RandomMergePolicy wrapping class org.apache.lucene.index.TieredMergePolicy: [TieredMergePolicy: maxMergeAtOnce=48, maxMergeAtOnceExplicit=26, maxMergedSegmentMB=65.9228515625, floorSegmentMB=0.8330078125, forceMergeDeletesPctAllowed=2.9902338197920955, segmentsPerTier=20.0, maxCFSSegmentSizeMB=8.796093022207999E12, noCFSRatio=0.31486047874177914
[junit4] 2> 1823006 INFO (explicit-fetchindex-cmd) [ x:collection1] o.a.s.c.SolrDeletionPolicy SolrDeletionPolicy.onInit: commits: num=2
[junit4] 2> commit{dir=MockDirectoryWrapper(RAMDirectory@1afb04a9 lockFactory=org.apache.lucene.store.SingleInstanceLockFactory@1e4ee4df),segFN=segments_3,generation=3}
[junit4] 2> commit{dir=MockDirectoryWrapper(RAMDirectory@1afb04a9 lockFactory=org.apache.lucene.store.SingleInstanceLockFactory@1e4ee4df),segFN=segments_4,generation=4}
[junit4] 2> 1823007 INFO (explicit-fetchindex-cmd) [ x:collection1] o.a.s.c.SolrDeletionPolicy newest commit generation = 4
[junit4] 2> 1823007 INFO (explicit-fetchindex-cmd) [ x:collection1] o.a.s.u.DefaultSolrCoreState New IndexWriter is ready to be used.
[junit4] 2> 1823007 INFO (explicit-fetchindex-cmd) [ x:collection1] o.a.s.s.SolrIndexSearcher Opening [Searcher@608504de[collection1] main]
[junit4] 2> 1823007 INFO (searcherExecutor-5552-thread-1-processing-x:collection1) [ x:collection1] o.a.s.c.SolrCore [collection1] Registered new searcher Searcher@608504de[collection1] main{ExitableDirectoryReader(UninvertingDirectoryReader(Uninverting(_0(7.0.0):c1) Uninverting(_1(7.0.0):c1) Uninverting(_2(7.0.0):c1)))}
[junit4] 2> 1823008 INFO (explicit-fetchindex-cmd) [ x:collection1] o.a.s.c.CachingDirectoryFactory looking to close /Users/jenkins/workspace/Lucene-Solr-master-MacOSX/solr/build/solr-core/test/J1/temp/solr.handler.TestReplicationHandler_C33F59A8F40DBABC-001/solr-instance-002/./collection1/data/index.20160702143904813 [CachedDir<<refCount=0;path=/Users/jenkins/workspace/Lucene-Solr-master-MacOSX/solr/build/solr-core/test/J1/temp/solr.handler.TestReplicationHandler_C33F59A8F40DBABC-001/solr-instance-002/./collection1/data/index.20160702143904813;done=true>>]
[junit4] 2> 1823008 INFO (explicit-fetchindex-cmd) [ x:collection1] o.a.s.c.CachingDirectoryFactory Closing directory, CoreContainer#isShutdown=false
[junit4] 2> 1823008 INFO (explicit-fetchindex-cmd) [ x:collection1] o.a.s.c.CachingDirectoryFactory Closing directory: /Users/jenkins/workspace/Lucene-Solr-master-MacOSX/solr/build/solr-core/test/J1/temp/solr.handler.TestReplicationHandler_C33F59A8F40DBABC-001/solr-instance-002/./collection1/data/index.20160702143904813
[junit4] 2> 1823008 INFO (qtp662528020-12959) [ x:collection1] o.a.s.c.S.Request [collection1] webapp=/solr path=/replication params={wait=true&masterUrl=http://127.0.0.1:64541/solr/collection1/replication&command=fetchindex} status=0 QTime=13
[junit4] 2> 1823009 INFO (TEST-TestReplicationHandler.doTestDetails-seed#[C33F59A8F40DBABC]) [ ] o.a.s.SolrTestCaseJ4 Writing core.properties file to /Users/jenkins/workspace/Lucene-Solr-master-MacOSX/solr/build/solr-core/test/J1/temp/solr.handler.TestReplicationHandler_C33F59A8F40DBABC-001/solr-instance-003/collection1
[junit4] 2> 1823024 INFO (TEST-TestReplicationHandler.doTestDetails-seed#[C33F59A8F40DBABC]) [ ] o.e.j.s.Server jetty-9.3.8.v20160314
[junit4] 2> 1823026 INFO (TEST-TestReplicationHandler.doTestDetails-seed#[C33F59A8F40DBABC]) [ ] o.e.j.s.h.ContextHandler Started o.e.j.s.ServletContextHandler@193845c9{/solr,null,AVAILABLE}
[junit4] 2> 1823026 INFO (TEST-TestReplicationHandler.doTestDetails-seed#[C33F59A8F40DBABC]) [ ] o.e.j.s.ServerConnector Started ServerConnector@4fcffffc{HTTP/1.1,[http/1.1]}{127.0.0.1:64547}
[junit4] 2> 1823027 INFO (TEST-TestReplicationHandler.doTestDetails-seed#[C33F59A8F40DBABC]) [ ] o.e.j.s.Server Started @1828556ms
[junit4] 2> 1823027 INFO (TEST-TestReplicationHandler.doTestDetails-seed#[C33F59A8F40DBABC]) [ ] o.a.s.c.s.e.JettySolrRunner Jetty properties: {solr.data.dir=/Users/jenkins/workspace/Lucene-Solr-master-MacOSX/solr/build/solr-core/test/J1/temp/solr.handler.TestReplicationHandler_C33F59A8F40DBABC-001/solr-instance-003/collection1/data, hostContext=/solr, hostPort=64547}
[junit4] 2> 1823027 INFO (TEST-TestReplicationHandler.doTestDetails-seed#[C33F59A8F40DBABC]) [ ] o.a.s.s.SolrDispatchFilter SolrDispatchFilter.init(): sun.misc.Launcher$AppClassLoader@4554617c
[junit4] 2> 1823028 INFO (TEST-TestReplicationHandler.doTestDetails-seed#[C33F59A8F40DBABC]) [ ] o.a.s.c.SolrResourceLoader new SolrResourceLoader for directory: '/Users/jenkins/workspace/Lucene-Solr-master-MacOSX/solr/build/solr-core/test/J1/temp/solr.handler.TestReplicationHandler_C33F59A8F40DBABC-001/solr-instance-003'
[junit4] 2> 1823028 INFO (TEST-TestReplicationHandler.doTestDetails-seed#[C33F59A8F40DBABC]) [ ] o.a.s.c.SolrResourceLoader JNDI not configured for solr (NoInitialContextEx)
[junit4] 2> 1823028 INFO (TEST-TestReplicationHandler.doTestDetails-seed#[C33F59A8F40DBABC]) [ ] o.a.s.c.SolrResourceLoader solr home defaulted to 'solr/' (could not find system property or JNDI)
[junit4] 2> 1823028 INFO (TEST-TestReplicationHandler.doTestDetails-seed#[C33F59A8F40DBABC]) [ ] o.a.s.c.SolrXmlConfig Loading container configuration from /Users/jenkins/workspace/Lucene-Solr-master-MacOSX/solr/build/solr-core/test/J1/temp/solr.handler.TestReplicationHandler_C33F59A8F40DBABC-001/solr-instance-003/solr.xml
[junit4] 2> 1823044 INFO (TEST-TestReplicationHandler.doTestDetails-seed#[C33F59A8F40DBABC]) [ ] o.a.s.c.CorePropertiesLocator Config-defined core root directory: /Users/jenkins/workspace/Lucene-Solr-master-MacOSX/solr/build/solr-core/test/J1/temp/solr.handler.TestReplicationHandler_C33F59A8F40DBABC-001/solr-instance-003/.
[junit4] 2> 1823044 INFO (TEST-TestReplicationHandler.doTestDetails-seed#[C33F59A8F40DBABC]) [ ] o.a.s.c.CoreContainer New CoreContainer 458380975
[junit4] 2> 1823044 INFO (TEST-TestReplicationHandler.doTestDetails-seed#[C33F59A8F40DBABC]) [ ] o.a.s.c.CoreContainer Loading cores into CoreContainer [instanceDir=/Users/jenkins/workspace/Lucene-Solr-master-MacOSX/solr/build/solr-core/test/J1/temp/solr.handler.TestReplicationHandler_C33F59A8F40DBABC-001/solr-instance-003]
[junit4] 2> 1823044 WARN (TEST-TestReplicationHandler.doTestDetails-seed#[C33F59A8F40DBABC]) [ ] o.a.s.c.CoreContainer Couldn't add files from /Users/jenkins/workspace/Lucene-Solr-master-MacOSX/solr/build/solr-core/test/J1/temp/solr.handler.TestReplicationHandler_C33F59A8F40DBABC-001/solr-instance-003/lib to classpath: /Users/jenkins/workspace/Lucene-Solr-master-MacOSX/solr/build/solr-core/test/J1/temp/solr.handler.TestReplicationHandler_C33F59A8F40DBABC-001/solr-instance-003/lib
[junit4] 2> 1823045 INFO (TEST-TestReplicationHandler.doTestDetails-seed#[C33F59A8F40DBABC]) [ ] o.a.s.h.c.HttpShardHandlerFactory created with socketTimeout : 90000,urlScheme : ,connTimeout : 15000,maxConnectionsPerHost : 20,maxConnections : 10000,corePoolSize : 0,maximumPoolSize : 2147483647,maxThreadIdleTime : 5,sizeOfQueue : -1,fairnessPolicy : false,
[junit4] 2> 1823047 INFO (TEST-TestReplicationHandler.doTestDetails-seed#[C33F59A8F40DBABC]) [ ] o.a.s.u.UpdateShardHandler Created UpdateShardHandler HTTP client with params: socketTimeout=340000&connTimeout=45000&maxConnections=100000&maxConnectionsPerHost=100000
[junit4] 2> 1823047 INFO (TEST-TestReplicationHandler.doTestDetails-seed#[C33F59A8F40DBABC]) [ ] o.a.s.l.LogWatcher SLF4J impl is org.slf4j.impl.Log4jLoggerFactory
[junit4] 2> 1823047 INFO (TEST-TestReplicationHandler.doTestDetails-seed#[C33F59A8F40DBABC]) [ ] o.a.s.l.LogWatcher Registering Log Listener [Log4j (org.slf4j.impl.Log4jLoggerFactory)]
[junit4] 2> 1823047 INFO (TEST-TestReplicationHandler.doTestDetails-seed#[C33F59A8F40DBABC]) [ ] o.a.s.c.CoreContainer Security conf doesn't exist. Skipping setup for authorization module.
[junit4] 2> 1823047 INFO (TEST-TestReplicationHandler.doTestDetails-seed#[C33F59A8F40DBABC]) [ ] o.a.s.c.CoreContainer No authentication plugin used.
[junit4] 2> 1823049 INFO (TEST-TestReplicationHandler.doTestDetails-seed#[C33F59A8F40DBABC]) [ ] o.a.s.c.CorePropertiesLocator Looking for core definitions underneath /Users/jenkins/workspace/Lucene-Solr-master-MacOSX/solr/build/solr-core/test/J1/temp/solr.handler.TestReplicationHandler_C33F59A8F40DBABC-001/solr-instance-003/.
[junit4] 2> 1823050 INFO (TEST-TestReplicationHandler.doTestDetails-seed#[C33F59A8F40DBABC]) [ ] o.a.s.c.CoreDescriptor Created CoreDescriptor: {name=collection1, config=solrconfig.xml, loadOnStartup=true, schema=schema.xml, configSetProperties=configsetprops.json, transient=false, dataDir=data/}
[junit4] 2> 1823050 INFO (TEST-TestReplicationHandler.doTestDetails-seed#[C33F59A8F40DBABC]) [ ] o.a.s.c.CorePropertiesLocator Found core collection1 in /Users/jenkins/workspace/Lucene-Solr-master-MacOSX/solr/build/solr-core/test/J1/temp/solr.handler.TestReplicationHandler_C33F59A8F40DBABC-001/solr-instance-003/./collection1
[junit4] 2> 1823050 INFO (TEST-TestReplicationHandler.doTestDetails-seed#[C33F59A8F40DBABC]) [ ] o.a.s.c.CorePropertiesLocator Found 1 core definitions
[junit4] 2> 1823051 INFO (coreLoadExecutor-5565-thread-1) [ ] o.a.s.c.SolrResourceLoader new SolrResourceLoader for directory: '/Users/jenkins/workspace/Lucene-Solr-master-MacOSX/solr/build/solr-core/test/J1/temp/solr.handler.TestReplicationHandler_C33F59A8F40DBABC-001/solr-instance-003/collection1'
[junit4] 2> 1823051 INFO (TEST-TestReplicationHandler.doTestDetails-seed#[C33F59A8F40DBABC]) [ ] o.a.s.s.SolrDispatchFilter user.dir=/Users/jenkins/workspace/Lucene-Solr-master-MacOSX/solr/build/solr-core/test/J1
[junit4] 2> 1823051 INFO (coreLoadExecutor-5565-thread-1) [ ] o.a.s.c.SolrResourceLoader JNDI not configured for solr (NoInitialContextEx)
[junit4] 2> 1823051 INFO (TEST-TestReplicationHandler.doTestDetails-seed#[C33F59A8F40DBABC]) [ ] o.a.s.s.SolrDispatchFilter SolrDispatchFilter.init() done
[junit4] 2> 1823051 INFO (coreLoadExecutor-5565-thread-1) [ ] o.a.s.c.SolrResourceLoader solr home defaulted to 'solr/' (could not find system property or JNDI)
[junit4] 2> 1823059 INFO (coreLoadExecutor-5565-thread-1) [ ] o.a.s.c.SolrConfig current version of requestparams : -1
[junit4] 2> 1823061 INFO (coreLoadExecutor-5565-thread-1) [ ] o.a.s.c.SolrConfig Using Lucene MatchVersion: 7.0.0
[junit4] 2> 1823075 INFO (coreLoadExecutor-5565-thread-1) [ ] o.a.s.c.SolrConfig Loaded SolrConfig: solrconfig.xml
[junit4] 2> 1823078 INFO (coreLoadExecutor-5565-thread-1) [ ] o.a.s.s.IndexSchema [collection1] Schema name=test
[junit4] 2> 1823080 INFO (coreLoadExecutor-5565-thread-1) [ ] o.a.s.s.IndexSchema unique key field: id
[junit4] 2> 1823082 INFO (coreLoadExecutor-5565-thread-1) [ ] o.a.s.c.ConfigSetProperties Did not find ConfigSet properties, assuming default properties: Can't find resource 'configsetprops.json' in classpath or '/Users/jenkins/workspace/Lucene-Solr-master-MacOSX/solr/build/solr-core/test/J1/temp/solr.handler.TestReplicationHandler_C33F59A8F40DBABC-001/solr-instance-003/collection1'
[junit4] 2> 1823082 INFO (coreLoadExecutor-5565-thread-1) [ ] o.a.s.c.CoreContainer Creating SolrCore 'collection1' using configuration from instancedir /Users/jenkins/workspace/Lucene-Solr-master-MacOSX/solr/build/solr-core/test/J1/temp/solr.handler.TestReplicationHandler_C33F59A8F40DBABC-001/solr-instance-003/./collection1
[junit4] 2> 1823082 INFO (coreLoadExecutor-5565-thread-1) [ x:collection1] o.a.s.c.SolrCore org.apache.solr.core.MockDirectoryFactory
[junit4] 2> 1823082 INFO (coreLoadExecutor-5565-thread-1) [ x:collection1] o.a.s.c.SolrCore [[collection1] ] Opening new SolrCore at [/Users/jenkins/workspace/Lucene-Solr-master-MacOSX/solr/build/solr-core/test/J1/temp/solr.handler.TestReplicationHandler_C33F59A8F40DBABC-001/solr-instance-003/collection1], dataDir=[/Users/jenkins/workspace/Lucene-Solr-master-MacOSX/solr/build/solr-core/test/J1/temp/solr.handler.TestReplicationHandler_C33F59A8F40DBABC-001/solr-instance-003/./collection1/data/]
[junit4] 2> 1823082 INFO (coreLoadExecutor-5565-thread-1) [ x:collection1] o.a.s.c.SolrCore JMX monitoring not detected for core: collection1
[junit4] 2> 1823083 INFO (coreLoadExecutor-5565-thread-1) [ x:collection1] o.a.s.c.CachingDirectoryFactory return new directory for /Users/jenkins/workspace/Lucene-Solr-master-MacOSX/solr/build/solr-core/test/J1/temp/solr.handler.TestReplicationHandler_C33F59A8F40DBABC-001/solr-instance-003/./collection1/data
[junit4] 2> 1823083 INFO (coreLoadExecutor-5565-thread-1) [ x:collection1] o.a.s.c.SolrCore New index directory detected: old=null new=/Users/jenkins/workspace/Lucene-Solr-master-MacOSX/solr/build/solr-core/test/J1/temp/solr.handler.TestReplicationHandler_C33F59A8F40DBABC-001/solr-instance-003/./collection1/data/index/
[junit4] 2> 1823083 WARN (coreLoadExecutor-5565-thread-1) [ x:collection1] o.a.s.c.SolrCore [collection1] Solr index directory '/Users/jenkins/workspace/Lucene-Solr-master-MacOSX/solr/build/solr-core/test/J1/temp/solr.handler.TestReplicationHandler_C33F59A8F40DBABC-001/solr-instance-003/./collection1/data/index' doesn't exist. Creating new index...
[junit4] 2> 1823083 INFO (coreLoadExecutor-5565-thread-1) [ x:collection1] o.a.s.c.CachingDirectoryFactory return new directory for /Users/jenkins/workspace/Lucene-Solr-master-MacOSX/solr/build/solr-core/test/J1/temp/solr.handler.TestReplicationHandler_C33F59A8F40DBABC-001/solr-instance-003/./collection1/data/index
[junit4] 2> 1823084 INFO (coreLoadExecutor-5565-thread-1) [ x:collection1] o.a.s.u.RandomMergePolicy RandomMergePolicy wrapping class org.apache.lucene.index.TieredMergePolicy: [TieredMergePolicy: maxMergeAtOnce=48, maxMergeAtOnceExplicit=35, maxMergedSegmentMB=15.96875, floorSegmentMB=1.439453125, forceMergeDeletesPctAllowed=6.611409783318349, segmentsPerTier=44.0, maxCFSSegmentSizeMB=8.796093022207999E12, noCFSRatio=0.0
[junit4] 2> 1823084 INFO (coreLoadExecutor-5565-thread-1) [ x:collection1] o.a.s.c.SolrDeletionPolicy SolrDeletionPolicy.onCommit: commits: num=1
[junit4] 2> commit{dir=MockDirectoryWrapper(RAMDirectory@a02c8e8 lockFactory=org.apache.lucene.store.SingleInstanceLockFactory@403e1d6b),segFN=segments_1,generation=1}
[junit4] 2> 1823084 INFO (coreLoadExecutor-5565-thread-1) [ x:collection1] o.a.s.c.SolrDeletionPolicy newest commit generation = 1
[junit4] 2> 1823084 INFO (OldIndexDirectoryCleanupThreadForCore-collection1) [ x:collection1] o.a.s.c.SolrCore Looking for old index directories to cleanup for core collection1 in /Users/jenkins/workspace/Lucene-Solr-master-MacOSX/solr/build/solr-core/test/J1/temp/solr.handler.TestReplicationHandler_C33F59A8F40DBABC-001/solr-instance-003/./collection1/data/
[junit4] 2> 1823086 INFO (coreLoadExecutor-5565-thread-1) [ x:collection1] o.a.s.c.SolrCore no updateRequestProcessorChain defined as default, creating implicit default
[junit4] 2> 1823087 INFO (coreLoadExecutor-5565-thread-1) [ x:collection1] o.a.s.h.l.XMLLoader xsltCacheLifetimeSeconds=60
[junit4] 2> 1823087 INFO (coreLoadExecutor-5565-thread-1) [ x:collection1] o.a.s.h.l.XMLLoader xsltCacheLifetimeSeconds=60
[junit4] 2> 1823088 INFO (coreLoadExecutor-5565-thread-1) [ x:collection1] o.a.s.h.l.XMLLoader xsltCacheLifetimeSeconds=60
[junit4] 2> 1823089 INFO (coreLoadExecutor-5565-thread-1) [ x:collection1] o.a.s.h.l.XMLLoader xsltCacheLifetimeSeconds=60
[junit4] 2> 1823089 INFO (coreLoadExecutor-5565-thread-1) [ x:collection1] o.a.s.c.PluginBag requestHandler : 'lazy' created with startup=lazy
[junit4] 2> 1823089 INFO (coreLoadExecutor-5565-thread-1) [ x:collection1] o.a.s.c.RequestHandlers Registered paths: /admin/mbeans,standard,lazy,/update/json/docs,/admin/luke,/export,/get,/admin/properties,/update/json,/admin/threads,/update/csv,/sql,/graph,/admin/segments,/admin/system,/replication,defaults,/config,/stream,/schema,/admin/plugins,/admin/logging,/admin/ping,/update,/admin/file
[junit4] 2> 1823089 INFO (coreLoadExecutor-5565-thread-1) [ x:collection1] o.a.s.c.SolrCore Using default statsCache cache: org.apache.solr.search.stats.LocalStatsCache
[junit4] 2> 1823089 INFO (coreLoadExecutor-5565-thread-1) [ x:collection1] o.a.s.u.CommitTracker Hard AutoCommit: disabled
[junit4] 2> 1823089 INFO (coreLoadExecutor-5565-thread-1) [ x:collection1] o.a.s.u.CommitTracker Soft AutoCommit: disabled
[junit4] 2> 1823093 INFO (coreLoadExecutor-5565-thread-1) [ x:collection1] o.a.s.u.RandomMergePolicy RandomMergePolicy wrapping class org.apache.lucene.index.TieredMergePolicy: [TieredMergePolicy: maxMergeAtOnce=40, maxMergeAtOnceExplicit=44, maxMergedSegmentMB=57.2412109375, floorSegmentMB=1.2783203125, forceMergeDeletesPctAllowed=24.49156858341662, segmentsPerTier=33.0, maxCFSSegmentSizeMB=8.796093022207999E12, noCFSRatio=0.21734025840099438
[junit4] 2> 1823093 INFO (coreLoadExecutor-5565-thread-1) [ x:collection1] o.a.s.c.SolrDeletionPolicy SolrDeletionPolicy.onInit: commits: num=1
[junit4] 2> commit{dir=MockDirectoryWrapper(RAMDirectory@a02c8e8 lockFactory=org.apache.lucene.store.SingleInstanceLockFactory@403e1d6b),segFN=segments_1,generation=1}
[junit4] 2> 1823093 INFO (coreLoadExecutor-5565-thread-1) [ x:collection1] o.a.s.c.SolrDeletionPolicy newest commit generation = 1
[junit4] 2> 1823093 INFO (coreLoadExecutor-5565-thread-1) [ x:collection1] o.a.s.s.SolrIndexSearcher Opening [Searcher@66259d1a[collection1] main]
[junit4] 2> 1823093 INFO (coreLoadExecutor-5565-thread-1) [ x:collection1] o.a.s.r.ManagedResourceStorage File-based storage initialized to use dir: /Users/jenkins/workspace/Lucene-Solr-master-MacOSX/solr/build/solr-core/test/J1/temp/solr.handler.TestReplicationHandler_C33F59A8F40DBABC-001/solr-instance-003/collection1/conf
[junit4] 2> 1823093 INFO (coreLoadExecutor-5565-thread-1) [ x:collection1] o.a.s.r.RestManager Initializing RestManager with initArgs: {storageDir=/Users/jenkins/workspace/Lucene-Solr-master-MacOSX/solr/build/solr-core/test/J1/temp/solr.handler.TestReplicationHandler_C33F59A8F40DBABC-001/solr-instance-003/collection1/conf}
[junit4] 2> 1823093 INFO (coreLoadExecutor-5565-thread-1) [ x:collection1] o.a.s.r.ManagedResourceStorage Reading _rest_managed.json using file:dir=/Users/jenkins/workspace/Lucene-Solr-master-MacOSX/solr/build/solr-core/test/J1/temp/solr.handler.TestReplicationHandler_C33F59A8F40DBABC-001/solr-instance-003/collection1/conf
[junit4] 2> 1823094 INFO (coreLoadExecutor-5565-thread-1) [ x:collection1] o.a.s.r.RestManager Initializing 0 registered ManagedResources
[junit4] 2> 1823094 WARN (coreLoadExecutor-5565-thread-1) [ x:collection1] o.a.s.h.IndexFetcher 'masterUrl' must be specified without the /replication suffix
[junit4] 2> 1823094 INFO (coreLoadExecutor-5565-thread-1) [ x:collection1] o.a.s.h.ReplicationHandler No value set for
[...truncated too long message...]
9A8F40DBABC]) [ ] o.a.s.c.CoreContainer Shutting down CoreContainer instance=1585803871
[junit4] 2> 1943860 INFO (coreCloseExecutor-6205-thread-1) [ x:collection1] o.a.s.c.SolrCore [collection1] CLOSING SolrCore org.apache.solr.core.SolrCore@3c19caf4
[junit4] 2> 1943860 INFO (coreCloseExecutor-6205-thread-1) [ x:collection1] o.a.s.u.DirectUpdateHandler2 closing DirectUpdateHandler2{commits=0,autocommits=0,soft autocommits=0,optimizes=0,rollbacks=0,expungeDeletes=0,docsPending=0,adds=0,deletesById=0,deletesByQuery=0,errors=0,cumulative_adds=0,cumulative_deletesById=0,cumulative_deletesByQuery=0,cumulative_errors=0}
[junit4] 2> 1943861 INFO (coreCloseExecutor-6205-thread-1) [ x:collection1] o.a.s.u.SolrCoreState Closing SolrCoreState
[junit4] 2> 1943861 INFO (coreCloseExecutor-6205-thread-1) [ x:collection1] o.a.s.u.DefaultSolrCoreState SolrCoreState ref count has reached 0 - closing IndexWriter
[junit4] 2> 1943861 INFO (coreCloseExecutor-6205-thread-1) [ x:collection1] o.a.s.u.DefaultSolrCoreState closing IndexWriter with IndexWriterCloser
[junit4] 2> 1943861 INFO (coreCloseExecutor-6205-thread-1) [ x:collection1] o.a.s.c.SolrCore [collection1] Closing main searcher on request.
[junit4] 2> 1943861 INFO (coreCloseExecutor-6205-thread-1) [ x:collection1] o.a.s.c.CachingDirectoryFactory Closing MockDirectoryFactory - 2 directories currently being tracked
[junit4] 2> 1943861 INFO (coreCloseExecutor-6205-thread-1) [ x:collection1] o.a.s.c.CachingDirectoryFactory looking to close /Users/jenkins/workspace/Lucene-Solr-master-MacOSX/solr/build/solr-core/test/J1/temp/solr.handler.TestReplicationHandler_C33F59A8F40DBABC-001/solr-instance-030/./collection1/data/index.20160702144053800 [CachedDir<<refCount=0;path=/Users/jenkins/workspace/Lucene-Solr-master-MacOSX/solr/build/solr-core/test/J1/temp/solr.handler.TestReplicationHandler_C33F59A8F40DBABC-001/solr-instance-030/./collection1/data/index.20160702144053800;done=false>>]
[junit4] 2> 1943861 INFO (coreCloseExecutor-6205-thread-1) [ x:collection1] o.a.s.c.CachingDirectoryFactory Closing directory, CoreContainer#isShutdown=true
[junit4] 2> 1943861 INFO (coreCloseExecutor-6205-thread-1) [ x:collection1] o.a.s.c.CachingDirectoryFactory Closing directory: /Users/jenkins/workspace/Lucene-Solr-master-MacOSX/solr/build/solr-core/test/J1/temp/solr.handler.TestReplicationHandler_C33F59A8F40DBABC-001/solr-instance-030/./collection1/data/index.20160702144053800
[junit4] 2> 1943861 INFO (coreCloseExecutor-6205-thread-1) [ x:collection1] o.a.s.c.CachingDirectoryFactory looking to close /Users/jenkins/workspace/Lucene-Solr-master-MacOSX/solr/build/solr-core/test/J1/temp/solr.handler.TestReplicationHandler_C33F59A8F40DBABC-001/solr-instance-030/./collection1/data [CachedDir<<refCount=0;path=/Users/jenkins/workspace/Lucene-Solr-master-MacOSX/solr/build/solr-core/test/J1/temp/solr.handler.TestReplicationHandler_C33F59A8F40DBABC-001/solr-instance-030/./collection1/data;done=false>>]
[junit4] 2> 1943861 INFO (coreCloseExecutor-6205-thread-1) [ x:collection1] o.a.s.c.CachingDirectoryFactory Closing directory, CoreContainer#isShutdown=true
[junit4] 2> 1943861 INFO (coreCloseExecutor-6205-thread-1) [ x:collection1] o.a.s.c.CachingDirectoryFactory Closing directory: /Users/jenkins/workspace/Lucene-Solr-master-MacOSX/solr/build/solr-core/test/J1/temp/solr.handler.TestReplicationHandler_C33F59A8F40DBABC-001/solr-instance-030/./collection1/data
[junit4] 2> 1943862 INFO (TEST-TestReplicationHandler.doTestStressReplication-seed#[C33F59A8F40DBABC]) [ ] o.e.j.s.h.ContextHandler Stopped o.e.j.s.ServletContextHandler@7b50ce4a{/solr,null,UNAVAILABLE}
[junit4] IGNOR/A 0.00s J1 | TestReplicationHandler.doTestIndexFetchOnMasterRestart
[junit4] > Assumption #1: 'awaitsfix' test group is disabled (@AwaitsFix(bugUrl=https://issues.apache.org/jira/browse/SOLR-9036))
[junit4] 2> 1943865 INFO (SUITE-TestReplicationHandler-seed#[C33F59A8F40DBABC]-worker) [ ] o.a.s.SolrTestCaseJ4 ###deleteCore
[junit4] 2> NOTE: leaving temporary files on disk at: /Users/jenkins/workspace/Lucene-Solr-master-MacOSX/solr/build/solr-core/test/J1/temp/solr.handler.TestReplicationHandler_C33F59A8F40DBABC-001
[junit4] 2> NOTE: test params are: codec=Asserting(Lucene62): {name=PostingsFormat(name=LuceneFixedGap), id=PostingsFormat(name=LuceneFixedGap), newname=PostingsFormat(name=LuceneFixedGap)}, docValues:{}, maxPointsInLeafNode=1318, maxMBSortInHeap=5.858974270210636, sim=ClassicSimilarity, locale=ca, timezone=SystemV/PST8PDT
[junit4] 2> NOTE: Mac OS X 10.11.5 x86_64/Oracle Corporation 1.8.0_92 (64-bit)/cpus=3,threads=1,free=134905904,total=518979584
[junit4] 2> NOTE: All tests run in this JVM: [BlockJoinFacetRandomTest, TestCrossCoreJoin, HighlighterConfigTest, WordBreakSolrSpellCheckerTest, TestQuerySenderListener, OverseerModifyCollectionTest, CdcrReplicationHandlerTest, TestFieldCacheSort, TestHighFrequencyDictionaryFactory, LeaderElectionIntegrationTest, FileUtilsTest, FullSolrCloudDistribCmdsTest, BlockDirectoryTest, TestDistribDocBasedVersion, TestDistributedStatsComponentCardinality, BasicDistributedZk2Test, TestSolrCoreProperties, TestSortingResponseWriter, SolrCoreCheckLockOnStartupTest, RuleEngineTest, BaseCdcrDistributedZkTest, BasicFunctionalityTest, SpellCheckCollatorTest, TestSolrIndexConfig, TestPivotHelperCode, TestSimpleQParserPlugin, DistributedMLTComponentTest, GraphQueryTest, TestSubQueryTransformerDistrib, TestRandomFaceting, ExitableDirectoryReaderTest, SpatialRPTFieldTypeTest, SuggesterTSTTest, TestCopyFieldCollectionResource, OutputWriterTest, TestStandardQParsers, TestInitQParser, NoCacheHeaderTest, TestScoreJoinQPScore, SortByFunctionTest, FullHLLTest, CollectionReloadTest, TestAuthorizationFramework, TestCustomDocTransformer, CurrencyFieldOpenExchangeTest, DeleteStatusTest, AsyncCallRequestStatusResponseTest, ConfigSetsAPITest, StatsComponentTest, TestConfigSetProperties, CreateCollectionCleanupTest, CoreAdminCreateDiscoverTest, TestSchemaSimilarityResource, OverseerStatusTest, CoreAdminHandlerTest, ChaosMonkeySafeLeaderTest, TestConfigReload, ZkNodePropsTest, CloudMLTQParserTest, TestTolerantUpdateProcessorCloud, CdcrVersionReplicationTest, TestDistribIDF, CollectionTooManyReplicasTest, TestRTGBase, TestCloudSchemaless, TestConfigSetsAPIZkFailure, NotRequiredUniqueKeyTest, TestManagedResourceStorage, TestIndexSearcher, ClassificationUpdateProcessorFactoryTest, TestSolrQueryParserResource, BadIndexSchemaTest, TestIntervalFaceting, AliasIntegrationTest, ConvertedLegacyTest, TestRandomCollapseQParserPlugin, TestSolrJ, DebugComponentTest, TestAuthenticationFramework, TestCloudDeleteByQuery, TestCoreDiscovery, CollectionsAPIDistributedZkTest, JavabinLoaderTest, CoreMergeIndexesAdminHandlerTest, TestSizeLimitedDistributedMap, SmileWriterTest, DocValuesMissingTest, TestGraphTermsQParserPlugin, TestFiltering, CollectionsAPISolrJTest, TestFieldCacheReopen, TestSerializedLuceneMatchVersion, TestReloadDeadlock, AnalyticsQueryTest, DistributedDebugComponentTest, TestFoldingMultitermQuery, TestOrdValues, TestBulkSchemaAPI, TestFieldCacheVsDocValues, TlogReplayBufferedWhileIndexingTest, TestJoin, OverriddenZkACLAndCredentialsProvidersTest, TestSuggestSpellingConverter, SolrCloudExampleTest, EchoParamsTest, TestExactStatsCache, SpellingQueryConverterTest, SearchHandlerTest, TestSystemIdResolver, TestSchemaNameResource, TestSolrDynamicMBean, TestAnalyzeInfixSuggestions, SolrCmdDistributorTest, TestClassicSimilarityFactory, TestSchemaManager, TestConfigOverlay, TestTrieFacet, AddBlockUpdateTest, MinimalSchemaTest, AddSchemaFieldsUpdateProcessorFactoryTest, TestRebalanceLeaders, TestRequestForwarding, TestAtomicUpdateErrorCases, DirectUpdateHandlerOptimizeTest, ResponseLogComponentTest, TestFieldCollectionResource, ForceLeaderTest, HLLUtilTest, TestDynamicFieldCollectionResource, ShardRoutingCustomTest, OpenExchangeRatesOrgProviderTest, NumericFieldsTest, UniqFieldsUpdateProcessorFactoryTest, TestReRankQParserPlugin, DistributedFacetPivotLargeTest, LeaderInitiatedRecoveryOnShardRestartTest, SolrInfoMBeanTest, TestCollationField, ZkStateWriterTest, TestNumericTerms64, TestOnReconnectListenerSupport, TestReversedWildcardFilterFactory, TestSSLRandomization, TestComplexPhraseQParserPlugin, MultiTermTest, ResourceLoaderTest, SpellPossibilityIteratorTest, BJQParserTest, TestCharFilters, TestQueryUtils, DistributedTermsComponentTest, OpenCloseCoreStressTest, ShardRoutingTest, BasicZkTest, TestReplicationHandler]
[junit4] Completed [316/618 (1!)] on J1 in 122.23s, 15 tests, 1 failure, 1 skipped <<< FAILURES!
[...truncated 971 lines...]
BUILD FAILED
/Users/jenkins/workspace/Lucene-Solr-master-MacOSX/build.xml:740: The following error occurred while executing this line:
/Users/jenkins/workspace/Lucene-Solr-master-MacOSX/build.xml:684: The following error occurred while executing this line:
/Users/jenkins/workspace/Lucene-Solr-master-MacOSX/build.xml:59: The following error occurred while executing this line:
/Users/jenkins/workspace/Lucene-Solr-master-MacOSX/solr/build.xml:233: The following error occurred while executing this line:
/Users/jenkins/workspace/Lucene-Solr-master-MacOSX/solr/common-build.xml:530: The following error occurred while executing this line:
/Users/jenkins/workspace/Lucene-Solr-master-MacOSX/lucene/common-build.xml:1427: The following error occurred while executing this line:
/Users/jenkins/workspace/Lucene-Solr-master-MacOSX/lucene/common-build.xml:984: There were test failures: 618 suites (10 ignored), 2590 tests, 1 failure, 123 ignored (72 assumptions) [seed: C33F59A8F40DBABC]
Total time: 81 minutes 52 seconds
Build step 'Invoke Ant' marked build as failure
Archiving artifacts
[WARNINGS] Skipping publisher since build result is FAILURE
Recording test results
Email was triggered for: Failure - Any
Sending email for trigger: Failure - Any