You are viewing a plain text version of this content. The canonical link for it is here.
Posted to dev@lucene.apache.org by hu...@gmail.com on 2012/09/25 23:56:04 UTC
Build failed in Jenkins: Lucene-Solr-40-ReleaseSmoke #164
See <http://sierranevada.servebeer.com/job/Lucene-Solr-40-ReleaseSmoke/164/changes>
Changes:
[mikemccand] LUCENE-4429: smokeTestRelease requires version is format X.Y.Z[-ALPHA|-BETA]
------------------------------------------
[...truncated 41713 lines...]
jar-highlighter:
check-memory-uptodate:
jar-memory:
check-misc-uptodate:
jar-misc:
check-spatial-uptodate:
jar-spatial:
check-grouping-uptodate:
jar-grouping:
check-queries-uptodate:
jar-queries:
check-queryparser-uptodate:
jar-queryparser:
prep-lucene-jars:
resolve-example:
[echo] Building solr-example...
ivy-availability-check:
ivy-fail:
ivy-configure:
[ivy:configure] :: loading settings :: file = <http://sierranevada.servebeer.com/job/Lucene-Solr-40-ReleaseSmoke/ws/lucene/ivy-settings.xml>
resolve:
[echo] Building solr-example-DIH...
ivy-availability-check:
ivy-fail:
ivy-configure:
[ivy:configure] :: loading settings :: file = <http://sierranevada.servebeer.com/job/Lucene-Solr-40-ReleaseSmoke/ws/lucene/ivy-settings.xml>
resolve:
resolve:
common.init:
compile-lucene-core:
ivy-availability-check:
ivy-fail:
ivy-configure:
[ivy:configure] :: loading settings :: file = <http://sierranevada.servebeer.com/job/Lucene-Solr-40-ReleaseSmoke/ws/lucene/ivy-settings.xml>
resolve:
init:
-clover.disable:
-clover.setup:
clover:
compile-core:
init:
-clover.disable:
-clover.setup:
clover:
common.compile-core:
common-solr.compile-core:
compile-core:
jar-core:
[jar] Building jar: <http://sierranevada.servebeer.com/job/Lucene-Solr-40-ReleaseSmoke/ws/solr/build/contrib/solr-velocity/apache-solr-velocity-4.0.1.jar>
jar-src:
[jar] Building jar: <http://sierranevada.servebeer.com/job/Lucene-Solr-40-ReleaseSmoke/ws/solr/build/contrib/solr-velocity/apache-solr-velocity-4.0.1-src.jar>
resolve-groovy:
define-lucene-javadoc-url:
check-lucene-core-javadocs-uptodate:
javadocs-lucene-core:
check-analyzers-common-javadocs-uptodate:
javadocs-analyzers-common:
check-analyzers-icu-javadocs-uptodate:
javadocs-analyzers-icu:
check-analyzers-kuromoji-javadocs-uptodate:
javadocs-analyzers-kuromoji:
check-analyzers-phonetic-javadocs-uptodate:
javadocs-analyzers-phonetic:
check-analyzers-smartcn-javadocs-uptodate:
javadocs-analyzers-smartcn:
check-analyzers-morfologik-javadocs-uptodate:
javadocs-analyzers-morfologik:
check-analyzers-stempel-javadocs-uptodate:
javadocs-analyzers-stempel:
check-analyzers-uima-javadocs-uptodate:
javadocs-analyzers-uima:
check-suggest-javadocs-uptodate:
javadocs-suggest:
check-grouping-javadocs-uptodate:
javadocs-grouping:
check-queries-javadocs-uptodate:
javadocs-queries:
check-queryparser-javadocs-uptodate:
javadocs-queryparser:
check-highlighter-javadocs-uptodate:
javadocs-highlighter:
check-memory-javadocs-uptodate:
javadocs-memory:
check-misc-javadocs-uptodate:
javadocs-misc:
check-spatial-javadocs-uptodate:
javadocs-spatial:
check-test-framework-javadocs-uptodate:
javadocs-test-framework:
lucene-javadocs:
check-solr-core-javadocs-uptodate:
javadocs-solr-core:
javadocs:
[echo] Building solr-velocity...
download-java6-javadoc-packagelist:
[delete] Deleting: <http://sierranevada.servebeer.com/job/Lucene-Solr-40-ReleaseSmoke/ws/solr/build/docs/solr-velocity/stylesheet.css>
[javadoc] Generating Javadoc
[javadoc] Javadoc execution
[javadoc] Loading source files for package org.apache.solr.response...
[javadoc] Constructing Javadoc information...
[javadoc] Standard Doclet version 1.7.0_01
[javadoc] Building tree for all the packages and classes...
[javadoc] Building index for all the packages and classes...
[javadoc] Building index for all classes...
[javadoc] Generating <http://sierranevada.servebeer.com/job/Lucene-Solr-40-ReleaseSmoke/ws/solr/build/docs/solr-velocity/help-doc.html...>
[javadoc] Note: Custom tags that were not seen: @lucene.internal, @lucene.experimental
[jar] Building jar: <http://sierranevada.servebeer.com/job/Lucene-Solr-40-ReleaseSmoke/ws/solr/build/contrib/solr-velocity/apache-solr-velocity-4.0.1-javadoc.jar>
dist-maven-common:
[artifact:install-provider] Installing provider: org.apache.maven.wagon:wagon-ssh:jar:1.0-beta-7:runtime
[artifact:deploy] Deploying to <http://sierranevada.servebeer.com/job/Lucene-Solr-40-ReleaseSmoke/ws/solr/package/maven/>
[artifact:deploy] Uploading: org/apache/solr/solr-velocity/4.0.1/solr-velocity-4.0.1.jar to repository local at <http://sierranevada.servebeer.com/job/Lucene-Solr-40-ReleaseSmoke/ws/solr/package/maven/>
[artifact:deploy] Transferring 22K from local
[artifact:deploy] Uploaded 22K
[artifact:deploy] [INFO] Retrieving previous metadata from local
[artifact:deploy] [INFO] repository metadata for: 'artifact org.apache.solr:solr-velocity' could not be found on repository: local, so will be created
[artifact:deploy] [INFO] Uploading repository metadata for: 'artifact org.apache.solr:solr-velocity'
[artifact:deploy] [INFO] Uploading project information for solr-velocity 4.0.1
[artifact:deploy] Uploading: org/apache/solr/solr-velocity/4.0.1/solr-velocity-4.0.1-sources.jar to repository local at <http://sierranevada.servebeer.com/job/Lucene-Solr-40-ReleaseSmoke/ws/solr/package/maven/>
[artifact:deploy] Transferring 20K from local
[artifact:deploy] Uploaded 20K
[artifact:deploy] Uploading: org/apache/solr/solr-velocity/4.0.1/solr-velocity-4.0.1-javadoc.jar to repository local at <http://sierranevada.servebeer.com/job/Lucene-Solr-40-ReleaseSmoke/ws/solr/package/maven/>
[artifact:deploy] Transferring 68K from local
[artifact:deploy] Uploaded 68K
dist-maven:
prepare-release-no-sign:
[mkdir] Created dir: <http://sierranevada.servebeer.com/job/Lucene-Solr-40-ReleaseSmoke/ws/lucene/build/fakeRelease>
[copy] Copying 381 files to <http://sierranevada.servebeer.com/job/Lucene-Solr-40-ReleaseSmoke/ws/lucene/build/fakeRelease/lucene>
[copy] Copying 4 files to <http://sierranevada.servebeer.com/job/Lucene-Solr-40-ReleaseSmoke/ws/lucene/build/fakeRelease/lucene/changes>
[get] Getting: http://people.apache.org/keys/group/lucene.asc
[get] To: <http://sierranevada.servebeer.com/job/Lucene-Solr-40-ReleaseSmoke/ws/lucene/build/fakeRelease/lucene/KEYS>
[copy] Copying 189 files to <http://sierranevada.servebeer.com/job/Lucene-Solr-40-ReleaseSmoke/ws/lucene/build/fakeRelease/solr>
[copy] Copying 1 file to <http://sierranevada.servebeer.com/job/Lucene-Solr-40-ReleaseSmoke/ws/lucene/build/fakeRelease/solr>
[exec]
[exec] Load release URL "<http://sierranevada.servebeer.com/job/Lucene-Solr-40-ReleaseSmoke/ws/lucene/build/fakeRelease/"...>
[exec]
[exec] Test Lucene...
[exec] test basics...
[exec] get KEYS
[exec] 0.1 MB
[exec] Traceback (most recent call last):
[exec] File "dev-tools/scripts/smokeTestRelease.py", line 1183, in <module>
[exec] main()
[exec] File "dev-tools/scripts/smokeTestRelease.py", line 1131, in main
[exec] smokeTest(baseURL, version, tmpDir, isSigned)
[exec] File "dev-tools/scripts/smokeTestRelease.py", line 1164, in smokeTest
[exec] checkSigs('lucene', lucenePath, version, tmpDir, isSigned)
[exec] File "dev-tools/scripts/smokeTestRelease.py", line 278, in checkSigs
[exec] testChanges(project, version, changesURL)
[exec] File "dev-tools/scripts/smokeTestRelease.py", line 326, in testChanges
[exec] checkChangesContent(s, version, changesURL, project, True)
[exec] File "dev-tools/ check changes HTML...
[exec] scripts/smokeTestRelease.py", line 341, in checkChangesContent
[exec] raise RuntimeError('did not see "Release %s" in %s' % (version, name))
[exec] RuntimeError: did not see "Release 4.0.1" in file://<http://sierranevada.servebeer.com/job/Lucene-Solr-40-ReleaseSmoke/ws/lucene/build/fakeRelease/lucene/changes/Changes.html>
BUILD FAILED
<http://sierranevada.servebeer.com/job/Lucene-Solr-40-ReleaseSmoke/ws/build.xml>:279: exec returned: 1
Total time: 7 minutes 58 seconds
Build step 'Invoke Ant' marked build as failure
---------------------------------------------------------------------
To unsubscribe, e-mail: dev-unsubscribe@lucene.apache.org
For additional commands, e-mail: dev-help@lucene.apache.org
Jenkins build is back to normal : Lucene-Solr-40-ReleaseSmoke #165
Posted by hu...@gmail.com.
See <http://sierranevada.servebeer.com/job/Lucene-Solr-40-ReleaseSmoke/165/changes>
---------------------------------------------------------------------
To unsubscribe, e-mail: dev-unsubscribe@lucene.apache.org
For additional commands, e-mail: dev-help@lucene.apache.org
Re: Build failed in Jenkins: Lucene-Solr-40-ReleaseSmoke #164
Posted by Michael McCandless <lu...@mikemccandless.com>.
My bad ... I committed a fix.
Mike McCandless
http://blog.mikemccandless.com
On Tue, Sep 25, 2012 at 5:56 PM, <hu...@gmail.com> wrote:
> See <http://sierranevada.servebeer.com/job/Lucene-Solr-40-ReleaseSmoke/164/changes>
>
> Changes:
>
> [mikemccand] LUCENE-4429: smokeTestRelease requires version is format X.Y.Z[-ALPHA|-BETA]
>
> ------------------------------------------
> [...truncated 41713 lines...]
> jar-highlighter:
>
> check-memory-uptodate:
>
> jar-memory:
>
> check-misc-uptodate:
>
> jar-misc:
>
> check-spatial-uptodate:
>
> jar-spatial:
>
> check-grouping-uptodate:
>
> jar-grouping:
>
> check-queries-uptodate:
>
> jar-queries:
>
> check-queryparser-uptodate:
>
> jar-queryparser:
>
> prep-lucene-jars:
>
> resolve-example:
> [echo] Building solr-example...
>
> ivy-availability-check:
>
> ivy-fail:
>
> ivy-configure:
> [ivy:configure] :: loading settings :: file = <http://sierranevada.servebeer.com/job/Lucene-Solr-40-ReleaseSmoke/ws/lucene/ivy-settings.xml>
>
> resolve:
> [echo] Building solr-example-DIH...
>
> ivy-availability-check:
>
> ivy-fail:
>
> ivy-configure:
> [ivy:configure] :: loading settings :: file = <http://sierranevada.servebeer.com/job/Lucene-Solr-40-ReleaseSmoke/ws/lucene/ivy-settings.xml>
>
> resolve:
>
> resolve:
>
> common.init:
>
> compile-lucene-core:
>
> ivy-availability-check:
>
> ivy-fail:
>
> ivy-configure:
> [ivy:configure] :: loading settings :: file = <http://sierranevada.servebeer.com/job/Lucene-Solr-40-ReleaseSmoke/ws/lucene/ivy-settings.xml>
>
> resolve:
>
> init:
>
> -clover.disable:
>
> -clover.setup:
>
> clover:
>
> compile-core:
>
> init:
>
> -clover.disable:
>
> -clover.setup:
>
> clover:
>
> common.compile-core:
>
> common-solr.compile-core:
>
> compile-core:
>
> jar-core:
> [jar] Building jar: <http://sierranevada.servebeer.com/job/Lucene-Solr-40-ReleaseSmoke/ws/solr/build/contrib/solr-velocity/apache-solr-velocity-4.0.1.jar>
>
> jar-src:
> [jar] Building jar: <http://sierranevada.servebeer.com/job/Lucene-Solr-40-ReleaseSmoke/ws/solr/build/contrib/solr-velocity/apache-solr-velocity-4.0.1-src.jar>
>
> resolve-groovy:
>
> define-lucene-javadoc-url:
>
> check-lucene-core-javadocs-uptodate:
>
> javadocs-lucene-core:
>
> check-analyzers-common-javadocs-uptodate:
>
> javadocs-analyzers-common:
>
> check-analyzers-icu-javadocs-uptodate:
>
> javadocs-analyzers-icu:
>
> check-analyzers-kuromoji-javadocs-uptodate:
>
> javadocs-analyzers-kuromoji:
>
> check-analyzers-phonetic-javadocs-uptodate:
>
> javadocs-analyzers-phonetic:
>
> check-analyzers-smartcn-javadocs-uptodate:
>
> javadocs-analyzers-smartcn:
>
> check-analyzers-morfologik-javadocs-uptodate:
>
> javadocs-analyzers-morfologik:
>
> check-analyzers-stempel-javadocs-uptodate:
>
> javadocs-analyzers-stempel:
>
> check-analyzers-uima-javadocs-uptodate:
>
> javadocs-analyzers-uima:
>
> check-suggest-javadocs-uptodate:
>
> javadocs-suggest:
>
> check-grouping-javadocs-uptodate:
>
> javadocs-grouping:
>
> check-queries-javadocs-uptodate:
>
> javadocs-queries:
>
> check-queryparser-javadocs-uptodate:
>
> javadocs-queryparser:
>
> check-highlighter-javadocs-uptodate:
>
> javadocs-highlighter:
>
> check-memory-javadocs-uptodate:
>
> javadocs-memory:
>
> check-misc-javadocs-uptodate:
>
> javadocs-misc:
>
> check-spatial-javadocs-uptodate:
>
> javadocs-spatial:
>
> check-test-framework-javadocs-uptodate:
>
> javadocs-test-framework:
>
> lucene-javadocs:
>
> check-solr-core-javadocs-uptodate:
>
> javadocs-solr-core:
>
> javadocs:
> [echo] Building solr-velocity...
>
> download-java6-javadoc-packagelist:
> [delete] Deleting: <http://sierranevada.servebeer.com/job/Lucene-Solr-40-ReleaseSmoke/ws/solr/build/docs/solr-velocity/stylesheet.css>
> [javadoc] Generating Javadoc
> [javadoc] Javadoc execution
> [javadoc] Loading source files for package org.apache.solr.response...
> [javadoc] Constructing Javadoc information...
> [javadoc] Standard Doclet version 1.7.0_01
> [javadoc] Building tree for all the packages and classes...
> [javadoc] Building index for all the packages and classes...
> [javadoc] Building index for all classes...
> [javadoc] Generating <http://sierranevada.servebeer.com/job/Lucene-Solr-40-ReleaseSmoke/ws/solr/build/docs/solr-velocity/help-doc.html...>
> [javadoc] Note: Custom tags that were not seen: @lucene.internal, @lucene.experimental
> [jar] Building jar: <http://sierranevada.servebeer.com/job/Lucene-Solr-40-ReleaseSmoke/ws/solr/build/contrib/solr-velocity/apache-solr-velocity-4.0.1-javadoc.jar>
>
> dist-maven-common:
> [artifact:install-provider] Installing provider: org.apache.maven.wagon:wagon-ssh:jar:1.0-beta-7:runtime
> [artifact:deploy] Deploying to <http://sierranevada.servebeer.com/job/Lucene-Solr-40-ReleaseSmoke/ws/solr/package/maven/>
> [artifact:deploy] Uploading: org/apache/solr/solr-velocity/4.0.1/solr-velocity-4.0.1.jar to repository local at <http://sierranevada.servebeer.com/job/Lucene-Solr-40-ReleaseSmoke/ws/solr/package/maven/>
> [artifact:deploy] Transferring 22K from local
> [artifact:deploy] Uploaded 22K
> [artifact:deploy] [INFO] Retrieving previous metadata from local
> [artifact:deploy] [INFO] repository metadata for: 'artifact org.apache.solr:solr-velocity' could not be found on repository: local, so will be created
> [artifact:deploy] [INFO] Uploading repository metadata for: 'artifact org.apache.solr:solr-velocity'
> [artifact:deploy] [INFO] Uploading project information for solr-velocity 4.0.1
> [artifact:deploy] Uploading: org/apache/solr/solr-velocity/4.0.1/solr-velocity-4.0.1-sources.jar to repository local at <http://sierranevada.servebeer.com/job/Lucene-Solr-40-ReleaseSmoke/ws/solr/package/maven/>
> [artifact:deploy] Transferring 20K from local
> [artifact:deploy] Uploaded 20K
> [artifact:deploy] Uploading: org/apache/solr/solr-velocity/4.0.1/solr-velocity-4.0.1-javadoc.jar to repository local at <http://sierranevada.servebeer.com/job/Lucene-Solr-40-ReleaseSmoke/ws/solr/package/maven/>
> [artifact:deploy] Transferring 68K from local
> [artifact:deploy] Uploaded 68K
>
> dist-maven:
>
> prepare-release-no-sign:
> [mkdir] Created dir: <http://sierranevada.servebeer.com/job/Lucene-Solr-40-ReleaseSmoke/ws/lucene/build/fakeRelease>
> [copy] Copying 381 files to <http://sierranevada.servebeer.com/job/Lucene-Solr-40-ReleaseSmoke/ws/lucene/build/fakeRelease/lucene>
> [copy] Copying 4 files to <http://sierranevada.servebeer.com/job/Lucene-Solr-40-ReleaseSmoke/ws/lucene/build/fakeRelease/lucene/changes>
> [get] Getting: http://people.apache.org/keys/group/lucene.asc
> [get] To: <http://sierranevada.servebeer.com/job/Lucene-Solr-40-ReleaseSmoke/ws/lucene/build/fakeRelease/lucene/KEYS>
> [copy] Copying 189 files to <http://sierranevada.servebeer.com/job/Lucene-Solr-40-ReleaseSmoke/ws/lucene/build/fakeRelease/solr>
> [copy] Copying 1 file to <http://sierranevada.servebeer.com/job/Lucene-Solr-40-ReleaseSmoke/ws/lucene/build/fakeRelease/solr>
> [exec]
> [exec] Load release URL "<http://sierranevada.servebeer.com/job/Lucene-Solr-40-ReleaseSmoke/ws/lucene/build/fakeRelease/"...>
> [exec]
> [exec] Test Lucene...
> [exec] test basics...
> [exec] get KEYS
> [exec] 0.1 MB
> [exec] Traceback (most recent call last):
> [exec] File "dev-tools/scripts/smokeTestRelease.py", line 1183, in <module>
> [exec] main()
> [exec] File "dev-tools/scripts/smokeTestRelease.py", line 1131, in main
> [exec] smokeTest(baseURL, version, tmpDir, isSigned)
> [exec] File "dev-tools/scripts/smokeTestRelease.py", line 1164, in smokeTest
> [exec] checkSigs('lucene', lucenePath, version, tmpDir, isSigned)
> [exec] File "dev-tools/scripts/smokeTestRelease.py", line 278, in checkSigs
> [exec] testChanges(project, version, changesURL)
> [exec] File "dev-tools/scripts/smokeTestRelease.py", line 326, in testChanges
> [exec] checkChangesContent(s, version, changesURL, project, True)
> [exec] File "dev-tools/ check changes HTML...
> [exec] scripts/smokeTestRelease.py", line 341, in checkChangesContent
> [exec] raise RuntimeError('did not see "Release %s" in %s' % (version, name))
> [exec] RuntimeError: did not see "Release 4.0.1" in file://<http://sierranevada.servebeer.com/job/Lucene-Solr-40-ReleaseSmoke/ws/lucene/build/fakeRelease/lucene/changes/Changes.html>
>
> BUILD FAILED
> <http://sierranevada.servebeer.com/job/Lucene-Solr-40-ReleaseSmoke/ws/build.xml>:279: exec returned: 1
>
> Total time: 7 minutes 58 seconds
> Build step 'Invoke Ant' marked build as failure
>
> ---------------------------------------------------------------------
> To unsubscribe, e-mail: dev-unsubscribe@lucene.apache.org
> For additional commands, e-mail: dev-help@lucene.apache.org
>
---------------------------------------------------------------------
To unsubscribe, e-mail: dev-unsubscribe@lucene.apache.org
For additional commands, e-mail: dev-help@lucene.apache.org