You are viewing a plain text version of this content. The canonical link for it is here.
Posted to builds@beam.apache.org by Apache Jenkins Server <je...@builds.apache.org> on 2022/04/30 23:03:34 UTC

Build failed in Jenkins: beam_PostCommit_XVR_PythonUsingJava_Dataflow #369

See <https://ci-beam.apache.org/job/beam_PostCommit_XVR_PythonUsingJava_Dataflow/369/display/redirect?page=changes>

Changes:

[noreply] Revert "Improvement to Seed job configuration to launch against PRs

[ilion.beyst] Minor: fix typo

[noreply] Merge pull request #17422 from [BEAM-14344]: remove tracing from


------------------------------------------
[...truncated 813.46 KB...]
apache-beam @ file:///opt/apache/beam/tars/apache-beam.tar.gz
astunparse==1.6.3
atomicwrites==1.4.0
attrs==21.4.0
beautifulsoup4==4.10.0
bs4==0.0.1
cached-property==1.5.2
cachetools==4.2.4
certifi==2021.10.8
cffi==1.15.0
charset-normalizer==2.0.12
click==8.0.4
cloudpickle==2.0.0
crcmod==1.7
cryptography==36.0.2
Cython==0.29.28
deprecation==2.1.0
dill==0.3.1.1
docker==5.0.3
docopt==0.6.2
execnet==1.9.0
fastavro==1.4.10
fasteners==0.17.3
flatbuffers==2.0
freezegun==1.2.1
future==0.18.2
gast==0.5.3
google-api-core==1.31.5
google-api-python-client==2.41.0
google-apitools==0.5.31
google-auth==1.35.0
google-auth-httplib2==0.1.0
google-auth-oauthlib==0.4.6
google-cloud-bigquery==2.34.2
google-cloud-bigquery-storage==2.13.0
google-cloud-bigtable==1.7.0
google-cloud-core==1.7.2
google-cloud-datastore==1.15.3
google-cloud-dlp==3.6.2
google-cloud-language==1.3.0
google-cloud-profiler==3.0.7
google-cloud-pubsub==2.11.0
google-cloud-pubsublite==1.4.1
google-cloud-recommendations-ai==0.2.0
google-cloud-spanner==1.19.1
google-cloud-videointelligence==1.16.1
google-cloud-vision==1.0.0
google-crc32c==1.3.0
google-pasta==0.2.0
google-python-cloud-debugger==2.18
google-resumable-media==2.3.2
googleapis-common-protos==1.56.0
greenlet==1.1.2
grpc-google-iam-v1==0.12.3
grpcio==1.44.0
grpcio-gcp==0.2.2
grpcio-status==1.44.0
guppy3==3.1.2
h5py==3.6.0
hdfs==2.6.0
httplib2==0.19.1
idna==3.3
importlib-metadata==4.11.3
joblib==1.1.0
keras==2.8.0
Keras-Preprocessing==1.1.2
libclang==13.0.0
Markdown==3.3.6
mmh3==3.0.0
mock==2.0.0
more-itertools==8.12.0
nltk==3.7
nose==1.3.7
numpy==1.21.5
oauth2client==4.1.3
oauthlib==3.2.0
opt-einsum==3.3.0
orjson==3.6.7
overrides==6.1.0
packaging==21.3
pandas==1.3.5
parameterized==0.7.5
pbr==5.8.1
pip==22.0.4
pluggy==0.13.1
proto-plus==1.20.3
protobuf==3.19.4
psycopg2-binary==2.9.3
py==1.11.0
pyarrow==6.0.1
pyasn1==0.4.8
pyasn1-modules==0.2.8
pycparser==2.21
pydot==1.4.2
PyHamcrest==1.10.1
pymongo==3.12.3
PyMySQL==1.0.2
pyparsing==2.4.7
pytest==4.6.11
pytest-forked==1.4.0
pytest-timeout==1.4.2
pytest-xdist==1.34.0
python-dateutil==2.8.2
python-snappy==0.6.1
pytz==2021.3
PyYAML==6.0
regex==2022.3.15
requests==2.27.1
requests-mock==1.9.3
requests-oauthlib==1.3.1
rsa==4.8
scikit-learn==1.0.2
scipy==1.7.3
setuptools==57.5.0
six==1.16.0
soupsieve==2.3.1
SQLAlchemy==1.4.32
tenacity==5.1.5
tensorboard==2.8.0
tensorboard-data-server==0.6.1
tensorboard-plugin-wit==1.8.1
tensorflow==2.8.0
tensorflow-io-gcs-filesystem==0.24.0
termcolor==1.1.0
testcontainers==3.4.2
tf-estimator-nightly==2.8.0.dev2021122109
threadpoolctl==3.1.0
tqdm==4.63.0
typing-utils==0.1.0
typing_extensions==4.1.1
uritemplate==4.1.1
urllib3==1.26.9
wcwidth==0.2.5
websocket-client==1.3.1
Werkzeug==2.0.3
wheel==0.37.1
wrapt==1.14.0
zipp==3.7.0
Removing intermediate container 2da5b56350d4
 ---> edc66e09d2f2
Step 16/31 : COPY target/LICENSE /opt/apache/beam/
 ---> ef0777cdb800
Step 17/31 : COPY target/LICENSE.python /opt/apache/beam/
 ---> 2214e5a41663
Step 18/31 : COPY target/NOTICE /opt/apache/beam/
 ---> 9fc690f954ea
Step 19/31 : COPY target/launcher/linux_amd64/boot /opt/apache/beam/
 ---> e1631e142ce7
Step 20/31 : ENTRYPOINT ["/opt/apache/beam/boot"]
 ---> Running in e9ce8ee6d1d0
Removing intermediate container e9ce8ee6d1d0
 ---> 197e860a4981
Step 21/31 : FROM beam as third_party_licenses
 ---> 197e860a4981
Step 22/31 : ARG pull_licenses
 ---> Running in 4546b5cf9ee7
Removing intermediate container 4546b5cf9ee7
 ---> 18b1d10924f2
Step 23/31 : COPY target/license_scripts /tmp/license_scripts/
 ---> 62b09515756a
Step 24/31 : COPY target/LICENSE target/go-licenses/* /opt/apache/beam/third_party_licenses/golang/
 ---> c8133efe912e
Step 25/31 : RUN rm /opt/apache/beam/third_party_licenses/golang/LICENSE
 ---> Running in 7b277fbce762
Removing intermediate container 7b277fbce762
 ---> ae34296c2a59
Step 26/31 : COPY target/license_scripts /tmp/license_scripts/
 ---> 2b081030210e
Step 27/31 : RUN if [ "$pull_licenses" = "true" ] ; then       pip install 'pip-licenses<4.0.0' pyyaml tenacity &&       python /tmp/license_scripts/pull_licenses_py.py ;     fi
 ---> Running in 5e08c91a3601
Collecting pip-licenses<4.0.0
  Downloading pip_licenses-3.5.3-py3-none-any.whl (17 kB)
Requirement already satisfied: pyyaml in /usr/local/lib/python3.7/site-packages (6.0)
Requirement already satisfied: tenacity in /usr/local/lib/python3.7/site-packages (5.1.5)
Collecting PTable
  Downloading PTable-0.9.2.tar.gz (31 kB)
  Preparing metadata (setup.py): started
  Preparing metadata (setup.py): finished with status 'done'
Requirement already satisfied: six>=1.9.0 in /usr/local/lib/python3.7/site-packages (from tenacity) (1.16.0)
Building wheels for collected packages: PTable
  Building wheel for PTable (setup.py): started
  Building wheel for PTable (setup.py): finished with status 'done'
  Created wheel for PTable: filename=PTable-0.9.2-py3-none-any.whl size=22925 sha256=a2c4f8f5d5933e59f4516dcc340ff8417b9279f5991b424dddc3061e2a5ae066
  Stored in directory: /root/.cache/pip/wheels/33/df/2f/674985b3f8a2de3f96357d1eadef5110f74fa91b3785e52a54
Successfully built PTable
Installing collected packages: PTable, pip-licenses
Successfully installed PTable-0.9.2 pip-licenses-3.5.3
WARNING: Running pip as the 'root' user can result in broken permissions and conflicting behaviour with the system package manager. It is recommended to use a virtual environment instead: https://pip.pypa.io/warnings/venv
Skip pulling license for  bs4
INFO:root:Successfully pulled licenses for 135 dependencies
Removing intermediate container 5e08c91a3601
 ---> 19305bee83ac
Step 28/31 : FROM beam
 ---> 197e860a4981
Step 29/31 : ARG pull_licenses
 ---> Running in 69933362b16e
Removing intermediate container 69933362b16e
 ---> 56db50a3fcf3
Step 30/31 : COPY --from=third_party_licenses /opt/apache/beam/third_party_licenses /opt/apache/beam/third_party_licenses
 ---> b59991ab2884
Step 31/31 : RUN if [ "$pull_licenses" != "true" ] ; then       rm -rf /opt/apache/beam/third_party_licenses ;     fi
 ---> Running in 519d65bd0f2c
Removing intermediate container 519d65bd0f2c
 ---> 59d540a3ff6f
Successfully built 59d540a3ff6f
Successfully tagged apache/beam_python3.7_sdk:2.39.0.dev

> Task :runners:google-cloud-dataflow-java:buildAndPushDockerPythonContainer
WARNING: `gcloud docker` will not be supported for Docker client versions above 18.03.

As an alternative, use `gcloud auth configure-docker` to configure `docker` to
use `gcloud` as a credential helper, then use `docker` as you would for non-GCR
registries, e.g. `docker pull gcr.io/project-id/my-image`. Add
`--verbosity=error` to silence this warning: `gcloud docker
--verbosity=error -- pull gcr.io/project-id/my-image`.

See: https://cloud.google.com/container-registry/docs/support/deprecation-notices#gcloud-docker


FAILURE: Build failed with an exception.

* What went wrong:
Execution failed for task ':sdks:java:container:pullLicenses'.
> Process 'command './license_scripts/license_script.sh'' finished with non-zero exit value 1

* Try:
> Run with --stacktrace option to get the stack trace.
> Run with --info or --debug option to get more log output.
> Run with --scan to get full insights.

* Get more help at https://help.gradle.org

Deprecated Gradle features were used in this build, making it incompatible with Gradle 8.0.

You can use '--warning-mode all' to show the individual deprecation warnings and determine if they come from your own scripts or plugins.

See https://docs.gradle.org/7.4/userguide/command_line_interface.html#sec:command_line_warnings

Execution optimizations have been disabled for 1 invalid unit(s) of work during this build to ensure correctness.
Please consult deprecation warnings for more details.

BUILD FAILED in 11m 1s
130 actionable tasks: 88 executed, 36 from cache, 6 up-to-date

Publishing build scan...
https://gradle.com/s/wjmwx2hmcbcki

Build step 'Invoke Gradle script' changed build result to FAILURE
Build step 'Invoke Gradle script' marked build as failure

---------------------------------------------------------------------
To unsubscribe, e-mail: builds-unsubscribe@beam.apache.org
For additional commands, e-mail: builds-help@beam.apache.org


Jenkins build is back to normal : beam_PostCommit_XVR_PythonUsingJava_Dataflow #376

Posted by Apache Jenkins Server <je...@builds.apache.org>.
See <https://ci-beam.apache.org/job/beam_PostCommit_XVR_PythonUsingJava_Dataflow/376/display/redirect?page=changes>


---------------------------------------------------------------------
To unsubscribe, e-mail: builds-unsubscribe@beam.apache.org
For additional commands, e-mail: builds-help@beam.apache.org


Build failed in Jenkins: beam_PostCommit_XVR_PythonUsingJava_Dataflow #375

Posted by Apache Jenkins Server <je...@builds.apache.org>.
See <https://ci-beam.apache.org/job/beam_PostCommit_XVR_PythonUsingJava_Dataflow/375/display/redirect>

Changes:


------------------------------------------
[...truncated 806.21 KB...]
mock==2.0.0
more-itertools==8.12.0
nltk==3.7
nose==1.3.7
numpy==1.21.5
oauth2client==4.1.3
oauthlib==3.2.0
opt-einsum==3.3.0
orjson==3.6.7
overrides==6.1.0
packaging==21.3
pandas==1.3.5
parameterized==0.7.5
pbr==5.8.1
pip==22.0.4
pluggy==0.13.1
proto-plus==1.20.3
protobuf==3.19.4
psycopg2-binary==2.9.3
py==1.11.0
pyarrow==6.0.1
pyasn1==0.4.8
pyasn1-modules==0.2.8
pycparser==2.21
pydot==1.4.2
PyHamcrest==1.10.1
pymongo==3.12.3
PyMySQL==1.0.2
pyparsing==2.4.7
pytest==4.6.11
pytest-forked==1.4.0
pytest-timeout==1.4.2
pytest-xdist==1.34.0
python-dateutil==2.8.2
python-snappy==0.6.1
pytz==2021.3
PyYAML==6.0
regex==2022.3.15
requests==2.27.1
requests-mock==1.9.3
requests-oauthlib==1.3.1
rsa==4.8
scikit-learn==1.0.2
scipy==1.7.3
setuptools==57.5.0
six==1.16.0
soupsieve==2.3.1
SQLAlchemy==1.4.32
tenacity==5.1.5
tensorboard==2.8.0
tensorboard-data-server==0.6.1
tensorboard-plugin-wit==1.8.1
tensorflow==2.8.0
tensorflow-io-gcs-filesystem==0.24.0
termcolor==1.1.0
testcontainers==3.4.2
tf-estimator-nightly==2.8.0.dev2021122109
threadpoolctl==3.1.0
tqdm==4.63.0
typing-utils==0.1.0
typing_extensions==4.1.1
uritemplate==4.1.1
urllib3==1.26.9
wcwidth==0.2.5
websocket-client==1.3.1
Werkzeug==2.0.3
wheel==0.37.1
wrapt==1.14.0
zipp==3.7.0
Removing intermediate container 236f74da5db6
 ---> e79426391e50
Step 16/31 : COPY target/LICENSE /opt/apache/beam/
 ---> 9709cf6db625
Step 17/31 : COPY target/LICENSE.python /opt/apache/beam/
 ---> bff390d30661
Step 18/31 : COPY target/NOTICE /opt/apache/beam/
 ---> 5503ca692ff2
Step 19/31 : COPY target/launcher/linux_amd64/boot /opt/apache/beam/
 ---> d879768c7476
Step 20/31 : ENTRYPOINT ["/opt/apache/beam/boot"]
 ---> Running in e769baf8107b
Removing intermediate container e769baf8107b
 ---> 6567df87dd75
Step 21/31 : FROM beam as third_party_licenses
 ---> 6567df87dd75
Step 22/31 : ARG pull_licenses
 ---> Running in 0bae639f8eb8
Removing intermediate container 0bae639f8eb8
 ---> 7dbcfd57a017
Step 23/31 : COPY target/license_scripts /tmp/license_scripts/
 ---> 7d5dfa93e028
Step 24/31 : COPY target/LICENSE target/go-licenses/* /opt/apache/beam/third_party_licenses/golang/
 ---> bad5af08787d
Step 25/31 : RUN rm /opt/apache/beam/third_party_licenses/golang/LICENSE
 ---> Running in d7037fdec471
Removing intermediate container d7037fdec471
 ---> 82ab737d7dfe
Step 26/31 : COPY target/license_scripts /tmp/license_scripts/
 ---> 577781647315
Step 27/31 : RUN if [ "$pull_licenses" = "true" ] ; then       pip install 'pip-licenses<4.0.0' pyyaml tenacity &&       python /tmp/license_scripts/pull_licenses_py.py ;     fi
 ---> Running in e4dd7cfdb8f4
Collecting pip-licenses<4.0.0
  Downloading pip_licenses-3.5.4-py3-none-any.whl (17 kB)
Requirement already satisfied: pyyaml in /usr/local/lib/python3.7/site-packages (6.0)
Requirement already satisfied: tenacity in /usr/local/lib/python3.7/site-packages (5.1.5)
Collecting PTable
  Downloading PTable-0.9.2.tar.gz (31 kB)
  Preparing metadata (setup.py): started
  Preparing metadata (setup.py): finished with status 'done'
Requirement already satisfied: six>=1.9.0 in /usr/local/lib/python3.7/site-packages (from tenacity) (1.16.0)
Building wheels for collected packages: PTable
  Building wheel for PTable (setup.py): started
  Building wheel for PTable (setup.py): finished with status 'done'
  Created wheel for PTable: filename=PTable-0.9.2-py3-none-any.whl size=22925 sha256=d5774a6d0db4e166684f9475ca37f5487a44c880be63ea959db3aaff66e2c1ca
  Stored in directory: /root/.cache/pip/wheels/33/df/2f/674985b3f8a2de3f96357d1eadef5110f74fa91b3785e52a54
Successfully built PTable
Installing collected packages: PTable, pip-licenses
Successfully installed PTable-0.9.2 pip-licenses-3.5.4
WARNING: Running pip as the 'root' user can result in broken permissions and conflicting behaviour with the system package manager. It is recommended to use a virtual environment instead: https://pip.pypa.io/warnings/venv
Skip pulling license for  bs4
INFO:root:Successfully pulled licenses for 135 dependencies
Removing intermediate container e4dd7cfdb8f4
 ---> 587f05db60d3
Step 28/31 : FROM beam
 ---> 6567df87dd75
Step 29/31 : ARG pull_licenses
 ---> Running in 12704003f3a3
Removing intermediate container 12704003f3a3
 ---> 2d50d3e8268e
Step 30/31 : COPY --from=third_party_licenses /opt/apache/beam/third_party_licenses /opt/apache/beam/third_party_licenses
 ---> 41c0a49b9e8c
Step 31/31 : RUN if [ "$pull_licenses" != "true" ] ; then       rm -rf /opt/apache/beam/third_party_licenses ;     fi
 ---> Running in 89ef399b2503
Removing intermediate container 89ef399b2503
 ---> bf0839101c95
Successfully built bf0839101c95
Successfully tagged apache/beam_python3.7_sdk:2.39.0.dev

> Task :runners:google-cloud-dataflow-java:buildAndPushDockerPythonContainer
WARNING: `gcloud docker` will not be supported for Docker client versions above 18.03.

As an alternative, use `gcloud auth configure-docker` to configure `docker` to
use `gcloud` as a credential helper, then use `docker` as you would for non-GCR
registries, e.g. `docker pull gcr.io/project-id/my-image`. Add
`--verbosity=error` to silence this warning: `gcloud docker
--verbosity=error -- pull gcr.io/project-id/my-image`.

See: https://cloud.google.com/container-registry/docs/support/deprecation-notices#gcloud-docker

The push refers to repository [us.gcr.io/apache-beam-testing/java-postcommit-it/python]
3172ce856beb: Preparing
3acb297511e8: Preparing
b852e035dcbf: Preparing
ed9f821a5319: Preparing
b481674b7678: Preparing
3370217d1a91: Preparing
abad4d2aad7a: Preparing
a1eb7b81a232: Preparing
80290fa7edd5: Preparing
b0d04bcf9f65: Preparing
d37c0cca9d96: Preparing
581a329dc1c9: Preparing
74f8fe41da92: Preparing
d10c355c076a: Preparing
62a73ca7cbeb: Preparing
ea02e4889d36: Preparing
c4418e789e70: Preparing
7c12a541abbf: Preparing
6d95196cbe50: Preparing
5bdcc8e2060c: Preparing
08fa02ce37eb: Preparing
a037458de4e0: Preparing
bafdbe68e4ae: Preparing
a13c519c6361: Preparing
a1eb7b81a232: Waiting
80290fa7edd5: Waiting
a037458de4e0: Waiting
b0d04bcf9f65: Waiting
bafdbe68e4ae: Waiting
d37c0cca9d96: Waiting
5bdcc8e2060c: Waiting
581a329dc1c9: Waiting
7c12a541abbf: Waiting
3370217d1a91: Waiting
08fa02ce37eb: Waiting
62a73ca7cbeb: Waiting
74f8fe41da92: Waiting
abad4d2aad7a: Waiting
c4418e789e70: Waiting
6d95196cbe50: Waiting
ea02e4889d36: Waiting
a13c519c6361: Waiting
d10c355c076a: Waiting
b852e035dcbf: Pushed
ed9f821a5319: Pushed
b481674b7678: Pushed
3172ce856beb: Pushed
3acb297511e8: Pushed
abad4d2aad7a: Pushed
3370217d1a91: Pushed
80290fa7edd5: Pushed
b0d04bcf9f65: Pushed
d37c0cca9d96: Pushed
d10c355c076a: Pushed
ea02e4889d36: Layer already exists
c4418e789e70: Layer already exists
7c12a541abbf: Layer already exists
6d95196cbe50: Layer already exists
5bdcc8e2060c: Layer already exists
08fa02ce37eb: Layer already exists
a037458de4e0: Layer already exists
bafdbe68e4ae: Layer already exists
62a73ca7cbeb: Pushed
a13c519c6361: Layer already exists
a1eb7b81a232: Pushed
581a329dc1c9: Pushed
74f8fe41da92: Pushed
20220502105241: digest: sha256:f730cc333114f8050a102c7b0ae867ec5d2ef4fd6410416648c8108fe1866971 size: 5361

FAILURE: Build failed with an exception.

* What went wrong:
Execution failed for task ':sdks:java:container:pullLicenses'.
> Process 'command './license_scripts/license_script.sh'' finished with non-zero exit value 1

* Try:
> Run with --stacktrace option to get the stack trace.
> Run with --info or --debug option to get more log output.
> Run with --scan to get full insights.

* Get more help at https://help.gradle.org

Deprecated Gradle features were used in this build, making it incompatible with Gradle 8.0.

You can use '--warning-mode all' to show the individual deprecation warnings and determine if they come from your own scripts or plugins.

See https://docs.gradle.org/7.4/userguide/command_line_interface.html#sec:command_line_warnings

Execution optimizations have been disabled for 1 invalid unit(s) of work during this build to ensure correctness.
Please consult deprecation warnings for more details.

BUILD FAILED in 10m 51s
130 actionable tasks: 86 executed, 38 from cache, 6 up-to-date

Publishing build scan...
https://gradle.com/s/lh5jokfyzdl3i

Build step 'Invoke Gradle script' changed build result to FAILURE
Build step 'Invoke Gradle script' marked build as failure

---------------------------------------------------------------------
To unsubscribe, e-mail: builds-unsubscribe@beam.apache.org
For additional commands, e-mail: builds-help@beam.apache.org


Build failed in Jenkins: beam_PostCommit_XVR_PythonUsingJava_Dataflow #374

Posted by Apache Jenkins Server <je...@builds.apache.org>.
See <https://ci-beam.apache.org/job/beam_PostCommit_XVR_PythonUsingJava_Dataflow/374/display/redirect?page=changes>

Changes:

[noreply] [BEAM-11105] Add manual watermark estimation (#17475)


------------------------------------------
[...truncated 803.38 KB...]
mmh3==3.0.0
mock==2.0.0
more-itertools==8.12.0
nltk==3.7
nose==1.3.7
numpy==1.21.5
oauth2client==4.1.3
oauthlib==3.2.0
opt-einsum==3.3.0
orjson==3.6.7
overrides==6.1.0
packaging==21.3
pandas==1.3.5
parameterized==0.7.5
pbr==5.8.1
pip==22.0.4
pluggy==0.13.1
proto-plus==1.20.3
protobuf==3.19.4
psycopg2-binary==2.9.3
py==1.11.0
pyarrow==6.0.1
pyasn1==0.4.8
pyasn1-modules==0.2.8
pycparser==2.21
pydot==1.4.2
PyHamcrest==1.10.1
pymongo==3.12.3
PyMySQL==1.0.2
pyparsing==2.4.7
pytest==4.6.11
pytest-forked==1.4.0
pytest-timeout==1.4.2
pytest-xdist==1.34.0
python-dateutil==2.8.2
python-snappy==0.6.1
pytz==2021.3
PyYAML==6.0
regex==2022.3.15
requests==2.27.1
requests-mock==1.9.3
requests-oauthlib==1.3.1
rsa==4.8
scikit-learn==1.0.2
scipy==1.7.3
setuptools==57.5.0
six==1.16.0
soupsieve==2.3.1
SQLAlchemy==1.4.32
tenacity==5.1.5
tensorboard==2.8.0
tensorboard-data-server==0.6.1
tensorboard-plugin-wit==1.8.1
tensorflow==2.8.0
tensorflow-io-gcs-filesystem==0.24.0
termcolor==1.1.0
testcontainers==3.4.2
tf-estimator-nightly==2.8.0.dev2021122109
threadpoolctl==3.1.0
tqdm==4.63.0
typing-utils==0.1.0
typing_extensions==4.1.1
uritemplate==4.1.1
urllib3==1.26.9
wcwidth==0.2.5
websocket-client==1.3.1
Werkzeug==2.0.3
wheel==0.37.1
wrapt==1.14.0
zipp==3.7.0
Removing intermediate container 8591bf530c35
 ---> 54065b07576e
Step 16/31 : COPY target/LICENSE /opt/apache/beam/
 ---> 616eb309ad16
Step 17/31 : COPY target/LICENSE.python /opt/apache/beam/
 ---> 2f2ba797c865
Step 18/31 : COPY target/NOTICE /opt/apache/beam/
 ---> cf6c33fa9174
Step 19/31 : COPY target/launcher/linux_amd64/boot /opt/apache/beam/
 ---> 2ad211902124
Step 20/31 : ENTRYPOINT ["/opt/apache/beam/boot"]
 ---> Running in 41d986c42c61
Removing intermediate container 41d986c42c61
 ---> daa4c7e2fb95
Step 21/31 : FROM beam as third_party_licenses
 ---> daa4c7e2fb95
Step 22/31 : ARG pull_licenses
 ---> Running in de387a1d5aeb
Removing intermediate container de387a1d5aeb
 ---> 58ba4c1b8c56
Step 23/31 : COPY target/license_scripts /tmp/license_scripts/
 ---> 807aa9857c4b
Step 24/31 : COPY target/LICENSE target/go-licenses/* /opt/apache/beam/third_party_licenses/golang/
 ---> 806b50410eb6
Step 25/31 : RUN rm /opt/apache/beam/third_party_licenses/golang/LICENSE
 ---> Running in 3144f9e3d51d
Removing intermediate container 3144f9e3d51d
 ---> 0074b80b0991
Step 26/31 : COPY target/license_scripts /tmp/license_scripts/
 ---> 998c75dbedde
Step 27/31 : RUN if [ "$pull_licenses" = "true" ] ; then       pip install 'pip-licenses<4.0.0' pyyaml tenacity &&       python /tmp/license_scripts/pull_licenses_py.py ;     fi
 ---> Running in 09e4ae04e080
Collecting pip-licenses<4.0.0
  Downloading pip_licenses-3.5.4-py3-none-any.whl (17 kB)
Requirement already satisfied: pyyaml in /usr/local/lib/python3.7/site-packages (6.0)
Requirement already satisfied: tenacity in /usr/local/lib/python3.7/site-packages (5.1.5)
Collecting PTable
  Downloading PTable-0.9.2.tar.gz (31 kB)
  Preparing metadata (setup.py): started
  Preparing metadata (setup.py): finished with status 'done'
Requirement already satisfied: six>=1.9.0 in /usr/local/lib/python3.7/site-packages (from tenacity) (1.16.0)
Building wheels for collected packages: PTable
  Building wheel for PTable (setup.py): started
  Building wheel for PTable (setup.py): finished with status 'done'
  Created wheel for PTable: filename=PTable-0.9.2-py3-none-any.whl size=22925 sha256=59306a7589faf3a63f15becc67a07ecc8b7417c6a39f500b3086b6d63d4abd1e
  Stored in directory: /root/.cache/pip/wheels/33/df/2f/674985b3f8a2de3f96357d1eadef5110f74fa91b3785e52a54
Successfully built PTable
Installing collected packages: PTable, pip-licenses
Successfully installed PTable-0.9.2 pip-licenses-3.5.4
WARNING: Running pip as the 'root' user can result in broken permissions and conflicting behaviour with the system package manager. It is recommended to use a virtual environment instead: https://pip.pypa.io/warnings/venv
Skip pulling license for  bs4
INFO:root:Successfully pulled licenses for 135 dependencies
Removing intermediate container 09e4ae04e080
 ---> 02e669c0df7b
Step 28/31 : FROM beam
 ---> daa4c7e2fb95
Step 29/31 : ARG pull_licenses
 ---> Running in 279443dc87f6
Removing intermediate container 279443dc87f6
 ---> b62369ab3dab
Step 30/31 : COPY --from=third_party_licenses /opt/apache/beam/third_party_licenses /opt/apache/beam/third_party_licenses
 ---> 132e79b5fbc1
Step 31/31 : RUN if [ "$pull_licenses" != "true" ] ; then       rm -rf /opt/apache/beam/third_party_licenses ;     fi
 ---> Running in c9b1447db81e
Removing intermediate container c9b1447db81e
 ---> 57d2d2b93d47
Successfully built 57d2d2b93d47
Successfully tagged apache/beam_python3.7_sdk:2.39.0.dev

> Task :runners:google-cloud-dataflow-java:buildAndPushDockerPythonContainer
WARNING: `gcloud docker` will not be supported for Docker client versions above 18.03.

As an alternative, use `gcloud auth configure-docker` to configure `docker` to
use `gcloud` as a credential helper, then use `docker` as you would for non-GCR
registries, e.g. `docker pull gcr.io/project-id/my-image`. Add
`--verbosity=error` to silence this warning: `gcloud docker
--verbosity=error -- pull gcr.io/project-id/my-image`.

See: https://cloud.google.com/container-registry/docs/support/deprecation-notices#gcloud-docker

The push refers to repository [us.gcr.io/apache-beam-testing/java-postcommit-it/python]
90ac797bbb67: Preparing
0011ab57b2c0: Preparing
7486acb71973: Preparing
361419e31389: Preparing
01104539f738: Preparing
ada9f8ac0b3e: Preparing
92c8dc46e344: Preparing
69ffec3f76a0: Preparing
7c7c40fc82ad: Preparing
a86fd180bbb3: Preparing
c1c4b394d20a: Preparing
afd6cee77578: Preparing
daa47f80acb4: Preparing
5c0a043c0d0f: Preparing
91967df92c66: Preparing
ea02e4889d36: Preparing
c4418e789e70: Preparing
7c12a541abbf: Preparing
6d95196cbe50: Preparing
5bdcc8e2060c: Preparing
08fa02ce37eb: Preparing
a037458de4e0: Preparing
bafdbe68e4ae: Preparing
a13c519c6361: Preparing
5c0a043c0d0f: Waiting
91967df92c66: Waiting
ada9f8ac0b3e: Waiting
92c8dc46e344: Waiting
ea02e4889d36: Waiting
08fa02ce37eb: Waiting
69ffec3f76a0: Waiting
c4418e789e70: Waiting
a037458de4e0: Waiting
7c7c40fc82ad: Waiting
bafdbe68e4ae: Waiting
7c12a541abbf: Waiting
a13c519c6361: Waiting
daa47f80acb4: Waiting
6d95196cbe50: Waiting
5bdcc8e2060c: Waiting
a86fd180bbb3: Waiting
afd6cee77578: Waiting
01104539f738: Pushed
7486acb71973: Pushed
361419e31389: Pushed
90ac797bbb67: Pushed
0011ab57b2c0: Pushed
ada9f8ac0b3e: Pushed
92c8dc46e344: Pushed
7c7c40fc82ad: Pushed
a86fd180bbb3: Pushed
c1c4b394d20a: Pushed
5c0a043c0d0f: Pushed
ea02e4889d36: Layer already exists
c4418e789e70: Layer already exists
7c12a541abbf: Layer already exists
6d95196cbe50: Layer already exists
5bdcc8e2060c: Layer already exists
08fa02ce37eb: Layer already exists
a037458de4e0: Layer already exists
91967df92c66: Pushed
bafdbe68e4ae: Layer already exists
a13c519c6361: Layer already exists
69ffec3f76a0: Pushed
afd6cee77578: Pushed
daa47f80acb4: Pushed
20220502045243: digest: sha256:26ac5daa2d9e43ae45ef82adc78d19784915e751a585f9d45340bc2f2aebb1d0 size: 5361

FAILURE: Build failed with an exception.

* What went wrong:
Execution failed for task ':sdks:java:container:pullLicenses'.
> Process 'command './license_scripts/license_script.sh'' finished with non-zero exit value 1

* Try:
> Run with --stacktrace option to get the stack trace.
> Run with --info or --debug option to get more log output.
> Run with --scan to get full insights.

* Get more help at https://help.gradle.org

Deprecated Gradle features were used in this build, making it incompatible with Gradle 8.0.

You can use '--warning-mode all' to show the individual deprecation warnings and determine if they come from your own scripts or plugins.

See https://docs.gradle.org/7.4/userguide/command_line_interface.html#sec:command_line_warnings

Execution optimizations have been disabled for 1 invalid unit(s) of work during this build to ensure correctness.
Please consult deprecation warnings for more details.

BUILD FAILED in 11m 4s
130 actionable tasks: 86 executed, 38 from cache, 6 up-to-date

Publishing build scan...
https://gradle.com/s/sc3e5ij7cx2km

Build step 'Invoke Gradle script' changed build result to FAILURE
Build step 'Invoke Gradle script' marked build as failure

---------------------------------------------------------------------
To unsubscribe, e-mail: builds-unsubscribe@beam.apache.org
For additional commands, e-mail: builds-help@beam.apache.org


Build failed in Jenkins: beam_PostCommit_XVR_PythonUsingJava_Dataflow #373

Posted by Apache Jenkins Server <je...@builds.apache.org>.
See <https://ci-beam.apache.org/job/beam_PostCommit_XVR_PythonUsingJava_Dataflow/373/display/redirect>

Changes:


------------------------------------------
[...truncated 457.79 KB...]
    raise HTTPError(req.full_url, code, msg, hdrs, fp)
urllib.error.HTTPError: HTTP Error 403: Forbidden
ERROR:root:Invalid url for slf4j-simple-1.7.30: http://www.opensource.org/licenses/mit-license.php after 9 retries.
Traceback (most recent call last):
  File "<https://ci-beam.apache.org/job/beam_PostCommit_XVR_PythonUsingJava_Dataflow/ws/src/sdks/java/container/license_scripts/pull_licenses_java.py",> line 58, in pull_from_url
    url_read = urlopen(url)
  File "/usr/lib/python3.7/urllib/request.py", line 222, in urlopen
    return opener.open(url, data, timeout)
  File "/usr/lib/python3.7/urllib/request.py", line 531, in open
    response = meth(req, response)
  File "/usr/lib/python3.7/urllib/request.py", line 641, in http_response
    'http', request, response, code, msg, hdrs)
  File "/usr/lib/python3.7/urllib/request.py", line 569, in error
    return self._call_chain(*args)
  File "/usr/lib/python3.7/urllib/request.py", line 503, in _call_chain
    result = func(*args)
  File "/usr/lib/python3.7/urllib/request.py", line 649, in http_error_default
    raise HTTPError(req.full_url, code, msg, hdrs, fp)
urllib.error.HTTPError: HTTP Error 403: Forbidden
ERROR:root:Invalid url for jdbc-1.16.3: http://opensource.org/licenses/MIT after 9 retries.
Traceback (most recent call last):
  File "<https://ci-beam.apache.org/job/beam_PostCommit_XVR_PythonUsingJava_Dataflow/ws/src/sdks/java/container/license_scripts/pull_licenses_java.py",> line 58, in pull_from_url
    url_read = urlopen(url)
  File "/usr/lib/python3.7/urllib/request.py", line 222, in urlopen
    return opener.open(url, data, timeout)
  File "/usr/lib/python3.7/urllib/request.py", line 531, in open
    response = meth(req, response)
  File "/usr/lib/python3.7/urllib/request.py", line 641, in http_response
    'http', request, response, code, msg, hdrs)
  File "/usr/lib/python3.7/urllib/request.py", line 569, in error
    return self._call_chain(*args)
  File "/usr/lib/python3.7/urllib/request.py", line 503, in _call_chain
    result = func(*args)
  File "/usr/lib/python3.7/urllib/request.py", line 649, in http_error_default
    raise HTTPError(req.full_url, code, msg, hdrs, fp)
urllib.error.HTTPError: HTTP Error 403: Forbidden
ERROR:root:Invalid url for kafka-1.16.3: http://opensource.org/licenses/MIT. Retrying...
Traceback (most recent call last):
  File "<https://ci-beam.apache.org/job/beam_PostCommit_XVR_PythonUsingJava_Dataflow/ws/src/sdks/java/container/license_scripts/pull_licenses_java.py",> line 58, in pull_from_url
    url_read = urlopen(url)
  File "/usr/lib/python3.7/urllib/request.py", line 222, in urlopen
    return opener.open(url, data, timeout)
  File "/usr/lib/python3.7/urllib/request.py", line 531, in open
    response = meth(req, response)
  File "/usr/lib/python3.7/urllib/request.py", line 641, in http_response
    'http', request, response, code, msg, hdrs)
  File "/usr/lib/python3.7/urllib/request.py", line 569, in error
    return self._call_chain(*args)
  File "/usr/lib/python3.7/urllib/request.py", line 503, in _call_chain
    result = func(*args)
  File "/usr/lib/python3.7/urllib/request.py", line 649, in http_error_default
    raise HTTPError(req.full_url, code, msg, hdrs, fp)
urllib.error.HTTPError: HTTP Error 403: Forbidden
ERROR:root:Invalid url for postgresql-1.16.3: http://opensource.org/licenses/MIT after 9 retries.
Traceback (most recent call last):
  File "<https://ci-beam.apache.org/job/beam_PostCommit_XVR_PythonUsingJava_Dataflow/ws/src/sdks/java/container/license_scripts/pull_licenses_java.py",> line 58, in pull_from_url
    url_read = urlopen(url)
  File "/usr/lib/python3.7/urllib/request.py", line 222, in urlopen
    return opener.open(url, data, timeout)
  File "/usr/lib/python3.7/urllib/request.py", line 531, in open
    response = meth(req, response)
  File "/usr/lib/python3.7/urllib/request.py", line 641, in http_response
    'http', request, response, code, msg, hdrs)
  File "/usr/lib/python3.7/urllib/request.py", line 569, in error
    return self._call_chain(*args)
  File "/usr/lib/python3.7/urllib/request.py", line 503, in _call_chain
    result = func(*args)
  File "/usr/lib/python3.7/urllib/request.py", line 649, in http_error_default
    raise HTTPError(req.full_url, code, msg, hdrs, fp)
urllib.error.HTTPError: HTTP Error 403: Forbidden
ERROR:root:Invalid url for kafka-1.16.3: http://opensource.org/licenses/MIT. Retrying...
Traceback (most recent call last):
  File "<https://ci-beam.apache.org/job/beam_PostCommit_XVR_PythonUsingJava_Dataflow/ws/src/sdks/java/container/license_scripts/pull_licenses_java.py",> line 58, in pull_from_url
    url_read = urlopen(url)
  File "/usr/lib/python3.7/urllib/request.py", line 222, in urlopen
    return opener.open(url, data, timeout)
  File "/usr/lib/python3.7/urllib/request.py", line 531, in open
    response = meth(req, response)
  File "/usr/lib/python3.7/urllib/request.py", line 641, in http_response
    'http', request, response, code, msg, hdrs)
  File "/usr/lib/python3.7/urllib/request.py", line 569, in error
    return self._call_chain(*args)
  File "/usr/lib/python3.7/urllib/request.py", line 503, in _call_chain
    result = func(*args)
  File "/usr/lib/python3.7/urllib/request.py", line 649, in http_error_default
    raise HTTPError(req.full_url, code, msg, hdrs, fp)
urllib.error.HTTPError: HTTP Error 403: Forbidden
ERROR:root:Invalid url for kafka-1.16.3: http://opensource.org/licenses/MIT. Retrying...
Traceback (most recent call last):
  File "<https://ci-beam.apache.org/job/beam_PostCommit_XVR_PythonUsingJava_Dataflow/ws/src/sdks/java/container/license_scripts/pull_licenses_java.py",> line 58, in pull_from_url
    url_read = urlopen(url)
  File "/usr/lib/python3.7/urllib/request.py", line 222, in urlopen
    return opener.open(url, data, timeout)
  File "/usr/lib/python3.7/urllib/request.py", line 531, in open
    response = meth(req, response)
  File "/usr/lib/python3.7/urllib/request.py", line 641, in http_response
    'http', request, response, code, msg, hdrs)
  File "/usr/lib/python3.7/urllib/request.py", line 569, in error
    return self._call_chain(*args)
  File "/usr/lib/python3.7/urllib/request.py", line 503, in _call_chain
    result = func(*args)
  File "/usr/lib/python3.7/urllib/request.py", line 649, in http_error_default
    raise HTTPError(req.full_url, code, msg, hdrs, fp)
urllib.error.HTTPError: HTTP Error 403: Forbidden
ERROR:root:Invalid url for kafka-1.16.3: http://opensource.org/licenses/MIT. Retrying...
Traceback (most recent call last):
  File "<https://ci-beam.apache.org/job/beam_PostCommit_XVR_PythonUsingJava_Dataflow/ws/src/sdks/java/container/license_scripts/pull_licenses_java.py",> line 58, in pull_from_url
    url_read = urlopen(url)
  File "/usr/lib/python3.7/urllib/request.py", line 222, in urlopen
    return opener.open(url, data, timeout)
  File "/usr/lib/python3.7/urllib/request.py", line 531, in open
    response = meth(req, response)
  File "/usr/lib/python3.7/urllib/request.py", line 641, in http_response
    'http', request, response, code, msg, hdrs)
  File "/usr/lib/python3.7/urllib/request.py", line 569, in error
    return self._call_chain(*args)
  File "/usr/lib/python3.7/urllib/request.py", line 503, in _call_chain
    result = func(*args)
  File "/usr/lib/python3.7/urllib/request.py", line 649, in http_error_default
    raise HTTPError(req.full_url, code, msg, hdrs, fp)
urllib.error.HTTPError: HTTP Error 403: Forbidden
ERROR:root:Invalid url for kafka-1.16.3: http://opensource.org/licenses/MIT. Retrying...
Traceback (most recent call last):
  File "<https://ci-beam.apache.org/job/beam_PostCommit_XVR_PythonUsingJava_Dataflow/ws/src/sdks/java/container/license_scripts/pull_licenses_java.py",> line 58, in pull_from_url
    url_read = urlopen(url)
  File "/usr/lib/python3.7/urllib/request.py", line 222, in urlopen
    return opener.open(url, data, timeout)
  File "/usr/lib/python3.7/urllib/request.py", line 531, in open
    response = meth(req, response)
  File "/usr/lib/python3.7/urllib/request.py", line 641, in http_response
    'http', request, response, code, msg, hdrs)
  File "/usr/lib/python3.7/urllib/request.py", line 569, in error
    return self._call_chain(*args)
  File "/usr/lib/python3.7/urllib/request.py", line 503, in _call_chain
    result = func(*args)
  File "/usr/lib/python3.7/urllib/request.py", line 649, in http_error_default
    raise HTTPError(req.full_url, code, msg, hdrs, fp)
urllib.error.HTTPError: HTTP Error 403: Forbidden
ERROR:root:Invalid url for kafka-1.16.3: http://opensource.org/licenses/MIT. Retrying...
Traceback (most recent call last):
  File "<https://ci-beam.apache.org/job/beam_PostCommit_XVR_PythonUsingJava_Dataflow/ws/src/sdks/java/container/license_scripts/pull_licenses_java.py",> line 58, in pull_from_url
    url_read = urlopen(url)
  File "/usr/lib/python3.7/urllib/request.py", line 222, in urlopen
    return opener.open(url, data, timeout)
  File "/usr/lib/python3.7/urllib/request.py", line 531, in open
    response = meth(req, response)
  File "/usr/lib/python3.7/urllib/request.py", line 641, in http_response
    'http', request, response, code, msg, hdrs)
  File "/usr/lib/python3.7/urllib/request.py", line 569, in error
    return self._call_chain(*args)
  File "/usr/lib/python3.7/urllib/request.py", line 503, in _call_chain
    result = func(*args)
  File "/usr/lib/python3.7/urllib/request.py", line 649, in http_error_default
    raise HTTPError(req.full_url, code, msg, hdrs, fp)
urllib.error.HTTPError: HTTP Error 403: Forbidden
ERROR:root:Invalid url for kafka-1.16.3: http://opensource.org/licenses/MIT. Retrying...
Traceback (most recent call last):
  File "<https://ci-beam.apache.org/job/beam_PostCommit_XVR_PythonUsingJava_Dataflow/ws/src/sdks/java/container/license_scripts/pull_licenses_java.py",> line 58, in pull_from_url
    url_read = urlopen(url)
  File "/usr/lib/python3.7/urllib/request.py", line 222, in urlopen
    return opener.open(url, data, timeout)
  File "/usr/lib/python3.7/urllib/request.py", line 531, in open
    response = meth(req, response)
  File "/usr/lib/python3.7/urllib/request.py", line 641, in http_response
    'http', request, response, code, msg, hdrs)
  File "/usr/lib/python3.7/urllib/request.py", line 569, in error
    return self._call_chain(*args)
  File "/usr/lib/python3.7/urllib/request.py", line 503, in _call_chain
    result = func(*args)
  File "/usr/lib/python3.7/urllib/request.py", line 649, in http_error_default
    raise HTTPError(req.full_url, code, msg, hdrs, fp)
urllib.error.HTTPError: HTTP Error 403: Forbidden
ERROR:root:Invalid url for kafka-1.16.3: http://opensource.org/licenses/MIT. Retrying...
Traceback (most recent call last):
  File "<https://ci-beam.apache.org/job/beam_PostCommit_XVR_PythonUsingJava_Dataflow/ws/src/sdks/java/container/license_scripts/pull_licenses_java.py",> line 58, in pull_from_url
    url_read = urlopen(url)
  File "/usr/lib/python3.7/urllib/request.py", line 222, in urlopen
    return opener.open(url, data, timeout)
  File "/usr/lib/python3.7/urllib/request.py", line 531, in open
    response = meth(req, response)
  File "/usr/lib/python3.7/urllib/request.py", line 641, in http_response
    'http', request, response, code, msg, hdrs)
  File "/usr/lib/python3.7/urllib/request.py", line 569, in error
    return self._call_chain(*args)
  File "/usr/lib/python3.7/urllib/request.py", line 503, in _call_chain
    result = func(*args)
  File "/usr/lib/python3.7/urllib/request.py", line 649, in http_error_default
    raise HTTPError(req.full_url, code, msg, hdrs, fp)
urllib.error.HTTPError: HTTP Error 403: Forbidden
ERROR:root:Invalid url for kafka-1.16.3: http://opensource.org/licenses/MIT after 9 retries.
ERROR:root:['google-auth-library-oauth2-http-1.4.0', 'system-rules-1.19.0', 'reflectasm-1.07', 'zstd-jni-1.4.3-1', 'kryo-2.21', 'software-and-algorithms-1.0', 'google-auth-library-credentials-1.4.0', 'junit-quickcheck-generators-0.8', 'protobuf-java-util-3.19.3', 'protobuf-java-3.19.3', 'grpc-context-1.44.0', 'grpc-alts-1.44.0', 'grpc-protobuf-1.44.0', 'perfmark-api-0.23.0', 'junit-dep-4.11', 'classgraph-4.8.104', 'minlog-1.2', 'zstd-jni-1.5.2-1', 'junit-quickcheck-core-0.8', 'checker-compat-qual-2.5.3', 'grpc-api-1.44.0', 'grpc-core-1.44.0', 'grpc-protobuf-lite-1.44.0', 'duct-tape-1.0.8', 'hamcrest-2.1', 'pcollections-2.1.2', 'slf4j-jdk14-1.7.30', 'database-commons-1.16.3', 'mysql-1.16.3', 'checker-compat-qual-2.5.5', 'grpc-auth-1.44.0', 'grpc-grpclb-1.44.0', 'grpc-stub-1.44.0', 'slf4j-api-1.7.30', 'slf4j-simple-1.7.30', 'jdbc-1.16.3', 'postgresql-1.16.3', 'kafka-1.16.3']
ERROR:root:**************************************** Licenses were not able to be pulled automatically for some dependencies. Please search source code of the dependencies on the internet and add "license" and "notice" (if available) field to <https://ci-beam.apache.org/job/beam_PostCommit_XVR_PythonUsingJava_Dataflow/ws/src/sdks/java/container/license_scripts/dep_urls_java.yaml> for each missing license. Dependency List: [checker-compat-qual-2.5.3,checker-compat-qual-2.5.5,classgraph-4.8.104,database-commons-1.16.3,duct-tape-1.0.8,google-auth-library-credentials-1.4.0,google-auth-library-oauth2-http-1.4.0,grpc-alts-1.44.0,grpc-api-1.44.0,grpc-auth-1.44.0,grpc-context-1.44.0,grpc-core-1.44.0,grpc-grpclb-1.44.0,grpc-protobuf-1.44.0,grpc-protobuf-lite-1.44.0,grpc-stub-1.44.0,hamcrest-2.1,jdbc-1.16.3,junit-dep-4.11,junit-quickcheck-core-0.8,junit-quickcheck-generators-0.8,kafka-1.16.3,kryo-2.21,minlog-1.2,mysql-1.16.3,pcollections-2.1.2,perfmark-api-0.23.0,postgresql-1.16.3,protobuf-java-3.19.3,protobuf-java-util-3.19.3,reflectasm-1.07,slf4j-api-1.7.30,slf4j-jdk14-1.7.30,slf4j-simple-1.7.30,software-and-algorithms-1.0,system-rules-1.19.0,zstd-jni-1.4.3-1,zstd-jni-1.5.2-1]
INFO:root:pull_licenses_java.py failed. It took 162.908215 seconds with 16 threads.
Traceback (most recent call last):
  File "<https://ci-beam.apache.org/job/beam_PostCommit_XVR_PythonUsingJava_Dataflow/ws/src/sdks/java/container/license_scripts/pull_licenses_java.py",> line 322, in <module>
    error_msg)
RuntimeError: ('1 error(s) occurred.', ['**************************************** Licenses were not able to be pulled automatically for some dependencies. Please search source code of the dependencies on the internet and add "license" and "notice" (if available) field to <https://ci-beam.apache.org/job/beam_PostCommit_XVR_PythonUsingJava_Dataflow/ws/src/sdks/java/container/license_scripts/dep_urls_java.yaml> for each missing license. Dependency List: [checker-compat-qual-2.5.3,checker-compat-qual-2.5.5,classgraph-4.8.104,database-commons-1.16.3,duct-tape-1.0.8,google-auth-library-credentials-1.4.0,google-auth-library-oauth2-http-1.4.0,grpc-alts-1.44.0,grpc-api-1.44.0,grpc-auth-1.44.0,grpc-context-1.44.0,grpc-core-1.44.0,grpc-grpclb-1.44.0,grpc-protobuf-1.44.0,grpc-protobuf-lite-1.44.0,grpc-stub-1.44.0,hamcrest-2.1,jdbc-1.16.3,junit-dep-4.11,junit-quickcheck-core-0.8,junit-quickcheck-generators-0.8,kafka-1.16.3,kryo-2.21,minlog-1.2,mysql-1.16.3,pcollections-2.1.2,perfmark-api-0.23.0,postgresql-1.16.3,protobuf-java-3.19.3,protobuf-java-util-3.19.3,reflectasm-1.07,slf4j-api-1.7.30,slf4j-jdk14-1.7.30,slf4j-simple-1.7.30,software-and-algorithms-1.0,system-rules-1.19.0,zstd-jni-1.4.3-1,zstd-jni-1.5.2-1]'])

> Task :sdks:java:container:pullLicenses FAILED
> Task :sdks:java:container:goPrepare UP-TO-DATE
> Task :sdks:java:container:goBuild

> Task :sdks:java:container:java8:copySdkHarnessLauncher
Execution optimizations have been disabled for task ':sdks:java:container:java8:copySdkHarnessLauncher' to ensure correctness due to the following reasons:
  - Gradle detected a problem with the following location: '<https://ci-beam.apache.org/job/beam_PostCommit_XVR_PythonUsingJava_Dataflow/ws/src/sdks/java/container/build/target'.> Reason: Task ':sdks:java:container:java8:copySdkHarnessLauncher' uses this output of task ':sdks:java:container:downloadCloudProfilerAgent' without declaring an explicit or implicit dependency. This can lead to incorrect results being produced, depending on what order the tasks are executed. Please refer to https://docs.gradle.org/7.4/userguide/validation_problems.html#implicit_dependency for more details about this problem.
  - Gradle detected a problem with the following location: '<https://ci-beam.apache.org/job/beam_PostCommit_XVR_PythonUsingJava_Dataflow/ws/src/sdks/java/container/build/target'.> Reason: Task ':sdks:java:container:java8:copySdkHarnessLauncher' uses this output of task ':sdks:java:container:pullLicenses' without declaring an explicit or implicit dependency. This can lead to incorrect results being produced, depending on what order the tasks are executed. Please refer to https://docs.gradle.org/7.4/userguide/validation_problems.html#implicit_dependency for more details about this problem.

> Task :runners:google-cloud-dataflow-java:buildAndPushDockerPythonContainer
WARNING: `gcloud docker` will not be supported for Docker client versions above 18.03.

As an alternative, use `gcloud auth configure-docker` to configure `docker` to
use `gcloud` as a credential helper, then use `docker` as you would for non-GCR
registries, e.g. `docker pull gcr.io/project-id/my-image`. Add
`--verbosity=error` to silence this warning: `gcloud docker
--verbosity=error -- pull gcr.io/project-id/my-image`.

See: https://cloud.google.com/container-registry/docs/support/deprecation-notices#gcloud-docker


FAILURE: Build failed with an exception.

* What went wrong:
Execution failed for task ':sdks:java:container:pullLicenses'.
> Process 'command './license_scripts/license_script.sh'' finished with non-zero exit value 1

* Try:
> Run with --stacktrace option to get the stack trace.
> Run with --info or --debug option to get more log output.
> Run with --scan to get full insights.

* Get more help at https://help.gradle.org

Deprecated Gradle features were used in this build, making it incompatible with Gradle 8.0.

You can use '--warning-mode all' to show the individual deprecation warnings and determine if they come from your own scripts or plugins.

See https://docs.gradle.org/7.4/userguide/command_line_interface.html#sec:command_line_warnings

Execution optimizations have been disabled for 1 invalid unit(s) of work during this build to ensure correctness.
Please consult deprecation warnings for more details.

BUILD FAILED in 10m 57s
130 actionable tasks: 86 executed, 38 from cache, 6 up-to-date

Publishing build scan...
https://gradle.com/s/u3ewyli6kibl6

Build step 'Invoke Gradle script' changed build result to FAILURE
Build step 'Invoke Gradle script' marked build as failure

---------------------------------------------------------------------
To unsubscribe, e-mail: builds-unsubscribe@beam.apache.org
For additional commands, e-mail: builds-help@beam.apache.org


Build failed in Jenkins: beam_PostCommit_XVR_PythonUsingJava_Dataflow #372

Posted by Apache Jenkins Server <je...@builds.apache.org>.
See <https://ci-beam.apache.org/job/beam_PostCommit_XVR_PythonUsingJava_Dataflow/372/display/redirect>

Changes:


------------------------------------------
[...truncated 461.83 KB...]
    raise HTTPError(req.full_url, code, msg, hdrs, fp)
urllib.error.HTTPError: HTTP Error 403: Forbidden
ERROR:root:Invalid url for kafka-1.16.3: http://opensource.org/licenses/MIT. Retrying...
Traceback (most recent call last):
  File "<https://ci-beam.apache.org/job/beam_PostCommit_XVR_PythonUsingJava_Dataflow/ws/src/sdks/java/container/license_scripts/pull_licenses_java.py",> line 58, in pull_from_url
    url_read = urlopen(url)
  File "/usr/lib/python3.7/urllib/request.py", line 222, in urlopen
    return opener.open(url, data, timeout)
  File "/usr/lib/python3.7/urllib/request.py", line 531, in open
    response = meth(req, response)
  File "/usr/lib/python3.7/urllib/request.py", line 641, in http_response
    'http', request, response, code, msg, hdrs)
  File "/usr/lib/python3.7/urllib/request.py", line 569, in error
    return self._call_chain(*args)
  File "/usr/lib/python3.7/urllib/request.py", line 503, in _call_chain
    result = func(*args)
  File "/usr/lib/python3.7/urllib/request.py", line 649, in http_error_default
    raise HTTPError(req.full_url, code, msg, hdrs, fp)
urllib.error.HTTPError: HTTP Error 403: Forbidden
ERROR:root:Invalid url for kafka-1.16.3: http://opensource.org/licenses/MIT. Retrying...
Traceback (most recent call last):
  File "<https://ci-beam.apache.org/job/beam_PostCommit_XVR_PythonUsingJava_Dataflow/ws/src/sdks/java/container/license_scripts/pull_licenses_java.py",> line 58, in pull_from_url
    url_read = urlopen(url)
  File "/usr/lib/python3.7/urllib/request.py", line 222, in urlopen
    return opener.open(url, data, timeout)
  File "/usr/lib/python3.7/urllib/request.py", line 531, in open
    response = meth(req, response)
  File "/usr/lib/python3.7/urllib/request.py", line 641, in http_response
    'http', request, response, code, msg, hdrs)
  File "/usr/lib/python3.7/urllib/request.py", line 569, in error
    return self._call_chain(*args)
  File "/usr/lib/python3.7/urllib/request.py", line 503, in _call_chain
    result = func(*args)
  File "/usr/lib/python3.7/urllib/request.py", line 649, in http_error_default
    raise HTTPError(req.full_url, code, msg, hdrs, fp)
urllib.error.HTTPError: HTTP Error 403: Forbidden
ERROR:root:Invalid url for kafka-1.16.3: http://opensource.org/licenses/MIT. Retrying...
Traceback (most recent call last):
  File "<https://ci-beam.apache.org/job/beam_PostCommit_XVR_PythonUsingJava_Dataflow/ws/src/sdks/java/container/license_scripts/pull_licenses_java.py",> line 58, in pull_from_url
    url_read = urlopen(url)
  File "/usr/lib/python3.7/urllib/request.py", line 222, in urlopen
    return opener.open(url, data, timeout)
  File "/usr/lib/python3.7/urllib/request.py", line 531, in open
    response = meth(req, response)
  File "/usr/lib/python3.7/urllib/request.py", line 641, in http_response
    'http', request, response, code, msg, hdrs)
  File "/usr/lib/python3.7/urllib/request.py", line 569, in error
    return self._call_chain(*args)
  File "/usr/lib/python3.7/urllib/request.py", line 503, in _call_chain
    result = func(*args)
  File "/usr/lib/python3.7/urllib/request.py", line 649, in http_error_default
    raise HTTPError(req.full_url, code, msg, hdrs, fp)
urllib.error.HTTPError: HTTP Error 403: Forbidden
ERROR:root:Invalid url for kafka-1.16.3: http://opensource.org/licenses/MIT. Retrying...
Traceback (most recent call last):
  File "<https://ci-beam.apache.org/job/beam_PostCommit_XVR_PythonUsingJava_Dataflow/ws/src/sdks/java/container/license_scripts/pull_licenses_java.py",> line 58, in pull_from_url
    url_read = urlopen(url)
  File "/usr/lib/python3.7/urllib/request.py", line 222, in urlopen
    return opener.open(url, data, timeout)
  File "/usr/lib/python3.7/urllib/request.py", line 531, in open
    response = meth(req, response)
  File "/usr/lib/python3.7/urllib/request.py", line 641, in http_response
    'http', request, response, code, msg, hdrs)
  File "/usr/lib/python3.7/urllib/request.py", line 569, in error
    return self._call_chain(*args)
  File "/usr/lib/python3.7/urllib/request.py", line 503, in _call_chain
    result = func(*args)
  File "/usr/lib/python3.7/urllib/request.py", line 649, in http_error_default
    raise HTTPError(req.full_url, code, msg, hdrs, fp)
urllib.error.HTTPError: HTTP Error 403: Forbidden
ERROR:root:Invalid url for kafka-1.16.3: http://opensource.org/licenses/MIT. Retrying...
Traceback (most recent call last):
  File "<https://ci-beam.apache.org/job/beam_PostCommit_XVR_PythonUsingJava_Dataflow/ws/src/sdks/java/container/license_scripts/pull_licenses_java.py",> line 58, in pull_from_url
    url_read = urlopen(url)
  File "/usr/lib/python3.7/urllib/request.py", line 222, in urlopen
    return opener.open(url, data, timeout)
  File "/usr/lib/python3.7/urllib/request.py", line 531, in open
    response = meth(req, response)
  File "/usr/lib/python3.7/urllib/request.py", line 641, in http_response
    'http', request, response, code, msg, hdrs)
  File "/usr/lib/python3.7/urllib/request.py", line 569, in error
    return self._call_chain(*args)
  File "/usr/lib/python3.7/urllib/request.py", line 503, in _call_chain
    result = func(*args)
  File "/usr/lib/python3.7/urllib/request.py", line 649, in http_error_default
    raise HTTPError(req.full_url, code, msg, hdrs, fp)
urllib.error.HTTPError: HTTP Error 403: Forbidden
ERROR:root:Invalid url for kafka-1.16.3: http://opensource.org/licenses/MIT. Retrying...
Traceback (most recent call last):
  File "<https://ci-beam.apache.org/job/beam_PostCommit_XVR_PythonUsingJava_Dataflow/ws/src/sdks/java/container/license_scripts/pull_licenses_java.py",> line 58, in pull_from_url
    url_read = urlopen(url)
  File "/usr/lib/python3.7/urllib/request.py", line 222, in urlopen
    return opener.open(url, data, timeout)
  File "/usr/lib/python3.7/urllib/request.py", line 531, in open
    response = meth(req, response)
  File "/usr/lib/python3.7/urllib/request.py", line 641, in http_response
    'http', request, response, code, msg, hdrs)
  File "/usr/lib/python3.7/urllib/request.py", line 569, in error
    return self._call_chain(*args)
  File "/usr/lib/python3.7/urllib/request.py", line 503, in _call_chain
    result = func(*args)
  File "/usr/lib/python3.7/urllib/request.py", line 649, in http_error_default
    raise HTTPError(req.full_url, code, msg, hdrs, fp)
urllib.error.HTTPError: HTTP Error 403: Forbidden
ERROR:root:Invalid url for kafka-1.16.3: http://opensource.org/licenses/MIT. Retrying...
Traceback (most recent call last):
  File "<https://ci-beam.apache.org/job/beam_PostCommit_XVR_PythonUsingJava_Dataflow/ws/src/sdks/java/container/license_scripts/pull_licenses_java.py",> line 58, in pull_from_url
    url_read = urlopen(url)
  File "/usr/lib/python3.7/urllib/request.py", line 222, in urlopen
    return opener.open(url, data, timeout)
  File "/usr/lib/python3.7/urllib/request.py", line 531, in open
    response = meth(req, response)
  File "/usr/lib/python3.7/urllib/request.py", line 641, in http_response
    'http', request, response, code, msg, hdrs)
  File "/usr/lib/python3.7/urllib/request.py", line 569, in error
    return self._call_chain(*args)
  File "/usr/lib/python3.7/urllib/request.py", line 503, in _call_chain
    result = func(*args)
  File "/usr/lib/python3.7/urllib/request.py", line 649, in http_error_default
    raise HTTPError(req.full_url, code, msg, hdrs, fp)
urllib.error.HTTPError: HTTP Error 403: Forbidden
ERROR:root:Invalid url for kafka-1.16.3: http://opensource.org/licenses/MIT after 9 retries.
ERROR:root:['reflectasm-1.07', 'google-auth-library-oauth2-http-1.4.0', 'system-rules-1.19.0', 'zstd-jni-1.4.3-1', 'software-and-algorithms-1.0', 'google-auth-library-credentials-1.4.0', 'kryo-2.21', 'junit-quickcheck-generators-0.8', 'protobuf-java-util-3.19.3', 'classgraph-4.8.104', 'protobuf-java-3.19.3', 'grpc-context-1.44.0', 'grpc-protobuf-1.44.0', 'grpc-alts-1.44.0', 'perfmark-api-0.23.0', 'junit-dep-4.11', 'minlog-1.2', 'zstd-jni-1.5.2-1', 'checker-compat-qual-2.5.3', 'junit-quickcheck-core-0.8', 'grpc-api-1.44.0', 'grpc-core-1.44.0', 'grpc-protobuf-lite-1.44.0', 'hamcrest-2.1', 'pcollections-2.1.2', 'slf4j-jdk14-1.7.30', 'duct-tape-1.0.8', 'database-commons-1.16.3', 'mysql-1.16.3', 'checker-compat-qual-2.5.5', 'slf4j-simple-1.7.30', 'grpc-grpclb-1.44.0', 'slf4j-api-1.7.30', 'grpc-stub-1.44.0', 'jdbc-1.16.3', 'grpc-auth-1.44.0', 'postgresql-1.16.3', 'kafka-1.16.3']
ERROR:root:**************************************** Licenses were not able to be pulled automatically for some dependencies. Please search source code of the dependencies on the internet and add "license" and "notice" (if available) field to <https://ci-beam.apache.org/job/beam_PostCommit_XVR_PythonUsingJava_Dataflow/ws/src/sdks/java/container/license_scripts/dep_urls_java.yaml> for each missing license. Dependency List: [checker-compat-qual-2.5.3,checker-compat-qual-2.5.5,classgraph-4.8.104,database-commons-1.16.3,duct-tape-1.0.8,google-auth-library-credentials-1.4.0,google-auth-library-oauth2-http-1.4.0,grpc-alts-1.44.0,grpc-api-1.44.0,grpc-auth-1.44.0,grpc-context-1.44.0,grpc-core-1.44.0,grpc-grpclb-1.44.0,grpc-protobuf-1.44.0,grpc-protobuf-lite-1.44.0,grpc-stub-1.44.0,hamcrest-2.1,jdbc-1.16.3,junit-dep-4.11,junit-quickcheck-core-0.8,junit-quickcheck-generators-0.8,kafka-1.16.3,kryo-2.21,minlog-1.2,mysql-1.16.3,pcollections-2.1.2,perfmark-api-0.23.0,postgresql-1.16.3,protobuf-java-3.19.3,protobuf-java-util-3.19.3,reflectasm-1.07,slf4j-api-1.7.30,slf4j-jdk14-1.7.30,slf4j-simple-1.7.30,software-and-algorithms-1.0,system-rules-1.19.0,zstd-jni-1.4.3-1,zstd-jni-1.5.2-1]
INFO:root:pull_licenses_java.py failed. It took 162.64946 seconds with 16 threads.
Traceback (most recent call last):
  File "<https://ci-beam.apache.org/job/beam_PostCommit_XVR_PythonUsingJava_Dataflow/ws/src/sdks/java/container/license_scripts/pull_licenses_java.py",> line 322, in <module>
    error_msg)
RuntimeError: ('1 error(s) occurred.', ['**************************************** Licenses were not able to be pulled automatically for some dependencies. Please search source code of the dependencies on the internet and add "license" and "notice" (if available) field to <https://ci-beam.apache.org/job/beam_PostCommit_XVR_PythonUsingJava_Dataflow/ws/src/sdks/java/container/license_scripts/dep_urls_java.yaml> for each missing license. Dependency List: [checker-compat-qual-2.5.3,checker-compat-qual-2.5.5,classgraph-4.8.104,database-commons-1.16.3,duct-tape-1.0.8,google-auth-library-credentials-1.4.0,google-auth-library-oauth2-http-1.4.0,grpc-alts-1.44.0,grpc-api-1.44.0,grpc-auth-1.44.0,grpc-context-1.44.0,grpc-core-1.44.0,grpc-grpclb-1.44.0,grpc-protobuf-1.44.0,grpc-protobuf-lite-1.44.0,grpc-stub-1.44.0,hamcrest-2.1,jdbc-1.16.3,junit-dep-4.11,junit-quickcheck-core-0.8,junit-quickcheck-generators-0.8,kafka-1.16.3,kryo-2.21,minlog-1.2,mysql-1.16.3,pcollections-2.1.2,perfmark-api-0.23.0,postgresql-1.16.3,protobuf-java-3.19.3,protobuf-java-util-3.19.3,reflectasm-1.07,slf4j-api-1.7.30,slf4j-jdk14-1.7.30,slf4j-simple-1.7.30,software-and-algorithms-1.0,system-rules-1.19.0,zstd-jni-1.4.3-1,zstd-jni-1.5.2-1]'])

> Task :sdks:java:container:pullLicenses FAILED
> Task :sdks:java:container:goPrepare UP-TO-DATE
> Task :sdks:java:container:goBuild

> Task :sdks:java:container:java8:copySdkHarnessLauncher
Execution optimizations have been disabled for task ':sdks:java:container:java8:copySdkHarnessLauncher' to ensure correctness due to the following reasons:
  - Gradle detected a problem with the following location: '<https://ci-beam.apache.org/job/beam_PostCommit_XVR_PythonUsingJava_Dataflow/ws/src/sdks/java/container/build/target'.> Reason: Task ':sdks:java:container:java8:copySdkHarnessLauncher' uses this output of task ':sdks:java:container:downloadCloudProfilerAgent' without declaring an explicit or implicit dependency. This can lead to incorrect results being produced, depending on what order the tasks are executed. Please refer to https://docs.gradle.org/7.4/userguide/validation_problems.html#implicit_dependency for more details about this problem.
  - Gradle detected a problem with the following location: '<https://ci-beam.apache.org/job/beam_PostCommit_XVR_PythonUsingJava_Dataflow/ws/src/sdks/java/container/build/target'.> Reason: Task ':sdks:java:container:java8:copySdkHarnessLauncher' uses this output of task ':sdks:java:container:pullLicenses' without declaring an explicit or implicit dependency. This can lead to incorrect results being produced, depending on what order the tasks are executed. Please refer to https://docs.gradle.org/7.4/userguide/validation_problems.html#implicit_dependency for more details about this problem.

> Task :runners:google-cloud-dataflow-java:buildAndPushDockerPythonContainer
WARNING: `gcloud docker` will not be supported for Docker client versions above 18.03.

As an alternative, use `gcloud auth configure-docker` to configure `docker` to
use `gcloud` as a credential helper, then use `docker` as you would for non-GCR
registries, e.g. `docker pull gcr.io/project-id/my-image`. Add
`--verbosity=error` to silence this warning: `gcloud docker
--verbosity=error -- pull gcr.io/project-id/my-image`.

See: https://cloud.google.com/container-registry/docs/support/deprecation-notices#gcloud-docker

The push refers to repository [us.gcr.io/apache-beam-testing/java-postcommit-it/python]
ca6b28533c92: Preparing
dd0f71fd930a: Preparing
643b5bcf9aa5: Preparing
d01364aa8bc8: Preparing
2fd26d2aa140: Preparing
da49a28cb018: Preparing
d7525e3e13e4: Preparing
51914a09fcfe: Preparing
7dff8394e1a3: Preparing
eb689419e447: Preparing
ae0610a5776c: Preparing
e6301e5fb184: Preparing
b0f20a707c44: Preparing
9d5d10cc1d1f: Preparing
e79900c49f44: Preparing
ea02e4889d36: Preparing
c4418e789e70: Preparing
7c12a541abbf: Preparing
6d95196cbe50: Preparing
5bdcc8e2060c: Preparing
08fa02ce37eb: Preparing
a037458de4e0: Preparing
bafdbe68e4ae: Preparing
a13c519c6361: Preparing
d7525e3e13e4: Waiting
51914a09fcfe: Waiting
7dff8394e1a3: Waiting
7c12a541abbf: Waiting
6d95196cbe50: Waiting
9d5d10cc1d1f: Waiting
5bdcc8e2060c: Waiting
eb689419e447: Waiting
08fa02ce37eb: Waiting
c4418e789e70: Waiting
a037458de4e0: Waiting
bafdbe68e4ae: Waiting
ae0610a5776c: Waiting
a13c519c6361: Waiting
ea02e4889d36: Waiting
e6301e5fb184: Waiting
e79900c49f44: Waiting
b0f20a707c44: Waiting
d01364aa8bc8: Pushed
643b5bcf9aa5: Pushed
2fd26d2aa140: Pushed
ca6b28533c92: Pushed
dd0f71fd930a: Pushed
da49a28cb018: Pushed
d7525e3e13e4: Pushed
7dff8394e1a3: Pushed
ae0610a5776c: Pushed
eb689419e447: Pushed
9d5d10cc1d1f: Pushed
ea02e4889d36: Layer already exists
c4418e789e70: Layer already exists
7c12a541abbf: Layer already exists
6d95196cbe50: Layer already exists
5bdcc8e2060c: Layer already exists
08fa02ce37eb: Layer already exists
a037458de4e0: Layer already exists
bafdbe68e4ae: Layer already exists
a13c519c6361: Layer already exists
e79900c49f44: Pushed
51914a09fcfe: Pushed
e6301e5fb184: Pushed
b0f20a707c44: Pushed
20220501165244: digest: sha256:12c366e7e9aeb790e041e8b7df91b9b16c75adf1fe41f13a5d541bb2c6b23c5c size: 5361

FAILURE: Build failed with an exception.

* What went wrong:
Execution failed for task ':sdks:java:container:pullLicenses'.
> Process 'command './license_scripts/license_script.sh'' finished with non-zero exit value 1

* Try:
> Run with --stacktrace option to get the stack trace.
> Run with --info or --debug option to get more log output.
> Run with --scan to get full insights.

* Get more help at https://help.gradle.org

Deprecated Gradle features were used in this build, making it incompatible with Gradle 8.0.

You can use '--warning-mode all' to show the individual deprecation warnings and determine if they come from your own scripts or plugins.

See https://docs.gradle.org/7.4/userguide/command_line_interface.html#sec:command_line_warnings

Execution optimizations have been disabled for 1 invalid unit(s) of work during this build to ensure correctness.
Please consult deprecation warnings for more details.

BUILD FAILED in 10m 51s
130 actionable tasks: 86 executed, 38 from cache, 6 up-to-date

Publishing build scan...
https://gradle.com/s/yywl3llinkuda

Build step 'Invoke Gradle script' changed build result to FAILURE
Build step 'Invoke Gradle script' marked build as failure

---------------------------------------------------------------------
To unsubscribe, e-mail: builds-unsubscribe@beam.apache.org
For additional commands, e-mail: builds-help@beam.apache.org


Build failed in Jenkins: beam_PostCommit_XVR_PythonUsingJava_Dataflow #371

Posted by Apache Jenkins Server <je...@builds.apache.org>.
See <https://ci-beam.apache.org/job/beam_PostCommit_XVR_PythonUsingJava_Dataflow/371/display/redirect>

Changes:


------------------------------------------
[...truncated 804.93 KB...]
apache-beam @ file:///opt/apache/beam/tars/apache-beam.tar.gz
astunparse==1.6.3
atomicwrites==1.4.0
attrs==21.4.0
beautifulsoup4==4.10.0
bs4==0.0.1
cached-property==1.5.2
cachetools==4.2.4
certifi==2021.10.8
cffi==1.15.0
charset-normalizer==2.0.12
click==8.0.4
cloudpickle==2.0.0
crcmod==1.7
cryptography==36.0.2
Cython==0.29.28
deprecation==2.1.0
dill==0.3.1.1
docker==5.0.3
docopt==0.6.2
execnet==1.9.0
fastavro==1.4.10
fasteners==0.17.3
flatbuffers==2.0
freezegun==1.2.1
future==0.18.2
gast==0.5.3
google-api-core==1.31.5
google-api-python-client==2.41.0
google-apitools==0.5.31
google-auth==1.35.0
google-auth-httplib2==0.1.0
google-auth-oauthlib==0.4.6
google-cloud-bigquery==2.34.2
google-cloud-bigquery-storage==2.13.0
google-cloud-bigtable==1.7.0
google-cloud-core==1.7.2
google-cloud-datastore==1.15.3
google-cloud-dlp==3.6.2
google-cloud-language==1.3.0
google-cloud-profiler==3.0.7
google-cloud-pubsub==2.11.0
google-cloud-pubsublite==1.4.1
google-cloud-recommendations-ai==0.2.0
google-cloud-spanner==1.19.1
google-cloud-videointelligence==1.16.1
google-cloud-vision==1.0.0
google-crc32c==1.3.0
google-pasta==0.2.0
google-python-cloud-debugger==2.18
google-resumable-media==2.3.2
googleapis-common-protos==1.56.0
greenlet==1.1.2
grpc-google-iam-v1==0.12.3
grpcio==1.44.0
grpcio-gcp==0.2.2
grpcio-status==1.44.0
guppy3==3.1.2
h5py==3.6.0
hdfs==2.6.0
httplib2==0.19.1
idna==3.3
importlib-metadata==4.11.3
joblib==1.1.0
keras==2.8.0
Keras-Preprocessing==1.1.2
libclang==13.0.0
Markdown==3.3.6
mmh3==3.0.0
mock==2.0.0
more-itertools==8.12.0
nltk==3.7
nose==1.3.7
numpy==1.21.5
oauth2client==4.1.3
oauthlib==3.2.0
opt-einsum==3.3.0
orjson==3.6.7
overrides==6.1.0
packaging==21.3
pandas==1.3.5
parameterized==0.7.5
pbr==5.8.1
pip==22.0.4
pluggy==0.13.1
proto-plus==1.20.3
protobuf==3.19.4
psycopg2-binary==2.9.3
py==1.11.0
pyarrow==6.0.1
pyasn1==0.4.8
pyasn1-modules==0.2.8
pycparser==2.21
pydot==1.4.2
PyHamcrest==1.10.1
pymongo==3.12.3
PyMySQL==1.0.2
pyparsing==2.4.7
pytest==4.6.11
pytest-forked==1.4.0
pytest-timeout==1.4.2
pytest-xdist==1.34.0
python-dateutil==2.8.2
python-snappy==0.6.1
pytz==2021.3
PyYAML==6.0
regex==2022.3.15
requests==2.27.1
requests-mock==1.9.3
requests-oauthlib==1.3.1
rsa==4.8
scikit-learn==1.0.2
scipy==1.7.3
setuptools==57.5.0
six==1.16.0
soupsieve==2.3.1
SQLAlchemy==1.4.32
tenacity==5.1.5
tensorboard==2.8.0
tensorboard-data-server==0.6.1
tensorboard-plugin-wit==1.8.1
tensorflow==2.8.0
tensorflow-io-gcs-filesystem==0.24.0
termcolor==1.1.0
testcontainers==3.4.2
tf-estimator-nightly==2.8.0.dev2021122109
threadpoolctl==3.1.0
tqdm==4.63.0
typing-utils==0.1.0
typing_extensions==4.1.1
uritemplate==4.1.1
urllib3==1.26.9
wcwidth==0.2.5
websocket-client==1.3.1
Werkzeug==2.0.3
wheel==0.37.1
wrapt==1.14.0
zipp==3.7.0
Removing intermediate container 82f0753e4a14
 ---> f5dac7fe4ed6
Step 16/31 : COPY target/LICENSE /opt/apache/beam/
 ---> 1501a1740d63
Step 17/31 : COPY target/LICENSE.python /opt/apache/beam/
 ---> f881ca2c7b6b
Step 18/31 : COPY target/NOTICE /opt/apache/beam/
 ---> 7fa72e0ad517
Step 19/31 : COPY target/launcher/linux_amd64/boot /opt/apache/beam/
 ---> 112a59fb1773
Step 20/31 : ENTRYPOINT ["/opt/apache/beam/boot"]
 ---> Running in ac31923df197
Removing intermediate container ac31923df197
 ---> 7072b2168df2
Step 21/31 : FROM beam as third_party_licenses
 ---> 7072b2168df2
Step 22/31 : ARG pull_licenses
 ---> Running in a672b03706c2
Removing intermediate container a672b03706c2
 ---> f30c2e28701c
Step 23/31 : COPY target/license_scripts /tmp/license_scripts/
 ---> 94ae2d6700d4
Step 24/31 : COPY target/LICENSE target/go-licenses/* /opt/apache/beam/third_party_licenses/golang/
 ---> bd2ede89f1a7
Step 25/31 : RUN rm /opt/apache/beam/third_party_licenses/golang/LICENSE
 ---> Running in 96c307301f3b
Removing intermediate container 96c307301f3b
 ---> bbe529bd014e
Step 26/31 : COPY target/license_scripts /tmp/license_scripts/
 ---> 32e2f7486da1
Step 27/31 : RUN if [ "$pull_licenses" = "true" ] ; then       pip install 'pip-licenses<4.0.0' pyyaml tenacity &&       python /tmp/license_scripts/pull_licenses_py.py ;     fi
 ---> Running in 9a7c0c72d9d2
Collecting pip-licenses<4.0.0
  Downloading pip_licenses-3.5.4-py3-none-any.whl (17 kB)
Requirement already satisfied: pyyaml in /usr/local/lib/python3.7/site-packages (6.0)
Requirement already satisfied: tenacity in /usr/local/lib/python3.7/site-packages (5.1.5)
Collecting PTable
  Downloading PTable-0.9.2.tar.gz (31 kB)
  Preparing metadata (setup.py): started
  Preparing metadata (setup.py): finished with status 'done'
Requirement already satisfied: six>=1.9.0 in /usr/local/lib/python3.7/site-packages (from tenacity) (1.16.0)
Building wheels for collected packages: PTable
  Building wheel for PTable (setup.py): started
  Building wheel for PTable (setup.py): finished with status 'done'
  Created wheel for PTable: filename=PTable-0.9.2-py3-none-any.whl size=22925 sha256=3407af69e165b208049c050eb8e5c9507ccac3df49a9157c39ba0017029ada74
  Stored in directory: /root/.cache/pip/wheels/33/df/2f/674985b3f8a2de3f96357d1eadef5110f74fa91b3785e52a54
Successfully built PTable
Installing collected packages: PTable, pip-licenses
Successfully installed PTable-0.9.2 pip-licenses-3.5.4
WARNING: Running pip as the 'root' user can result in broken permissions and conflicting behaviour with the system package manager. It is recommended to use a virtual environment instead: https://pip.pypa.io/warnings/venv
Skip pulling license for  bs4
INFO:root:Successfully pulled licenses for 135 dependencies
Removing intermediate container 9a7c0c72d9d2
 ---> 5ffcb9c084c5
Step 28/31 : FROM beam
 ---> 7072b2168df2
Step 29/31 : ARG pull_licenses
 ---> Running in d94372091e8e
Removing intermediate container d94372091e8e
 ---> 75e4b00a46e5
Step 30/31 : COPY --from=third_party_licenses /opt/apache/beam/third_party_licenses /opt/apache/beam/third_party_licenses
 ---> 75c72b0669dc
Step 31/31 : RUN if [ "$pull_licenses" != "true" ] ; then       rm -rf /opt/apache/beam/third_party_licenses ;     fi
 ---> Running in 6dca72037626
Removing intermediate container 6dca72037626
 ---> 08eaf707f01e
Successfully built 08eaf707f01e
Successfully tagged apache/beam_python3.7_sdk:2.39.0.dev

> Task :runners:google-cloud-dataflow-java:buildAndPushDockerPythonContainer
WARNING: `gcloud docker` will not be supported for Docker client versions above 18.03.

As an alternative, use `gcloud auth configure-docker` to configure `docker` to
use `gcloud` as a credential helper, then use `docker` as you would for non-GCR
registries, e.g. `docker pull gcr.io/project-id/my-image`. Add
`--verbosity=error` to silence this warning: `gcloud docker
--verbosity=error -- pull gcr.io/project-id/my-image`.

See: https://cloud.google.com/container-registry/docs/support/deprecation-notices#gcloud-docker


FAILURE: Build failed with an exception.

* What went wrong:
Execution failed for task ':sdks:java:container:pullLicenses'.
> Process 'command './license_scripts/license_script.sh'' finished with non-zero exit value 1

* Try:
> Run with --stacktrace option to get the stack trace.
> Run with --info or --debug option to get more log output.
> Run with --scan to get full insights.

* Get more help at https://help.gradle.org

Deprecated Gradle features were used in this build, making it incompatible with Gradle 8.0.

You can use '--warning-mode all' to show the individual deprecation warnings and determine if they come from your own scripts or plugins.

See https://docs.gradle.org/7.4/userguide/command_line_interface.html#sec:command_line_warnings

Execution optimizations have been disabled for 1 invalid unit(s) of work during this build to ensure correctness.
Please consult deprecation warnings for more details.

BUILD FAILED in 10m 42s
130 actionable tasks: 86 executed, 38 from cache, 6 up-to-date

Publishing build scan...
https://gradle.com/s/7skzojab4y3ag

Build step 'Invoke Gradle script' changed build result to FAILURE
Build step 'Invoke Gradle script' marked build as failure

---------------------------------------------------------------------
To unsubscribe, e-mail: builds-unsubscribe@beam.apache.org
For additional commands, e-mail: builds-help@beam.apache.org


Build failed in Jenkins: beam_PostCommit_XVR_PythonUsingJava_Dataflow #370

Posted by Apache Jenkins Server <je...@builds.apache.org>.
See <https://ci-beam.apache.org/job/beam_PostCommit_XVR_PythonUsingJava_Dataflow/370/display/redirect>

Changes:


------------------------------------------
[...truncated 805.58 KB...]
Markdown==3.3.6
mmh3==3.0.0
mock==2.0.0
more-itertools==8.12.0
nltk==3.7
nose==1.3.7
numpy==1.21.5
oauth2client==4.1.3
oauthlib==3.2.0
opt-einsum==3.3.0
orjson==3.6.7
overrides==6.1.0
packaging==21.3
pandas==1.3.5
parameterized==0.7.5
pbr==5.8.1
pip==22.0.4
pluggy==0.13.1
proto-plus==1.20.3
protobuf==3.19.4
psycopg2-binary==2.9.3
py==1.11.0
pyarrow==6.0.1
pyasn1==0.4.8
pyasn1-modules==0.2.8
pycparser==2.21
pydot==1.4.2
PyHamcrest==1.10.1
pymongo==3.12.3
PyMySQL==1.0.2
pyparsing==2.4.7
pytest==4.6.11
pytest-forked==1.4.0
pytest-timeout==1.4.2
pytest-xdist==1.34.0
python-dateutil==2.8.2
python-snappy==0.6.1
pytz==2021.3
PyYAML==6.0
regex==2022.3.15
requests==2.27.1
requests-mock==1.9.3
requests-oauthlib==1.3.1
rsa==4.8
scikit-learn==1.0.2
scipy==1.7.3
setuptools==57.5.0
six==1.16.0
soupsieve==2.3.1
SQLAlchemy==1.4.32
tenacity==5.1.5
tensorboard==2.8.0
tensorboard-data-server==0.6.1
tensorboard-plugin-wit==1.8.1
tensorflow==2.8.0
tensorflow-io-gcs-filesystem==0.24.0
termcolor==1.1.0
testcontainers==3.4.2
tf-estimator-nightly==2.8.0.dev2021122109
threadpoolctl==3.1.0
tqdm==4.63.0
typing-utils==0.1.0
typing_extensions==4.1.1
uritemplate==4.1.1
urllib3==1.26.9
wcwidth==0.2.5
websocket-client==1.3.1
Werkzeug==2.0.3
wheel==0.37.1
wrapt==1.14.0
zipp==3.7.0
Removing intermediate container dee9a3e41e31
 ---> 34d4012f3315
Step 16/31 : COPY target/LICENSE /opt/apache/beam/
 ---> 8178f0083250
Step 17/31 : COPY target/LICENSE.python /opt/apache/beam/
 ---> 05188d464cfc
Step 18/31 : COPY target/NOTICE /opt/apache/beam/
 ---> cc4336656ca5
Step 19/31 : COPY target/launcher/linux_amd64/boot /opt/apache/beam/
 ---> f7055d462ff7
Step 20/31 : ENTRYPOINT ["/opt/apache/beam/boot"]
 ---> Running in 854cce25178b
Removing intermediate container 854cce25178b
 ---> 265385714ff8
Step 21/31 : FROM beam as third_party_licenses
 ---> 265385714ff8
Step 22/31 : ARG pull_licenses
 ---> Running in 99b9dc7c4d0c
Removing intermediate container 99b9dc7c4d0c
 ---> d9f249b476c3
Step 23/31 : COPY target/license_scripts /tmp/license_scripts/
 ---> 2bbcfc034b6e
Step 24/31 : COPY target/LICENSE target/go-licenses/* /opt/apache/beam/third_party_licenses/golang/
 ---> fa7bb8be937c
Step 25/31 : RUN rm /opt/apache/beam/third_party_licenses/golang/LICENSE
 ---> Running in 6666499b2d7b
Removing intermediate container 6666499b2d7b
 ---> 0400dfc7e738
Step 26/31 : COPY target/license_scripts /tmp/license_scripts/
 ---> 17a928a5312a
Step 27/31 : RUN if [ "$pull_licenses" = "true" ] ; then       pip install 'pip-licenses<4.0.0' pyyaml tenacity &&       python /tmp/license_scripts/pull_licenses_py.py ;     fi
 ---> Running in 8ad48d4f51b4
Collecting pip-licenses<4.0.0
  Downloading pip_licenses-3.5.4-py3-none-any.whl (17 kB)
Requirement already satisfied: pyyaml in /usr/local/lib/python3.7/site-packages (6.0)
Requirement already satisfied: tenacity in /usr/local/lib/python3.7/site-packages (5.1.5)
Collecting PTable
  Downloading PTable-0.9.2.tar.gz (31 kB)
  Preparing metadata (setup.py): started
  Preparing metadata (setup.py): finished with status 'done'
Requirement already satisfied: six>=1.9.0 in /usr/local/lib/python3.7/site-packages (from tenacity) (1.16.0)
Building wheels for collected packages: PTable
  Building wheel for PTable (setup.py): started
  Building wheel for PTable (setup.py): finished with status 'done'
  Created wheel for PTable: filename=PTable-0.9.2-py3-none-any.whl size=22925 sha256=62b6fac6d3fc8998872ca88be005e0f34c3fb1087f329f1cf6583ab99dc82945
  Stored in directory: /root/.cache/pip/wheels/33/df/2f/674985b3f8a2de3f96357d1eadef5110f74fa91b3785e52a54
Successfully built PTable
Installing collected packages: PTable, pip-licenses
Successfully installed PTable-0.9.2 pip-licenses-3.5.4
WARNING: Running pip as the 'root' user can result in broken permissions and conflicting behaviour with the system package manager. It is recommended to use a virtual environment instead: https://pip.pypa.io/warnings/venv
Skip pulling license for  bs4
INFO:root:Successfully pulled licenses for 135 dependencies
Removing intermediate container 8ad48d4f51b4
 ---> 007305e71dfb
Step 28/31 : FROM beam
 ---> 265385714ff8
Step 29/31 : ARG pull_licenses
 ---> Running in 4053a25317b3
Removing intermediate container 4053a25317b3
 ---> bc5975c8aab3
Step 30/31 : COPY --from=third_party_licenses /opt/apache/beam/third_party_licenses /opt/apache/beam/third_party_licenses
 ---> 8a3765f59d98
Step 31/31 : RUN if [ "$pull_licenses" != "true" ] ; then       rm -rf /opt/apache/beam/third_party_licenses ;     fi
 ---> Running in f514435e6d6b
Removing intermediate container f514435e6d6b
 ---> 5ba48af6b885
Successfully built 5ba48af6b885
Successfully tagged apache/beam_python3.7_sdk:2.39.0.dev

> Task :runners:google-cloud-dataflow-java:buildAndPushDockerPythonContainer
WARNING: `gcloud docker` will not be supported for Docker client versions above 18.03.

As an alternative, use `gcloud auth configure-docker` to configure `docker` to
use `gcloud` as a credential helper, then use `docker` as you would for non-GCR
registries, e.g. `docker pull gcr.io/project-id/my-image`. Add
`--verbosity=error` to silence this warning: `gcloud docker
--verbosity=error -- pull gcr.io/project-id/my-image`.

See: https://cloud.google.com/container-registry/docs/support/deprecation-notices#gcloud-docker

The push refers to repository [us.gcr.io/apache-beam-testing/java-postcommit-it/python]
d4124adcb797: Preparing
4ca6919de243: Preparing
64244e898afc: Preparing
c46b383917f4: Preparing
9dca42a67ec5: Preparing
116a59874e48: Preparing
0050a0fef70c: Preparing
d0b072f9d6d4: Preparing
3e0fc233dcb0: Preparing
73a5e570bb59: Preparing
c446aee7e6d1: Preparing
340a29c68231: Preparing
0f349ac75451: Preparing
50b96e1c4618: Preparing
e14781074b2d: Preparing
ea02e4889d36: Preparing
c4418e789e70: Preparing
7c12a541abbf: Preparing
6d95196cbe50: Preparing
5bdcc8e2060c: Preparing
08fa02ce37eb: Preparing
d0b072f9d6d4: Waiting
a037458de4e0: Preparing
bafdbe68e4ae: Preparing
3e0fc233dcb0: Waiting
a13c519c6361: Preparing
116a59874e48: Waiting
73a5e570bb59: Waiting
c446aee7e6d1: Waiting
50b96e1c4618: Waiting
340a29c68231: Waiting
c4418e789e70: Waiting
08fa02ce37eb: Waiting
0f349ac75451: Waiting
ea02e4889d36: Waiting
e14781074b2d: Waiting
0050a0fef70c: Waiting
7c12a541abbf: Waiting
a037458de4e0: Waiting
5bdcc8e2060c: Waiting
6d95196cbe50: Waiting
9dca42a67ec5: Pushed
64244e898afc: Pushed
c46b383917f4: Pushed
d4124adcb797: Pushed
4ca6919de243: Pushed
116a59874e48: Pushed
0050a0fef70c: Pushed
3e0fc233dcb0: Pushed
73a5e570bb59: Pushed
c446aee7e6d1: Pushed
50b96e1c4618: Pushed
ea02e4889d36: Layer already exists
c4418e789e70: Layer already exists
7c12a541abbf: Layer already exists
6d95196cbe50: Layer already exists
5bdcc8e2060c: Layer already exists
08fa02ce37eb: Layer already exists
a037458de4e0: Layer already exists
bafdbe68e4ae: Layer already exists
a13c519c6361: Layer already exists
e14781074b2d: Pushed
d0b072f9d6d4: Pushed
340a29c68231: Pushed
0f349ac75451: Pushed
20220501045244: digest: sha256:e3c93bbe06f40f90e98ee9ae9cf7bc2152babf8906150ae667d61400425eb040 size: 5361

FAILURE: Build failed with an exception.

* What went wrong:
Execution failed for task ':sdks:java:container:pullLicenses'.
> Process 'command './license_scripts/license_script.sh'' finished with non-zero exit value 1

* Try:
> Run with --stacktrace option to get the stack trace.
> Run with --info or --debug option to get more log output.
> Run with --scan to get full insights.

* Get more help at https://help.gradle.org

Deprecated Gradle features were used in this build, making it incompatible with Gradle 8.0.

You can use '--warning-mode all' to show the individual deprecation warnings and determine if they come from your own scripts or plugins.

See https://docs.gradle.org/7.4/userguide/command_line_interface.html#sec:command_line_warnings

Execution optimizations have been disabled for 1 invalid unit(s) of work during this build to ensure correctness.
Please consult deprecation warnings for more details.

BUILD FAILED in 10m 54s
130 actionable tasks: 86 executed, 38 from cache, 6 up-to-date

Publishing build scan...
https://gradle.com/s/wvllle26ito5s

Build step 'Invoke Gradle script' changed build result to FAILURE
Build step 'Invoke Gradle script' marked build as failure

---------------------------------------------------------------------
To unsubscribe, e-mail: builds-unsubscribe@beam.apache.org
For additional commands, e-mail: builds-help@beam.apache.org