You are viewing a plain text version of this content. The canonical link for it is here.
Posted to notifications@maven.apache.org by Apache Jenkins Server <je...@builds.apache.org> on 2021/08/22 23:15:45 UTC
Build unstable in Jenkins: Maven » Maven TLP » maven-javadoc-plugin » master #99
See https://ci-maven.apache.org/job/Maven/job/maven-box/job/maven-javadoc-plugin/job/master/99/
Changes:
* Bump slf4j-simple from 1.7.30 to 1.7.32
1 tests failed.
FAILED: org.apache.maven.plugins.javadoc.JavadocReportTest.windows-jdk8-m3.5.x_build / Build windows-jdk8-m3.5.x_build / testTaglets
Error Message:
An error has occurred in Javadoc report generation:
Exit code: 1 - javadoc: error - Error - Exception java.lang.reflect.InvocationTargetException thrown while trying to register Taglet org.tullmann.taglets.ToDo...
f:\jenkins\jenkins-home\82467a7c\workspace\_box_maven-javadoc-plugin_master@2\windows-jdk8-m3.5.x_build\src\test\resources\unit\taglet-test\taglet\test\App.java:25: error: unknown tag: todo
* @todo To test!
^
f:\jenkins\jenkins-home\82467a7c\workspace\_box_maven-javadoc-plugin_master@2\windows-jdk8-m3.5.x_build\src\test\resources\unit\taglet-test\taglet\test\AppSample.java:28: error: unknown tag: todo
* @todo To test!
^
Command line was: cmd.exe /X /C "f:\jenkins\tools\java\latest1.8\jre\..\bin\javadoc.exe @options @packages @argfile"
Refer to the generated Javadoc files in 'f:\jenkins\jenkins-home\82467a7c\workspace\_box_maven-javadoc-plugin_master@2\windows-jdk8-m3.5.x_build\target\test\unit\taglet-test\target\site\apidocs' dir.
Stack Trace:
org.apache.maven.plugin.MojoExecutionException:
An error has occurred in Javadoc report generation:
Exit code: 1 - javadoc: error - Error - Exception java.lang.reflect.InvocationTargetException thrown while trying to register Taglet org.tullmann.taglets.ToDo...
f:\jenkins\jenkins-home\82467a7c\workspace\_box_maven-javadoc-plugin_master@2\windows-jdk8-m3.5.x_build\src\test\resources\unit\taglet-test\taglet\test\App.java:25: error: unknown tag: todo
* @todo To test!
^
f:\jenkins\jenkins-home\82467a7c\workspace\_box_maven-javadoc-plugin_master@2\windows-jdk8-m3.5.x_build\src\test\resources\unit\taglet-test\taglet\test\AppSample.java:28: error: unknown tag: todo
* @todo To test!
^
Command line was: cmd.exe /X /C "f:\jenkins\tools\java\latest1.8\jre\..\bin\javadoc.exe @options @packages @argfile"
Refer to the generated Javadoc files in 'f:\jenkins\jenkins-home\82467a7c\workspace\_box_maven-javadoc-plugin_master@2\windows-jdk8-m3.5.x_build\target\test\unit\taglet-test\target\site\apidocs' dir.
at org.apache.maven.plugins.javadoc.AbstractJavadocMojo.failOnError(AbstractJavadocMojo.java:7065)
at org.apache.maven.plugins.javadoc.JavadocReport.doExecute(JavadocReport.java:328)
at org.apache.maven.plugins.javadoc.AbstractJavadocMojo.execute(AbstractJavadocMojo.java:2016)
at org.apache.maven.plugins.javadoc.JavadocReportTest.testTaglets(JavadocReportTest.java:692)
at sun.reflect.NativeMethodAccessorImpl.invoke0(Native Method)
at sun.reflect.NativeMethodAccessorImpl.invoke(NativeMethodAccessorImpl.java:62)
at sun.reflect.DelegatingMethodAccessorImpl.invoke(DelegatingMethodAccessorImpl.java:43)
at java.lang.reflect.Method.invoke(Method.java:498)
at junit.framework.TestCase.runTest(TestCase.java:177)
at junit.framework.TestCase.runBare(TestCase.java:142)
at junit.framework.TestResult$1.protect(TestResult.java:122)
at junit.framework.TestResult.runProtected(TestResult.java:142)
at junit.framework.TestResult.run(TestResult.java:125)
at junit.framework.TestCase.run(TestCase.java:130)
at junit.framework.TestSuite.runTest(TestSuite.java:241)
at junit.framework.TestSuite.run(TestSuite.java:236)
at org.junit.internal.runners.JUnit38ClassRunner.run(JUnit38ClassRunner.java:90)
at org.apache.maven.surefire.junit4.JUnit4Provider.execute(JUnit4Provider.java:365)
at org.apache.maven.surefire.junit4.JUnit4Provider.executeWithRerun(JUnit4Provider.java:273)
at org.apache.maven.surefire.junit4.JUnit4Provider.executeTestSet(JUnit4Provider.java:238)
at org.apache.maven.surefire.junit4.JUnit4Provider.invoke(JUnit4Provider.java:159)
at org.apache.maven.surefire.booter.ForkedBooter.invokeProviderInSameClassLoader(ForkedBooter.java:383)
at org.apache.maven.surefire.booter.ForkedBooter.runSuitesInProcess(ForkedBooter.java:344)
at org.apache.maven.surefire.booter.ForkedBooter.execute(ForkedBooter.java:125)
at org.apache.maven.surefire.booter.ForkedBooter.main(ForkedBooter.java:417)
Caused by: org.apache.maven.reporting.MavenReportException:
Exit code: 1 - javadoc: error - Error - Exception java.lang.reflect.InvocationTargetException thrown while trying to register Taglet org.tullmann.taglets.ToDo...
f:\jenkins\jenkins-home\82467a7c\workspace\_box_maven-javadoc-plugin_master@2\windows-jdk8-m3.5.x_build\src\test\resources\unit\taglet-test\taglet\test\App.java:25: error: unknown tag: todo
* @todo To test!
^
f:\jenkins\jenkins-home\82467a7c\workspace\_box_maven-javadoc-plugin_master@2\windows-jdk8-m3.5.x_build\src\test\resources\unit\taglet-test\taglet\test\AppSample.java:28: error: unknown tag: todo
* @todo To test!
^
Command line was: cmd.exe /X /C "f:\jenkins\tools\java\latest1.8\jre\..\bin\javadoc.exe @options @packages @argfile"
Refer to the generated Javadoc files in 'f:\jenkins\jenkins-home\82467a7c\workspace\_box_maven-javadoc-plugin_master@2\windows-jdk8-m3.5.x_build\target\test\unit\taglet-test\target\site\apidocs' dir.
at org.apache.maven.plugins.javadoc.AbstractJavadocMojo.doExecuteJavadocCommandLine(AbstractJavadocMojo.java:6057)
at org.apache.maven.plugins.javadoc.AbstractJavadocMojo.executeJavadocCommandLine(AbstractJavadocMojo.java:5939)
at org.apache.maven.plugins.javadoc.AbstractJavadocMojo.executeReport(AbstractJavadocMojo.java:2259)
at org.apache.maven.plugins.javadoc.JavadocReport.generate(JavadocReport.java:135)
at org.apache.maven.plugins.javadoc.JavadocReport.doExecute(JavadocReport.java:324)
... 23 more
Build log:
[...truncated 9814 lines...]
[INFO] Building: MJAVADOC-625_addstylesheet\pom.xml
[INFO] run post-build script verify.groovy
[INFO] MJAVADOC-625_addstylesheet\pom.xml ............... SUCCESS (4.1 s)
[INFO] Building: MJAVADOC-634-module-testreports\pom.xml
[INFO] MJAVADOC-634-module-testreports\pom.xml .......... SKIPPED due to JRE version
[INFO] Building: MJAVADOC-636-aggregate_module_skipped\pom.xml
[INFO] run post-build script verify.groovy
[INFO] MJAVADOC-639_requires_ignored\pom.xml ............ SUCCESS (17.2 s)
[INFO] Building: MJAVADOC-661_mrjar\pom.xml
[INFO] run post-build script verify.groovy
[INFO] MJAVADOC-636-aggregate_module_skipped\pom.xml .... SUCCESS (11.3 s)
[INFO] Building: MJAVADOC-639_aggr_static_modulepath\pom.xml
[INFO] MJAVADOC-639_aggr_static_modulepath\pom.xml ...... SKIPPED due to JRE version
[INFO] Building: MJAVADOC-639_requires_ignored\pom.xml
[INFO] MJAVADOC-639_requires_ignored\pom.xml ............ SKIPPED due to JRE version
[INFO] Building: MJAVADOC-661_mrjar\pom.xml
[INFO] MJAVADOC-661_mrjar\pom.xml ....................... SKIPPED due to JRE version
[INFO] Building: MJAVADOC-672_multiline-tag\pom.xml
[INFO] run post-build script verify.groovy
[INFO] MJAVADOC-661_mrjar\pom.xml ....................... SUCCESS (9.5 s)
[INFO] Building: MJAVADOC-672_multiline-tag\pom.xml
[INFO] MJAVADOC-672_multiline-tag\pom.xml ............... SUCCESS (4.1 s)
[INFO] Building: MJAVADOC-679_encoding\pom.xml
[INFO] run pre-build script setup.groovy
[INFO] MJAVADOC-679_encoding\pom.xml .................... SUCCESS (4.6 s)
[INFO] Building: site-failOnError\pom.xml
[INFO] MJAVADOC-672_multiline-tag\pom.xml ............... SUCCESS (7.6 s)
[INFO] Building: MJAVADOC-679_encoding\pom.xml
[INFO] run pre-build script setup.groovy
[INFO] site-failOnError\pom.xml ......................... SUCCESS (5.2 s)
[INFO]
[INFO] --- mrm-maven-plugin:1.2.0:stop (repository) @ maven-javadoc-plugin ---
[INFO] Stopping Mock Repository Manager on http://localhost:62738
[INFO] Stopped SocketConnector@0.0.0.0:62738
[INFO] Mock Repository Manager http://localhost:62738 is stopped.
[INFO]
[INFO] --- mrm-maven-plugin:1.2.0:stop (3rdparty) @ maven-javadoc-plugin ---
[INFO] Stopping Mock Repository Manager on http://localhost:62739
[INFO] Stopped SocketConnector@0.0.0.0:62739
[INFO] Mock Repository Manager http://localhost:62739 is stopped.
[INFO]
[INFO] --- maven-checkstyle-plugin:3.0.0:check (checkstyle-check) @ maven-javadoc-plugin ---
[INFO] There are 4 errors reported by Checkstyle 6.18 with config/maven_checks.xml ruleset.
[INFO] Ignored 4 errors, 0 violation remaining.
[INFO]
[INFO] --- maven-invoker-plugin:3.2.1:verify (integration-test) @ maven-javadoc-plugin ---
[INFO] -------------------------------------------------
[INFO] Build Summary:
[INFO] Passed: 63, Failed: 0, Errors: 0, Skipped: 20
[INFO] -------------------------------------------------
[INFO] ------------------------------------------------------------------------
[INFO] BUILD SUCCESS
[INFO] ------------------------------------------------------------------------
[INFO] Total time: 19:16 min
[INFO] Finished at: 2021-08-22T23:12:09Z
[INFO] ------------------------------------------------------------------------
[INFO] [jenkins-event-spy] Generated F:\jenkins\jenkins-home\82467a7c\workspace\_box_maven-javadoc-plugin_master@2@tmp\withMavenffe15b72\maven-spy-20210822-225247-7501015457159227006809.log
Picked up JAVA_TOOL_OPTIONS: -Dmaven.ext.class.path="f:\jenkins\jenkins-home\82467a7c\workspace\_box_maven-javadoc-plugin_master@2@tmp\withMavenffe15b72\pipeline-maven-spy.jar" -Dorg.jenkinsci.plugins.pipeline.maven.reportsFolder="f:\jenkins\jenkins-home\82467a7c\workspace\_box_maven-javadoc-plugin_master@2@tmp\withMavenffe15b72"
[Pipeline] }
[Pipeline] // dir
[Pipeline] }
[withMaven] artifactsPublisher - Archive artifact windows-jdk8-m3.5.x_build\pom.xml under org\apache\maven\plugins\maven-javadoc-plugin\3.3.1-SNAPSHOT\maven-javadoc-plugin-3.3.1-SNAPSHOT.pom
[withMaven] artifactsPublisher - Archive artifact windows-jdk8-m3.5.x_build\target\maven-javadoc-plugin-3.3.1-SNAPSHOT.jar under org\apache\maven\plugins\maven-javadoc-plugin\3.3.1-SNAPSHOT\maven-javadoc-plugin-3.3.1-SNAPSHOT.jar
[Fast Archiver] Compressed 529.51 KB of artifacts by 60.4% relative to #98
[withMaven] junitPublisher - Archive test results for Maven artifact org.apache.maven.plugins:maven-javadoc-plugin:maven-plugin:3.3.1-SNAPSHOT generated by maven-surefire-plugin:test (default-test): windows-jdk8-m3.5.x_build\target\surefire-reports\*.xml
Recording test results
[INFO] MJAVADOC-498_aggr_modulepath/pom.xml ............. SUCCESS (28.9 s)
[INFO] Building: examples/exclude-package-names/pom.xml
[INFO] examples/exclude-package-names/pom.xml ........... SKIPPED due to JRE version
[INFO] Building: examples/alternate-doclet/pom.xml
[INFO] examples/alternate-doclet/pom.xml ................ SKIPPED due to JRE version
[INFO] Building: MJAVADOC-599/pom.xml
[withMaven] Jenkins Task Scanner Plugin not found, don't display results of source code scanning for 'TODO' and 'FIXME' in pipeline screen.
[withMaven] invokerPublisher - Archive invoker results for Maven artifact MavenArtifact{org.apache.maven.plugins:maven-javadoc-plugin:maven-plugin:3.3.1-SNAPSHOT(version: 3.3.1-SNAPSHOT, snapshot:false) } generated by PluginInvocation{org.apache.maven.plugins:maven-invoker-plugin:3.2.1@integration-test integration-test}: windows-jdk8-m3.5.x_build\target\invoker-reports\*.xml
[INFO] MJAVADOC-679_encoding\pom.xml .................... SUCCESS (8.3 s)
[INFO] Building: site-failOnError\pom.xml
[withMaven] Publishers: Generated Artifacts Publisher: 4625 ms, Junit Publisher: 7756 ms, Open Task Scanner Publisher: 1 ms, Invoker Publisher: 122931 ms
[Pipeline] // withMaven
[Pipeline] cleanWs
[INFO] site-failOnError\pom.xml ......................... SUCCESS (8.5 s)
[INFO]
[INFO] --- mrm-maven-plugin:1.2.0:stop (repository) @ maven-javadoc-plugin ---
[INFO] Stopping Mock Repository Manager on http://localhost:49569
[INFO] Stopped SocketConnector@0.0.0.0:49569
[INFO] Mock Repository Manager http://localhost:49569 is stopped.
[INFO]
[INFO] --- mrm-maven-plugin:1.2.0:stop (3rdparty) @ maven-javadoc-plugin ---
[INFO] Stopping Mock Repository Manager on http://localhost:49570
[INFO] Stopped SocketConnector@0.0.0.0:49570
[INFO] Mock Repository Manager http://localhost:49570 is stopped.
[INFO]
[INFO] --- maven-checkstyle-plugin:3.0.0:check (checkstyle-check) @ maven-javadoc-plugin ---
[WS-CLEANUP] Deleting project workspace...
[WS-CLEANUP] Deferred wipeout is used...
[WS-CLEANUP] done
[Pipeline] }
[Pipeline] // stage
[Pipeline] }
[Pipeline] // ws
[Pipeline] }
[Pipeline] // node
[Pipeline] }
[INFO] run post-build script verify.groovy
[INFO] MJAVADOC-599/pom.xml ............................. SUCCESS (13.1 s)
[INFO] Building: MJAVADOC-528/pom.xml
[INFO] There are 4 errors reported by Checkstyle 6.18 with config/maven_checks.xml ruleset.
[INFO] Ignored 4 errors, 0 violation remaining.
[INFO]
[INFO] --- maven-invoker-plugin:3.2.1:verify (integration-test) @ maven-javadoc-plugin ---
[INFO] -------------------------------------------------
[INFO] Build Summary:
[INFO] Passed: 76, Failed: 0, Errors: 0, Skipped: 7
[INFO] -------------------------------------------------
[INFO] ------------------------------------------------------------------------
[INFO] BUILD SUCCESS
[INFO] ------------------------------------------------------------------------
[INFO] Total time: 18:11 min
[INFO] Finished at: 2021-08-22T16:12:15-07:00
[INFO] ------------------------------------------------------------------------
[INFO] [jenkins-event-spy] Generated F:\jenkins\jenkins-slave\82467a7c\workspace\_box_maven-javadoc-plugin_master@2@tmp\withMaven77607a82\maven-spy-20210822-155403-46113819817090678484136.log
[Pipeline] }
[Pipeline] // dir
[Pipeline] }
[withMaven] artifactsPublisher - Archive artifact windows-jdk11-m3.6.x_build\pom.xml under org\apache\maven\plugins\maven-javadoc-plugin\3.3.1-SNAPSHOT\maven-javadoc-plugin-3.3.1-SNAPSHOT.pom
[withMaven] artifactsPublisher - Archive artifact windows-jdk11-m3.6.x_build\target\maven-javadoc-plugin-3.3.1-SNAPSHOT.jar under org\apache\maven\plugins\maven-javadoc-plugin\3.3.1-SNAPSHOT\maven-javadoc-plugin-3.3.1-SNAPSHOT.jar
[Fast Archiver] Compressed 527.98 KB of artifacts by 72.7% relative to #98
[withMaven] junitPublisher - Archive test results for Maven artifact org.apache.maven.plugins:maven-javadoc-plugin:maven-plugin:3.3.1-SNAPSHOT generated by maven-surefire-plugin:test (default-test): windows-jdk11-m3.6.x_build\target\surefire-reports\*.xml
Recording test results
[INFO] run post-build script verify.groovy
[INFO] MJAVADOC-528/pom.xml ............................. SUCCESS (11.5 s)
[INFO] Building: MJAVADOC-592_detectApiLink/pom.xml
[withMaven] Jenkins Task Scanner Plugin not found, don't display results of source code scanning for 'TODO' and 'FIXME' in pipeline screen.
[withMaven] invokerPublisher - Archive invoker results for Maven artifact MavenArtifact{org.apache.maven.plugins:maven-javadoc-plugin:maven-plugin:3.3.1-SNAPSHOT(version: 3.3.1-SNAPSHOT, snapshot:false) } generated by PluginInvocation{org.apache.maven.plugins:maven-invoker-plugin:3.2.1@integration-test integration-test}: windows-jdk11-m3.6.x_build\target\invoker-reports\*.xml
[INFO] run post-build script verify.groovy
[INFO] MJAVADOC-592_detectApiLink/pom.xml ............... SUCCESS (9.2 s)
[INFO] Building: MJAVADOC-514_3rdparty-doclettags/pom.xml
[INFO] MJAVADOC-514_3rdparty-doclettags/pom.xml ......... SUCCESS (7.8 s)
[INFO] Building: MJAVADOC-338_downloadSources/pom.xml
[withMaven] Publishers: Generated Artifacts Publisher: 523 ms, Junit Publisher: 873 ms, Open Task Scanner Publisher: 1 ms, Invoker Publisher: 53039 ms
[Pipeline] // withMaven
[Pipeline] cleanWs
[WS-CLEANUP] Deleting project workspace...
[WS-CLEANUP] Deferred wipeout is used...
[WS-CLEANUP] done
[Pipeline] }
[Pipeline] // stage
[Pipeline] }
[Pipeline] // ws
[Pipeline] }
[Pipeline] // node
[Pipeline] }
[INFO] run post-build script verify.groovy
[INFO] MJAVADOC-338_downloadSources/pom.xml ............. SUCCESS (19.0 s)
[INFO] Building: MJAVADOC-194/pom.xml
[INFO] run post-build script verify.bsh
[INFO] MJAVADOC-194/pom.xml ............................. SUCCESS (11.7 s)
[INFO] Building: MJAVADOC-497/pom.xml
[INFO] run post-build script verify.bsh
[INFO] MJAVADOC-497/pom.xml ............................. SUCCESS (10.9 s)
[INFO] Building: MJAVADOC-172/pom.xml
[INFO] run post-build script verify.bsh
[INFO] MJAVADOC-172/pom.xml ............................. SUCCESS (15.7 s)
[INFO] Building: MJAVADOC-625_addstylesheet/pom.xml
[INFO] run post-build script verify.groovy
[INFO] MJAVADOC-625_addstylesheet/pom.xml ............... SUCCESS (12.3 s)
[INFO] Building: MJAVADOC-369/pom.xml
[INFO] run post-build script verify.bsh
[INFO] MJAVADOC-369/pom.xml ............................. SUCCESS (19.5 s)
[INFO] Building: MJAVADOC-526_aggr-managedDeps/pom.xml
[INFO] MJAVADOC-526_aggr-managedDeps/pom.xml ............ SUCCESS (14.2 s)
[INFO] Building: MJAVADOC-555_link-automatic-modules/pom.xml
[INFO] MJAVADOC-555_link-automatic-modules/pom.xml ...... SKIPPED due to non-matching selectors
[INFO] Building: MJAVADOC-250/pom.xml
[INFO] run post-build script verify.bsh
[INFO] MJAVADOC-250/pom.xml ............................. SUCCESS (16.9 s)
[INFO]
[INFO] --- mrm-maven-plugin:1.2.0:stop (repository) @ maven-javadoc-plugin ---
[INFO] Stopping Mock Repository Manager on http://localhost:36079
[INFO] Stopped SocketConnector@0.0.0.0:36079
[INFO] Mock Repository Manager http://localhost:36079 is stopped.
[INFO]
[INFO] --- mrm-maven-plugin:1.2.0:stop (3rdparty) @ maven-javadoc-plugin ---
[INFO] Stopping Mock Repository Manager on http://localhost:44609
[INFO] Stopped SocketConnector@0.0.0.0:44609
[INFO] Mock Repository Manager http://localhost:44609 is stopped.
[INFO]
[INFO] --- maven-checkstyle-plugin:3.0.0:check (checkstyle-check) @ maven-javadoc-plugin ---
[withMaven] Publishers: Generated Artifacts Publisher: 4970 ms, Junit Publisher: 8279 ms, Open Task Scanner Publisher: 1 ms, Invoker Publisher: 133774 ms
[Pipeline] // withMaven
[Pipeline] cleanWs
[WS-CLEANUP] Deleting project workspace...
[WS-CLEANUP] Deferred wipeout is used...
[INFO] There are 4 errors reported by Checkstyle 6.18 with config/maven_checks.xml ruleset.
[INFO] Ignored 4 errors, 0 violation remaining.
[INFO]
[INFO] --- maven-invoker-plugin:3.2.1:verify (integration-test) @ maven-javadoc-plugin ---
[INFO] -------------------------------------------------
[INFO] Build Summary:
[INFO] Passed: 75, Failed: 0, Errors: 0, Skipped: 8
[INFO] -------------------------------------------------
[INFO] ------------------------------------------------------------------------
[INFO] BUILD SUCCESS
[INFO] ------------------------------------------------------------------------
[INFO] Total time: 22:58 min
[INFO] Finished at: 2021-08-22T23:14:54Z
[INFO] ------------------------------------------------------------------------
[INFO] [jenkins-event-spy] Generated /home/jenkins/jenkins-home/workspace/_box_maven-javadoc-plugin_master@2@tmp/withMavenf6e0d4fa/maven-spy-20210822-225155-4981493970696496502015.log
[WS-CLEANUP] done
[Pipeline] }
[Pipeline] // stage
[Pipeline] }
[Pipeline] // ws
[Pipeline] }
[Pipeline] // node
[Pipeline] }
[Pipeline] }
[Pipeline] // dir
[Pipeline] }
[withMaven] artifactsPublisher - Archive artifact linux-jdk11-m3.6.x_build/pom.xml under org/apache/maven/plugins/maven-javadoc-plugin/3.3.1-SNAPSHOT/maven-javadoc-plugin-3.3.1-SNAPSHOT.pom
[withMaven] artifactsPublisher - Archive artifact linux-jdk11-m3.6.x_build/target/maven-javadoc-plugin-3.3.1-SNAPSHOT.jar under org/apache/maven/plugins/maven-javadoc-plugin/3.3.1-SNAPSHOT/maven-javadoc-plugin-3.3.1-SNAPSHOT.jar
[Fast Archiver] Compressed 522.46 KB of artifacts by 61.2% relative to #98
[withMaven] junitPublisher - Archive test results for Maven artifact org.apache.maven.plugins:maven-javadoc-plugin:maven-plugin:3.3.1-SNAPSHOT generated by maven-surefire-plugin:test (default-test): linux-jdk11-m3.6.x_build/target/surefire-reports/*.xml
Recording test results
[withMaven] Jenkins Task Scanner Plugin not found, don't display results of source code scanning for 'TODO' and 'FIXME' in pipeline screen.
[withMaven] invokerPublisher - Archive invoker results for Maven artifact MavenArtifact{org.apache.maven.plugins:maven-javadoc-plugin:maven-plugin:3.3.1-SNAPSHOT(version: 3.3.1-SNAPSHOT, snapshot:false) } generated by PluginInvocation{org.apache.maven.plugins:maven-invoker-plugin:3.2.1@integration-test integration-test}: linux-jdk11-m3.6.x_build/target/invoker-reports/*.xml
[withMaven] Publishers: Generated Artifacts Publisher: 150 ms, Junit Publisher: 191 ms, Open Task Scanner Publisher: 1 ms, Invoker Publisher: 50213 ms, Pipeline Graph Publisher: 1 ms
[Pipeline] // withMaven
[Pipeline] cleanWs
[WS-CLEANUP] Deleting project workspace...
[WS-CLEANUP] Deferred wipeout is used...
[WS-CLEANUP] done
[Pipeline] }
[Pipeline] // stage
[Pipeline] }
[Pipeline] // ws
[Pipeline] }
[Pipeline] // node
[Pipeline] }
[Pipeline] // parallel
[Pipeline] stage
[Pipeline] { (Notifications)
[Pipeline] echo
Build result: UNSTABLE
[Pipeline] jiraIssueSelector
[Pipeline] echo
The authors of changes [slachiewicz].
[Pipeline] echo
Sending email ...
[Pipeline] emailext
Build unstable in Jenkins: Maven » Maven TLP » maven-javadoc-plugin » master #101
Posted by Apache Jenkins Server <je...@builds.apache.org>.
See https://ci-maven.apache.org/job/Maven/job/maven-box/job/maven-javadoc-plugin/job/master/101/
Changes:
* [MJAVADOC-677] Using "requires static transitive" makes javadoc goal fail
1 tests failed.
FAILED: org.apache.maven.plugins.javadoc.JavadocReportTest.windows-jdk8-m3.3.x_build / Build windows-jdk8-m3.3.x_build / testTaglets
Error Message:
An error has occurred in Javadoc report generation:
Exit code: 1 - javadoc: error - Error - Exception java.lang.reflect.InvocationTargetException thrown while trying to register Taglet org.tullmann.taglets.ToDo...
f:\jenkins\jenkins-home\82467a7c\workspace\_box_maven-javadoc-plugin_master@2\windows-jdk8-m3.3.x_build\src\test\resources\unit\taglet-test\taglet\test\App.java:25: error: unknown tag: todo
* @todo To test!
^
f:\jenkins\jenkins-home\82467a7c\workspace\_box_maven-javadoc-plugin_master@2\windows-jdk8-m3.3.x_build\src\test\resources\unit\taglet-test\taglet\test\AppSample.java:28: error: unknown tag: todo
* @todo To test!
^
Command line was: cmd.exe /X /C "f:\jenkins\tools\java\latest1.8\jre\..\bin\javadoc.exe @options @packages @argfile"
Refer to the generated Javadoc files in 'f:\jenkins\jenkins-home\82467a7c\workspace\_box_maven-javadoc-plugin_master@2\windows-jdk8-m3.3.x_build\target\test\unit\taglet-test\target\site\apidocs' dir.
Stack Trace:
org.apache.maven.plugin.MojoExecutionException:
An error has occurred in Javadoc report generation:
Exit code: 1 - javadoc: error - Error - Exception java.lang.reflect.InvocationTargetException thrown while trying to register Taglet org.tullmann.taglets.ToDo...
f:\jenkins\jenkins-home\82467a7c\workspace\_box_maven-javadoc-plugin_master@2\windows-jdk8-m3.3.x_build\src\test\resources\unit\taglet-test\taglet\test\App.java:25: error: unknown tag: todo
* @todo To test!
^
f:\jenkins\jenkins-home\82467a7c\workspace\_box_maven-javadoc-plugin_master@2\windows-jdk8-m3.3.x_build\src\test\resources\unit\taglet-test\taglet\test\AppSample.java:28: error: unknown tag: todo
* @todo To test!
^
Command line was: cmd.exe /X /C "f:\jenkins\tools\java\latest1.8\jre\..\bin\javadoc.exe @options @packages @argfile"
Refer to the generated Javadoc files in 'f:\jenkins\jenkins-home\82467a7c\workspace\_box_maven-javadoc-plugin_master@2\windows-jdk8-m3.3.x_build\target\test\unit\taglet-test\target\site\apidocs' dir.
at org.apache.maven.plugins.javadoc.AbstractJavadocMojo.failOnError(AbstractJavadocMojo.java:7069)
at org.apache.maven.plugins.javadoc.JavadocReport.doExecute(JavadocReport.java:328)
at org.apache.maven.plugins.javadoc.AbstractJavadocMojo.execute(AbstractJavadocMojo.java:2016)
at org.apache.maven.plugins.javadoc.JavadocReportTest.testTaglets(JavadocReportTest.java:699)
at sun.reflect.NativeMethodAccessorImpl.invoke0(Native Method)
at sun.reflect.NativeMethodAccessorImpl.invoke(NativeMethodAccessorImpl.java:62)
at sun.reflect.DelegatingMethodAccessorImpl.invoke(DelegatingMethodAccessorImpl.java:43)
at java.lang.reflect.Method.invoke(Method.java:498)
at junit.framework.TestCase.runTest(TestCase.java:177)
at junit.framework.TestCase.runBare(TestCase.java:142)
at junit.framework.TestResult$1.protect(TestResult.java:122)
at junit.framework.TestResult.runProtected(TestResult.java:142)
at junit.framework.TestResult.run(TestResult.java:125)
at junit.framework.TestCase.run(TestCase.java:130)
at junit.framework.TestSuite.runTest(TestSuite.java:241)
at junit.framework.TestSuite.run(TestSuite.java:236)
at org.junit.internal.runners.JUnit38ClassRunner.run(JUnit38ClassRunner.java:90)
at org.apache.maven.surefire.junit4.JUnit4Provider.execute(JUnit4Provider.java:365)
at org.apache.maven.surefire.junit4.JUnit4Provider.executeWithRerun(JUnit4Provider.java:273)
at org.apache.maven.surefire.junit4.JUnit4Provider.executeTestSet(JUnit4Provider.java:238)
at org.apache.maven.surefire.junit4.JUnit4Provider.invoke(JUnit4Provider.java:159)
at org.apache.maven.surefire.booter.ForkedBooter.invokeProviderInSameClassLoader(ForkedBooter.java:383)
at org.apache.maven.surefire.booter.ForkedBooter.runSuitesInProcess(ForkedBooter.java:344)
at org.apache.maven.surefire.booter.ForkedBooter.execute(ForkedBooter.java:125)
at org.apache.maven.surefire.booter.ForkedBooter.main(ForkedBooter.java:417)
Caused by: org.apache.maven.reporting.MavenReportException:
Exit code: 1 - javadoc: error - Error - Exception java.lang.reflect.InvocationTargetException thrown while trying to register Taglet org.tullmann.taglets.ToDo...
f:\jenkins\jenkins-home\82467a7c\workspace\_box_maven-javadoc-plugin_master@2\windows-jdk8-m3.3.x_build\src\test\resources\unit\taglet-test\taglet\test\App.java:25: error: unknown tag: todo
* @todo To test!
^
f:\jenkins\jenkins-home\82467a7c\workspace\_box_maven-javadoc-plugin_master@2\windows-jdk8-m3.3.x_build\src\test\resources\unit\taglet-test\taglet\test\AppSample.java:28: error: unknown tag: todo
* @todo To test!
^
Command line was: cmd.exe /X /C "f:\jenkins\tools\java\latest1.8\jre\..\bin\javadoc.exe @options @packages @argfile"
Refer to the generated Javadoc files in 'f:\jenkins\jenkins-home\82467a7c\workspace\_box_maven-javadoc-plugin_master@2\windows-jdk8-m3.3.x_build\target\test\unit\taglet-test\target\site\apidocs' dir.
at org.apache.maven.plugins.javadoc.AbstractJavadocMojo.doExecuteJavadocCommandLine(AbstractJavadocMojo.java:6057)
at org.apache.maven.plugins.javadoc.AbstractJavadocMojo.executeJavadocCommandLine(AbstractJavadocMojo.java:5939)
at org.apache.maven.plugins.javadoc.AbstractJavadocMojo.executeReport(AbstractJavadocMojo.java:2259)
at org.apache.maven.plugins.javadoc.JavadocReport.generate(JavadocReport.java:135)
at org.apache.maven.plugins.javadoc.JavadocReport.doExecute(JavadocReport.java:324)
... 23 more
Build log:
[...truncated 9862 lines...]
Recording test results
[INFO] MJAVADOC-538/pom.xml ............................. SUCCESS (3.3 s)
[INFO] Building: MJAVADOC-562_release/pom.xml
[INFO] MJAVADOC-562_release/pom.xml ..................... SKIPPED due to JRE version
[INFO] Building: dependencySource-1/pom.xml
[INFO] MJAVADOC-679_encoding\pom.xml .................... SUCCESS (9.0 s)
[INFO] Building: site-failOnError\pom.xml
[INFO] run post-build script verify.bsh
[INFO] dependencySource-1/pom.xml ....................... SUCCESS (5.6 s)
[INFO] Building: site-failOnError/pom.xml
[withMaven] Jenkins Task Scanner Plugin not found, don't display results of source code scanning for 'TODO' and 'FIXME' in pipeline screen.
[withMaven] invokerPublisher - Archive invoker results for Maven artifact MavenArtifact{org.apache.maven.plugins:maven-javadoc-plugin:maven-plugin:3.3.1-SNAPSHOT(version: 3.3.1-SNAPSHOT, snapshot:false) } generated by PluginInvocation{org.apache.maven.plugins:maven-invoker-plugin:3.2.1@integration-test integration-test}: windows-jdk16-m3.6.x_build\target\invoker-reports\*.xml
[INFO] site-failOnError/pom.xml ......................... SUCCESS (5.2 s)
[INFO] Building: dependencySource-4/pom.xml
[INFO] site-failOnError\pom.xml ......................... SUCCESS (8.5 s)
[INFO]
[INFO] --- mrm-maven-plugin:1.2.0:stop (repository) @ maven-javadoc-plugin ---
[INFO] Stopping Mock Repository Manager on http://localhost:61260
[INFO] Stopped SocketConnector@0.0.0.0:61260
[INFO] Mock Repository Manager http://localhost:61260 is stopped.
[INFO]
[INFO] --- mrm-maven-plugin:1.2.0:stop (3rdparty) @ maven-javadoc-plugin ---
[INFO] Stopping Mock Repository Manager on http://localhost:61261
[INFO] Stopped SocketConnector@0.0.0.0:61261
[INFO] Mock Repository Manager http://localhost:61261 is stopped.
[INFO]
[INFO] --- maven-checkstyle-plugin:3.0.0:check (checkstyle-check) @ maven-javadoc-plugin ---
[INFO] There are 4 errors reported by Checkstyle 6.18 with config/maven_checks.xml ruleset.
[INFO] Ignored 4 errors, 0 violation remaining.
[INFO]
[INFO] --- maven-invoker-plugin:3.2.1:verify (integration-test) @ maven-javadoc-plugin ---
[INFO] -------------------------------------------------
[INFO] Build Summary:
[INFO] Passed: 78, Failed: 0, Errors: 0, Skipped: 6
[INFO] -------------------------------------------------
[INFO] ------------------------------------------------------------------------
[INFO] BUILD SUCCESS
[INFO] ------------------------------------------------------------------------
[INFO] Total time: 16:40 min
[INFO] Finished at: 2021-08-24T14:05:42-07:00
[INFO] ------------------------------------------------------------------------
[INFO] [jenkins-event-spy] Generated F:\jenkins\jenkins-slave\82467a7c\workspace\_box_maven-javadoc-plugin_master@2@tmp\withMaven082a54a3\maven-spy-20210824-134902-505288134539836786770.log
[Pipeline] }
[Pipeline] // dir
[Pipeline] }
[withMaven] artifactsPublisher - Archive artifact windows-jdk17-m3.6.x_build\pom.xml under org\apache\maven\plugins\maven-javadoc-plugin\3.3.1-SNAPSHOT\maven-javadoc-plugin-3.3.1-SNAPSHOT.pom
[withMaven] artifactsPublisher - Archive artifact windows-jdk17-m3.6.x_build\target\maven-javadoc-plugin-3.3.1-SNAPSHOT.jar under org\apache\maven\plugins\maven-javadoc-plugin\3.3.1-SNAPSHOT\maven-javadoc-plugin-3.3.1-SNAPSHOT.jar
[INFO] run post-build script verify.bsh
[INFO] dependencySource-4/pom.xml ....................... SUCCESS (9.0 s)
[INFO] Building: additional-dependencies-non-aggregate/pom.xml
[Fast Archiver] Compressed 530.15 KB of artifacts by 42.3% relative to #100
[withMaven] junitPublisher - Archive test results for Maven artifact org.apache.maven.plugins:maven-javadoc-plugin:maven-plugin:3.3.1-SNAPSHOT generated by maven-surefire-plugin:test (default-test): windows-jdk17-m3.6.x_build\target\surefire-reports\*.xml
Recording test results
[INFO] run post-build script verify.bsh
[INFO] additional-dependencies-non-aggregate/pom.xml .... SUCCESS (6.4 s)
[INFO] Building: MJAVADOC-568_manifest-splitpackage/pom.xml
[INFO] MJAVADOC-568_manifest-splitpackage/pom.xml ....... SKIPPED due to JRE version
[INFO] Building: MJAVADOC-134_multiaggregate/pom.xml
[withMaven] Jenkins Task Scanner Plugin not found, don't display results of source code scanning for 'TODO' and 'FIXME' in pipeline screen.
[withMaven] invokerPublisher - Archive invoker results for Maven artifact MavenArtifact{org.apache.maven.plugins:maven-javadoc-plugin:maven-plugin:3.3.1-SNAPSHOT(version: 3.3.1-SNAPSHOT, snapshot:false) } generated by PluginInvocation{org.apache.maven.plugins:maven-invoker-plugin:3.2.1@integration-test integration-test}: windows-jdk17-m3.6.x_build\target\invoker-reports\*.xml
[INFO] run post-build script verify.groovy
[INFO] MJAVADOC-134_multiaggregate/pom.xml .............. SUCCESS (10.2 s)
[INFO] Building: MJAVADOC-661_mrjar/pom.xml
[INFO] MJAVADOC-661_mrjar/pom.xml ....................... SKIPPED due to JRE version
[INFO] Building: MJAVADOC-636-aggregate_module_skipped/pom.xml
[INFO] run post-build script verify.groovy
[INFO] MJAVADOC-636-aggregate_module_skipped/pom.xml .... SUCCESS (7.2 s)
[INFO] Building: MJAVADOC-407/pom.xml
[INFO] run post-build script verify.bsh
[INFO] MJAVADOC-407/pom.xml ............................. SUCCESS (4.5 s)
[INFO] Building: MJAVADOC-437/pom.xml
[INFO] run post-build script verify.bsh
[INFO] MJAVADOC-437/pom.xml ............................. SUCCESS (4.6 s)
[INFO] Building: MJAVADOC-180/pom.xml
[INFO] run post-build script verify.bsh
[INFO] MJAVADOC-180/pom.xml ............................. SUCCESS (4.0 s)
[INFO] Building: MJAVADOC-494_aggregate-repositories/pom.xml
[INFO] artifact org.apache.maven.plugins.javadoc.its.lib:1.0: checking for updates from central
[INFO] MJAVADOC-494_aggregate-repositories/pom.xml ...... SUCCESS (4.2 s)
[INFO] Building: MJAVADOC-634-module-testreports/pom.xml
[INFO] MJAVADOC-634-module-testreports/pom.xml .......... SKIPPED due to JRE version
[INFO] Building: MJAVADOC-580_detectLinks/pom.xml
[INFO] run post-build script verify.groovy
[INFO] MJAVADOC-580_detectLinks/pom.xml ................. SUCCESS (3.2 s)
[INFO] Building: MJAVADOC-498_mm_modulepath/pom.xml
[INFO] MJAVADOC-498_mm_modulepath/pom.xml ............... SKIPPED due to JRE version
[INFO] Building: MJAVADOC-449_aggr_modulepath/pom.xml
[INFO] MJAVADOC-449_aggr_modulepath/pom.xml ............. SKIPPED due to JRE version
[INFO] Building: MJAVADOC-556_hide-non-exported-packages/pom.xml
[INFO] MJAVADOC-556_hide-non-exported-packages/pom.xml .. SKIPPED due to JRE version
[INFO] Building: MJAVADOC-568_export-to-testcase/pom.xml
[INFO] MJAVADOC-568_export-to-testcase/pom.xml .......... SKIPPED due to JRE version
[INFO] Building: MJAVADOC-427/pom.xml
[withMaven] Publishers: Generated Artifacts Publisher: 5090 ms, Junit Publisher: 8397 ms, Open Task Scanner Publisher: 1 ms, Invoker Publisher: 134864 ms, Pipeline Graph Publisher: 1 ms
[Pipeline] // withMaven
[Pipeline] cleanWs
[WS-CLEANUP] Deleting project workspace...
[WS-CLEANUP] Deferred wipeout is used...
[WS-CLEANUP] done
[Pipeline] }
[Pipeline] // stage
[Pipeline] }
[Pipeline] // ws
[Pipeline] }
[Pipeline] // node
[Pipeline] }
[INFO] run post-build script verify.groovy
[INFO] MJAVADOC-427/pom.xml ............................. SUCCESS (4.4 s)
[INFO] Building: MJAVADOC-320/pom.xml
[INFO] artifact org.apache.geronimo.specs.geronimo-el_2.2_spec:1.0.1: checking for updates from central
[INFO] run post-build script verify.groovy
[INFO] MJAVADOC-320/pom.xml ............................. SUCCESS (5.4 s)
[INFO] Building: MJAVADOC-498_aggr_modulepath/pom.xml
[INFO] MJAVADOC-498_aggr_modulepath/pom.xml ............. SKIPPED due to JRE version
[INFO] Building: examples/exclude-package-names/pom.xml
[INFO] run post-build script verify.groovy
[INFO] examples/exclude-package-names/pom.xml ........... SUCCESS (3.0 s)
[INFO] Building: examples/alternate-doclet/pom.xml
[INFO] run post-build script verify.groovy
[INFO] examples/alternate-doclet/pom.xml ................ SUCCESS (3.6 s)
[INFO] Building: MJAVADOC-599/pom.xml
[INFO] run post-build script verify.groovy
[INFO] MJAVADOC-599/pom.xml ............................. SUCCESS (4.2 s)
[INFO] Building: MJAVADOC-528/pom.xml
[INFO] run post-build script verify.groovy
[INFO] MJAVADOC-528/pom.xml ............................. SUCCESS (4.3 s)
[INFO] Building: MJAVADOC-677_require-static-transitive/pom.xml
[INFO] MJAVADOC-677_require-static-transitive/pom.xml ... SKIPPED due to JRE version
[INFO] Building: MJAVADOC-592_detectApiLink/pom.xml
[INFO] run post-build script verify.groovy
[INFO] MJAVADOC-592_detectApiLink/pom.xml ............... SUCCESS (3.2 s)
[INFO] Building: MJAVADOC-514_3rdparty-doclettags/pom.xml
[INFO] artifact org.apache.maven.plugins.javadoc.its.doclet:1.0: checking for updates from central
[INFO] MJAVADOC-514_3rdparty-doclettags/pom.xml ......... SUCCESS (3.7 s)
[INFO] Building: MJAVADOC-338_downloadSources/pom.xml
[INFO] artifact org.apache.maven.plugins.javadoc.its.mjavadoc338-direct:1.0: checking for updates from central
[INFO] run post-build script verify.groovy
[INFO] MJAVADOC-338_downloadSources/pom.xml ............. SUCCESS (7.0 s)
[INFO] Building: MJAVADOC-194/pom.xml
[INFO] run post-build script verify.bsh
[INFO] MJAVADOC-194/pom.xml ............................. SUCCESS (4.4 s)
[INFO] Building: MJAVADOC-497/pom.xml
[INFO] run post-build script verify.bsh
[INFO] MJAVADOC-497/pom.xml ............................. SUCCESS (3.9 s)
[INFO] Building: MJAVADOC-172/pom.xml
[INFO] run post-build script verify.bsh
[INFO] MJAVADOC-172/pom.xml ............................. SUCCESS (5.3 s)
[INFO] Building: MJAVADOC-625_addstylesheet/pom.xml
[INFO] run post-build script verify.groovy
[INFO] MJAVADOC-625_addstylesheet/pom.xml ............... SUCCESS (4.0 s)
[INFO] Building: MJAVADOC-369/pom.xml
[INFO] run post-build script verify.bsh
[INFO] MJAVADOC-369/pom.xml ............................. SUCCESS (5.9 s)
[INFO] Building: MJAVADOC-526_aggr-managedDeps/pom.xml
[INFO] MJAVADOC-526_aggr-managedDeps/pom.xml ............ SUCCESS (4.3 s)
[INFO] Building: MJAVADOC-555_link-automatic-modules/pom.xml
[INFO] MJAVADOC-555_link-automatic-modules/pom.xml ...... SKIPPED due to non-matching selectors
[INFO] Building: MJAVADOC-250/pom.xml
[withMaven] Publishers: Generated Artifacts Publisher: 4932 ms, Junit Publisher: 8384 ms, Open Task Scanner Publisher: 13 ms, Invoker Publisher: 126479 ms, Pipeline Graph Publisher: 1 ms
[Pipeline] // withMaven
[Pipeline] cleanWs
[WS-CLEANUP] Deleting project workspace...
[WS-CLEANUP] Deferred wipeout is used...
[WS-CLEANUP] done
[Pipeline] }
[Pipeline] // stage
[Pipeline] }
[Pipeline] // ws
[Pipeline] }
[Pipeline] // node
[Pipeline] }
[INFO] run post-build script verify.bsh
[INFO] MJAVADOC-250/pom.xml ............................. SUCCESS (5.9 s)
[INFO]
[INFO] --- mrm-maven-plugin:1.2.0:stop (repository) @ maven-javadoc-plugin ---
[INFO] Stopping Mock Repository Manager on http://localhost:43309
[INFO] Stopped SocketConnector@0.0.0.0:43309
[INFO] Mock Repository Manager http://localhost:43309 is stopped.
[INFO]
[INFO] --- mrm-maven-plugin:1.2.0:stop (3rdparty) @ maven-javadoc-plugin ---
[INFO] Stopping Mock Repository Manager on http://localhost:36057
[INFO] Stopped SocketConnector@0.0.0.0:36057
[INFO] Mock Repository Manager http://localhost:36057 is stopped.
[INFO]
[INFO] --- maven-checkstyle-plugin:3.0.0:check (checkstyle-check) @ maven-javadoc-plugin ---
[INFO] There are 4 errors reported by Checkstyle 6.18 with config/maven_checks.xml ruleset.
[INFO] Ignored 4 errors, 0 violation remaining.
[INFO]
[INFO] --- maven-invoker-plugin:3.2.1:verify (integration-test) @ maven-javadoc-plugin ---
[INFO] -------------------------------------------------
[INFO] Build Summary:
[INFO] Passed: 63, Failed: 0, Errors: 0, Skipped: 21
[INFO] -------------------------------------------------
[INFO] ------------------------------------------------------------------------
[INFO] BUILD SUCCESS
[INFO] ------------------------------------------------------------------------
[INFO] Total time: 24:39 min
[INFO] Finished at: 2021-08-24T21:07:51+00:00
[INFO] Final Memory: 68M/967M
[INFO] ------------------------------------------------------------------------
[INFO] [jenkins-event-spy] Generated /home/jenkins/jenkins-home/workspace/_box_maven-javadoc-plugin_master@3@tmp/withMaven15a2a1dc/maven-spy-20210824-204311-8216136347461468948574.log
[Pipeline] }
[Pipeline] // dir
[Pipeline] }
[withMaven] artifactsPublisher - Archive artifact linux-jdk8-m3.2.x_build/pom.xml under org/apache/maven/plugins/maven-javadoc-plugin/3.3.1-SNAPSHOT/maven-javadoc-plugin-3.3.1-SNAPSHOT.pom
[withMaven] artifactsPublisher - Archive artifact linux-jdk8-m3.2.x_build/target/maven-javadoc-plugin-3.3.1-SNAPSHOT.jar under org/apache/maven/plugins/maven-javadoc-plugin/3.3.1-SNAPSHOT/maven-javadoc-plugin-3.3.1-SNAPSHOT.jar
[Fast Archiver] Compressed 524.01 KB of artifacts by 67.2% relative to #100
[withMaven] junitPublisher - Archive test results for Maven artifact org.apache.maven.plugins:maven-javadoc-plugin:maven-plugin:3.3.1-SNAPSHOT generated by maven-surefire-plugin:test (default-test): linux-jdk8-m3.2.x_build/target/surefire-reports/*.xml
Recording test results
[withMaven] Jenkins Task Scanner Plugin not found, don't display results of source code scanning for 'TODO' and 'FIXME' in pipeline screen.
[withMaven] invokerPublisher - Archive invoker results for Maven artifact MavenArtifact{org.apache.maven.plugins:maven-javadoc-plugin:maven-plugin:3.3.1-SNAPSHOT(version: 3.3.1-SNAPSHOT, snapshot:false) } generated by PluginInvocation{org.apache.maven.plugins:maven-invoker-plugin:3.2.1@integration-test integration-test}: linux-jdk8-m3.2.x_build/target/invoker-reports/*.xml
[withMaven] Publishers: Generated Artifacts Publisher: 66 ms, Junit Publisher: 145 ms, Open Task Scanner Publisher: 1 ms, Invoker Publisher: 19333 ms
[Pipeline] // withMaven
[Pipeline] cleanWs
[WS-CLEANUP] Deleting project workspace...
[WS-CLEANUP] Deferred wipeout is used...
[WS-CLEANUP] done
[Pipeline] }
[Pipeline] // stage
[Pipeline] }
[Pipeline] // ws
[Pipeline] }
[Pipeline] // node
[Pipeline] }
[withMaven] Publishers: Generated Artifacts Publisher: 4612 ms, Junit Publisher: 7702 ms, Open Task Scanner Publisher: 1 ms, Invoker Publisher: 127737 ms, Pipeline Graph Publisher: 1 ms
[Pipeline] // withMaven
[Pipeline] cleanWs
[WS-CLEANUP] Deleting project workspace...
[WS-CLEANUP] Deferred wipeout is used...
[WS-CLEANUP] done
[Pipeline] }
[Pipeline] // stage
[Pipeline] }
[Pipeline] // ws
[Pipeline] }
[Pipeline] // node
[Pipeline] }
[Pipeline] // parallel
[Pipeline] stage
[Pipeline] { (Notifications)
[Pipeline] echo
Build result: UNSTABLE
[Pipeline] jiraIssueSelector
[Pipeline] jiraComment
[Pipeline] echo
The authors of changes [rfscholte].
[Pipeline] echo
Sending email ...
[Pipeline] emailext
Build unstable in Jenkins: Maven » Maven TLP » maven-javadoc-plugin » master #100
Posted by Apache Jenkins Server <je...@builds.apache.org>.
See https://ci-maven.apache.org/job/Maven/job/maven-box/job/maven-javadoc-plugin/job/master/100/
Changes:
* [MJAVADOC-680] JDK 16+: Error fetching link: ...\target\javadoc-bundle-options. Ignored it.
1 tests failed.
FAILED: org.apache.maven.plugins.javadoc.JavadocReportTest.windows-jdk8-m3.3.x_build / Build windows-jdk8-m3.3.x_build / testTaglets
Error Message:
An error has occurred in Javadoc report generation:
Exit code: 1 - javadoc: error - Error - Exception java.lang.reflect.InvocationTargetException thrown while trying to register Taglet org.tullmann.taglets.ToDo...
f:\jenkins\jenkins-home\82467a7c\workspace\_box_maven-javadoc-plugin_master@2\windows-jdk8-m3.3.x_build\src\test\resources\unit\taglet-test\taglet\test\App.java:25: error: unknown tag: todo
* @todo To test!
^
f:\jenkins\jenkins-home\82467a7c\workspace\_box_maven-javadoc-plugin_master@2\windows-jdk8-m3.3.x_build\src\test\resources\unit\taglet-test\taglet\test\AppSample.java:28: error: unknown tag: todo
* @todo To test!
^
Command line was: cmd.exe /X /C "f:\jenkins\tools\java\latest1.8\jre\..\bin\javadoc.exe @options @packages @argfile"
Refer to the generated Javadoc files in 'f:\jenkins\jenkins-home\82467a7c\workspace\_box_maven-javadoc-plugin_master@2\windows-jdk8-m3.3.x_build\target\test\unit\taglet-test\target\site\apidocs' dir.
Stack Trace:
org.apache.maven.plugin.MojoExecutionException:
An error has occurred in Javadoc report generation:
Exit code: 1 - javadoc: error - Error - Exception java.lang.reflect.InvocationTargetException thrown while trying to register Taglet org.tullmann.taglets.ToDo...
f:\jenkins\jenkins-home\82467a7c\workspace\_box_maven-javadoc-plugin_master@2\windows-jdk8-m3.3.x_build\src\test\resources\unit\taglet-test\taglet\test\App.java:25: error: unknown tag: todo
* @todo To test!
^
f:\jenkins\jenkins-home\82467a7c\workspace\_box_maven-javadoc-plugin_master@2\windows-jdk8-m3.3.x_build\src\test\resources\unit\taglet-test\taglet\test\AppSample.java:28: error: unknown tag: todo
* @todo To test!
^
Command line was: cmd.exe /X /C "f:\jenkins\tools\java\latest1.8\jre\..\bin\javadoc.exe @options @packages @argfile"
Refer to the generated Javadoc files in 'f:\jenkins\jenkins-home\82467a7c\workspace\_box_maven-javadoc-plugin_master@2\windows-jdk8-m3.3.x_build\target\test\unit\taglet-test\target\site\apidocs' dir.
at org.apache.maven.plugins.javadoc.AbstractJavadocMojo.failOnError(AbstractJavadocMojo.java:7069)
at org.apache.maven.plugins.javadoc.JavadocReport.doExecute(JavadocReport.java:328)
at org.apache.maven.plugins.javadoc.AbstractJavadocMojo.execute(AbstractJavadocMojo.java:2016)
at org.apache.maven.plugins.javadoc.JavadocReportTest.testTaglets(JavadocReportTest.java:699)
at sun.reflect.NativeMethodAccessorImpl.invoke0(Native Method)
at sun.reflect.NativeMethodAccessorImpl.invoke(NativeMethodAccessorImpl.java:62)
at sun.reflect.DelegatingMethodAccessorImpl.invoke(DelegatingMethodAccessorImpl.java:43)
at java.lang.reflect.Method.invoke(Method.java:498)
at junit.framework.TestCase.runTest(TestCase.java:177)
at junit.framework.TestCase.runBare(TestCase.java:142)
at junit.framework.TestResult$1.protect(TestResult.java:122)
at junit.framework.TestResult.runProtected(TestResult.java:142)
at junit.framework.TestResult.run(TestResult.java:125)
at junit.framework.TestCase.run(TestCase.java:130)
at junit.framework.TestSuite.runTest(TestSuite.java:241)
at junit.framework.TestSuite.run(TestSuite.java:236)
at org.junit.internal.runners.JUnit38ClassRunner.run(JUnit38ClassRunner.java:90)
at org.apache.maven.surefire.junit4.JUnit4Provider.execute(JUnit4Provider.java:365)
at org.apache.maven.surefire.junit4.JUnit4Provider.executeWithRerun(JUnit4Provider.java:273)
at org.apache.maven.surefire.junit4.JUnit4Provider.executeTestSet(JUnit4Provider.java:238)
at org.apache.maven.surefire.junit4.JUnit4Provider.invoke(JUnit4Provider.java:159)
at org.apache.maven.surefire.booter.ForkedBooter.invokeProviderInSameClassLoader(ForkedBooter.java:383)
at org.apache.maven.surefire.booter.ForkedBooter.runSuitesInProcess(ForkedBooter.java:344)
at org.apache.maven.surefire.booter.ForkedBooter.execute(ForkedBooter.java:125)
at org.apache.maven.surefire.booter.ForkedBooter.main(ForkedBooter.java:417)
Caused by: org.apache.maven.reporting.MavenReportException:
Exit code: 1 - javadoc: error - Error - Exception java.lang.reflect.InvocationTargetException thrown while trying to register Taglet org.tullmann.taglets.ToDo...
f:\jenkins\jenkins-home\82467a7c\workspace\_box_maven-javadoc-plugin_master@2\windows-jdk8-m3.3.x_build\src\test\resources\unit\taglet-test\taglet\test\App.java:25: error: unknown tag: todo
* @todo To test!
^
f:\jenkins\jenkins-home\82467a7c\workspace\_box_maven-javadoc-plugin_master@2\windows-jdk8-m3.3.x_build\src\test\resources\unit\taglet-test\taglet\test\AppSample.java:28: error: unknown tag: todo
* @todo To test!
^
Command line was: cmd.exe /X /C "f:\jenkins\tools\java\latest1.8\jre\..\bin\javadoc.exe @options @packages @argfile"
Refer to the generated Javadoc files in 'f:\jenkins\jenkins-home\82467a7c\workspace\_box_maven-javadoc-plugin_master@2\windows-jdk8-m3.3.x_build\target\test\unit\taglet-test\target\site\apidocs' dir.
at org.apache.maven.plugins.javadoc.AbstractJavadocMojo.doExecuteJavadocCommandLine(AbstractJavadocMojo.java:6057)
at org.apache.maven.plugins.javadoc.AbstractJavadocMojo.executeJavadocCommandLine(AbstractJavadocMojo.java:5939)
at org.apache.maven.plugins.javadoc.AbstractJavadocMojo.executeReport(AbstractJavadocMojo.java:2259)
at org.apache.maven.plugins.javadoc.JavadocReport.generate(JavadocReport.java:135)
at org.apache.maven.plugins.javadoc.JavadocReport.doExecute(JavadocReport.java:324)
... 23 more
Build log:
[...truncated 9931 lines...]
[INFO] Building: MJAVADOC-567_aggr-mixed\pom.xml
[INFO] MJAVADOC-567_aggr-mixed\pom.xml .................. SKIPPED due to JRE version
[INFO] Building: MJAVADOC-568_export-to-testcase\pom.xml
[INFO] MJAVADOC-568_export-to-testcase\pom.xml .......... SKIPPED due to JRE version
[INFO] Building: MJAVADOC-568_jar-mixed\pom.xml
[INFO] MJAVADOC-568_jar-mixed\pom.xml ................... SKIPPED due to JRE version
[INFO] Building: MJAVADOC-568_manifest-splitpackage\pom.xml
[INFO] MJAVADOC-568_manifest-splitpackage\pom.xml ....... SKIPPED due to JRE version
[INFO] Building: MJAVADOC-569_aggr-mixed\pom.xml
[INFO] MJAVADOC-569_aggr-mixed\pom.xml .................. SKIPPED due to JRE version
[INFO] Building: MJAVADOC-571_aggr-empty-sourcepaths\pom.xml
[INFO] MJAVADOC-571_aggr-empty-sourcepaths\pom.xml ...... SKIPPED due to JRE version
[INFO] Building: MJAVADOC-575_source8-module-info\pom.xml
[INFO] MJAVADOC-672_multiline-tag\pom.xml ............... SUCCESS (7.4 s)
[INFO] Building: MJAVADOC-679_encoding\pom.xml
[INFO] run pre-build script setup.groovy
[INFO] run post-build script verify.groovy
[INFO] MJAVADOC-575_source8-module-info\pom.xml ......... SUCCESS (4.8 s)
[INFO] Building: MJAVADOC-580_detectLinks\pom.xml
[INFO] run post-build script verify.groovy
[INFO] MJAVADOC-580_detectLinks\pom.xml ................. SUCCESS (3.9 s)
[INFO] Building: MJAVADOC-590_nooverview\pom.xml
[INFO] run post-build script verify.groovy
[INFO] MJAVADOC-639_requires_ignored\pom.xml ............ SUCCESS (14.0 s)
[INFO] Building: MJAVADOC-661_mrjar\pom.xml
[INFO] MJAVADOC-679_encoding\pom.xml .................... SUCCESS (8.6 s)
[INFO] Building: site-failOnError\pom.xml
[INFO] run post-build script verify.groovy
[INFO] MJAVADOC-590_nooverview\pom.xml .................. SUCCESS (4.5 s)
[INFO] Building: MJAVADOC-591_release8\pom.xml
[INFO] MJAVADOC-591_release8\pom.xml .................... SKIPPED due to JRE version
[INFO] Building: MJAVADOC-592_detectApiLink\pom.xml
[INFO] run post-build script verify.groovy
[INFO] MJAVADOC-592_detectApiLink\pom.xml ............... SUCCESS (3.9 s)
[INFO] Building: MJAVADOC-599\pom.xml
[INFO] run post-build script verify.groovy
[INFO] MJAVADOC-661_mrjar\pom.xml ....................... SUCCESS (9.1 s)
[INFO] Building: MJAVADOC-672_multiline-tag\pom.xml
[INFO] site-failOnError\pom.xml ......................... SUCCESS (8.0 s)
[INFO]
[INFO] --- mrm-maven-plugin:1.2.0:stop (repository) @ maven-javadoc-plugin ---
[INFO] Stopping Mock Repository Manager on http://localhost:58151
[INFO] Stopped SocketConnector@0.0.0.0:58151
[INFO] Mock Repository Manager http://localhost:58151 is stopped.
[INFO]
[INFO] --- mrm-maven-plugin:1.2.0:stop (3rdparty) @ maven-javadoc-plugin ---
[INFO] Stopping Mock Repository Manager on http://localhost:58152
[INFO] Stopped SocketConnector@0.0.0.0:58152
[INFO] Mock Repository Manager http://localhost:58152 is stopped.
[INFO]
[INFO] --- maven-checkstyle-plugin:3.0.0:check (checkstyle-check) @ maven-javadoc-plugin ---
[INFO] run post-build script verify.groovy
[INFO] MJAVADOC-599\pom.xml ............................. SUCCESS (5.0 s)
[INFO] Building: MJAVADOC-610_mrjar\pom.xml
[INFO] MJAVADOC-610_mrjar\pom.xml ....................... SKIPPED due to JRE version
[INFO] Building: MJAVADOC-611_dependencyLinks\pom.xml
[INFO] There are 4 errors reported by Checkstyle 6.18 with config/maven_checks.xml ruleset.
[INFO] Ignored 4 errors, 0 violation remaining.
[INFO]
[INFO] --- maven-invoker-plugin:3.2.1:verify (integration-test) @ maven-javadoc-plugin ---
[INFO] -------------------------------------------------
[INFO] Build Summary:
[INFO] Passed: 77, Failed: 0, Errors: 0, Skipped: 6
[INFO] -------------------------------------------------
[INFO] ------------------------------------------------------------------------
[INFO] BUILD SUCCESS
[INFO] ------------------------------------------------------------------------
[INFO] Total time: 16:00 min
[INFO] Finished at: 2021-08-23T10:45:30-07:00
[INFO] ------------------------------------------------------------------------
[INFO] [jenkins-event-spy] Generated F:\jenkins\jenkins-slave\82467a7c\workspace\_box_maven-javadoc-plugin_master@2@tmp\withMavene160598d\maven-spy-20210823-102930-44311037953782325157761.log
[Pipeline] }
[Pipeline] // dir
[Pipeline] }
[INFO] MJAVADOC-672_multiline-tag\pom.xml ............... SUCCESS (7.0 s)
[INFO] Building: MJAVADOC-679_encoding\pom.xml
[INFO] run pre-build script setup.groovy
[withMaven] artifactsPublisher - Archive artifact windows-jdk16-m3.6.x_build\pom.xml under org\apache\maven\plugins\maven-javadoc-plugin\3.3.1-SNAPSHOT\maven-javadoc-plugin-3.3.1-SNAPSHOT.pom
[withMaven] artifactsPublisher - Archive artifact windows-jdk16-m3.6.x_build\target\maven-javadoc-plugin-3.3.1-SNAPSHOT.jar under org\apache\maven\plugins\maven-javadoc-plugin\3.3.1-SNAPSHOT\maven-javadoc-plugin-3.3.1-SNAPSHOT.jar
[Fast Archiver] Compressed 530.15 KB of artifacts by 54.3% relative to #99
[withMaven] junitPublisher - Archive test results for Maven artifact org.apache.maven.plugins:maven-javadoc-plugin:maven-plugin:3.3.1-SNAPSHOT generated by maven-surefire-plugin:test (default-test): windows-jdk16-m3.6.x_build\target\surefire-reports\*.xml
Recording test results
[INFO] MJAVADOC-679_encoding\pom.xml .................... SUCCESS (8.3 s)
[INFO] Building: site-failOnError\pom.xml
[INFO] run post-build script verify.groovy
[INFO] MJAVADOC-611_dependencyLinks\pom.xml ............. SUCCESS (16.7 s)
[INFO] Building: MJAVADOC-613-aggregate-exclude\pom.xml
[withMaven] Jenkins Task Scanner Plugin not found, don't display results of source code scanning for 'TODO' and 'FIXME' in pipeline screen.
[withMaven] invokerPublisher - Archive invoker results for Maven artifact MavenArtifact{org.apache.maven.plugins:maven-javadoc-plugin:maven-plugin:3.3.1-SNAPSHOT(version: 3.3.1-SNAPSHOT, snapshot:false) } generated by PluginInvocation{org.apache.maven.plugins:maven-invoker-plugin:3.2.1@integration-test integration-test}: windows-jdk16-m3.6.x_build\target\invoker-reports\*.xml
[INFO] site-failOnError\pom.xml ......................... SUCCESS (7.8 s)
[INFO]
[INFO] --- mrm-maven-plugin:1.2.0:stop (repository) @ maven-javadoc-plugin ---
[INFO] Stopping Mock Repository Manager on http://localhost:49949
[INFO] Stopped SocketConnector@0.0.0.0:49949
[INFO] Mock Repository Manager http://localhost:49949 is stopped.
[INFO]
[INFO] --- mrm-maven-plugin:1.2.0:stop (3rdparty) @ maven-javadoc-plugin ---
[INFO] Stopping Mock Repository Manager on http://localhost:49950
[INFO] Stopped SocketConnector@0.0.0.0:49950
[INFO] Mock Repository Manager http://localhost:49950 is stopped.
[INFO]
[INFO] --- maven-checkstyle-plugin:3.0.0:check (checkstyle-check) @ maven-javadoc-plugin ---
[INFO] run post-build script verify.groovy
[INFO] MJAVADOC-613-aggregate-exclude\pom.xml ........... SUCCESS (7.1 s)
[INFO] Building: MJAVADOC-619_copyright-year\pom.xml
[INFO] There are 4 errors reported by Checkstyle 6.18 with config/maven_checks.xml ruleset.
[INFO] Ignored 4 errors, 0 violation remaining.
[INFO]
[INFO] --- maven-invoker-plugin:3.2.1:verify (integration-test) @ maven-javadoc-plugin ---
[INFO] -------------------------------------------------
[INFO] Build Summary:
[INFO] Passed: 77, Failed: 0, Errors: 0, Skipped: 6
[INFO] -------------------------------------------------
[INFO] ------------------------------------------------------------------------
[INFO] BUILD SUCCESS
[INFO] ------------------------------------------------------------------------
[INFO] Total time: 15:18 min
[INFO] Finished at: 2021-08-23T10:45:53-07:00
[INFO] ------------------------------------------------------------------------
[INFO] [jenkins-event-spy] Generated F:\jenkins\jenkins-slave\82467a7c\workspace\_box_maven-javadoc-plugin_master@2@tmp\withMaven8e3d98f5\maven-spy-20210823-103033-83714700341873769718227.log
[Pipeline] }
[Pipeline] // dir
[Pipeline] }
[withMaven] artifactsPublisher - Archive artifact windows-jdk17-m3.6.x_build\pom.xml under org\apache\maven\plugins\maven-javadoc-plugin\3.3.1-SNAPSHOT\maven-javadoc-plugin-3.3.1-SNAPSHOT.pom
[withMaven] artifactsPublisher - Archive artifact windows-jdk17-m3.6.x_build\target\maven-javadoc-plugin-3.3.1-SNAPSHOT.jar under org\apache\maven\plugins\maven-javadoc-plugin\3.3.1-SNAPSHOT\maven-javadoc-plugin-3.3.1-SNAPSHOT.jar
[INFO] run post-build script verify.groovy
[INFO] MJAVADOC-619_copyright-year\pom.xml .............. SUCCESS (4.5 s)
[INFO] Building: MJAVADOC-620_no-dot-in-version\pom.xml
[Fast Archiver] Compressed 530.15 KB of artifacts by 54.3% relative to #99
[withMaven] junitPublisher - Archive test results for Maven artifact org.apache.maven.plugins:maven-javadoc-plugin:maven-plugin:3.3.1-SNAPSHOT generated by maven-surefire-plugin:test (default-test): windows-jdk17-m3.6.x_build\target\surefire-reports\*.xml
Recording test results
[INFO] run post-build script verify.bsh
[INFO] MJAVADOC-620_no-dot-in-version\pom.xml ........... SUCCESS (8.9 s)
[INFO] Building: MJAVADOC-620_top-level-package\pom.xml
[withMaven] Jenkins Task Scanner Plugin not found, don't display results of source code scanning for 'TODO' and 'FIXME' in pipeline screen.
[withMaven] invokerPublisher - Archive invoker results for Maven artifact MavenArtifact{org.apache.maven.plugins:maven-javadoc-plugin:maven-plugin:3.3.1-SNAPSHOT(version: 3.3.1-SNAPSHOT, snapshot:false) } generated by PluginInvocation{org.apache.maven.plugins:maven-invoker-plugin:3.2.1@integration-test integration-test}: windows-jdk17-m3.6.x_build\target\invoker-reports\*.xml
[INFO] run post-build script verify.bsh
[INFO] MJAVADOC-620_top-level-package\pom.xml ........... SUCCESS (9.1 s)
[INFO] Building: MJAVADOC-625_addstylesheet\pom.xml
[INFO] run post-build script verify.groovy
[INFO] MJAVADOC-625_addstylesheet\pom.xml ............... SUCCESS (4.5 s)
[INFO] Building: MJAVADOC-634-module-testreports\pom.xml
[INFO] MJAVADOC-634-module-testreports\pom.xml .......... SKIPPED due to JRE version
[INFO] Building: MJAVADOC-636-aggregate_module_skipped\pom.xml
[INFO] run post-build script verify.groovy
[INFO] MJAVADOC-636-aggregate_module_skipped\pom.xml .... SUCCESS (10.8 s)
[INFO] Building: MJAVADOC-639_aggr_static_modulepath\pom.xml
[INFO] MJAVADOC-639_aggr_static_modulepath\pom.xml ...... SKIPPED due to JRE version
[INFO] Building: MJAVADOC-639_requires_ignored\pom.xml
[INFO] MJAVADOC-639_requires_ignored\pom.xml ............ SKIPPED due to JRE version
[INFO] Building: MJAVADOC-661_mrjar\pom.xml
[INFO] MJAVADOC-661_mrjar\pom.xml ....................... SKIPPED due to JRE version
[INFO] Building: MJAVADOC-672_multiline-tag\pom.xml
[INFO] MJAVADOC-672_multiline-tag\pom.xml ............... SUCCESS (4.4 s)
[INFO] Building: MJAVADOC-679_encoding\pom.xml
[INFO] run pre-build script setup.groovy
[INFO] MJAVADOC-679_encoding\pom.xml .................... SUCCESS (4.9 s)
[INFO] Building: site-failOnError\pom.xml
[INFO] site-failOnError\pom.xml ......................... SUCCESS (8.1 s)
[INFO]
[INFO] --- mrm-maven-plugin:1.2.0:stop (repository) @ maven-javadoc-plugin ---
[INFO] Stopping Mock Repository Manager on http://localhost:50802
[INFO] Stopped SocketConnector@0.0.0.0:50802
[INFO] Mock Repository Manager http://localhost:50802 is stopped.
[INFO]
[INFO] --- mrm-maven-plugin:1.2.0:stop (3rdparty) @ maven-javadoc-plugin ---
[INFO] Stopping Mock Repository Manager on http://localhost:50803
[INFO] Stopped SocketConnector@0.0.0.0:50803
[INFO] Mock Repository Manager http://localhost:50803 is stopped.
[INFO]
[INFO] --- maven-checkstyle-plugin:3.0.0:check (checkstyle-check) @ maven-javadoc-plugin ---
[INFO] There are 4 errors reported by Checkstyle 6.18 with config/maven_checks.xml ruleset.
[INFO] Ignored 4 errors, 0 violation remaining.
[INFO]
[INFO] --- maven-invoker-plugin:3.2.1:verify (integration-test) @ maven-javadoc-plugin ---
[INFO] -------------------------------------------------
[INFO] Build Summary:
[INFO] Passed: 63, Failed: 0, Errors: 0, Skipped: 20
[INFO] -------------------------------------------------
[INFO] ------------------------------------------------------------------------
[INFO] BUILD SUCCESS
[INFO] ------------------------------------------------------------------------
[INFO] Total time: 20:27 min
[INFO] Finished at: 2021-08-23T17:46:52+00:00
[INFO] Final Memory: 70M/1063M
[INFO] ------------------------------------------------------------------------
[INFO] [jenkins-event-spy] Generated F:\jenkins\jenkins-home\82467a7c\workspace\_box_maven-javadoc-plugin_master@2@tmp\withMaven72506788\maven-spy-20210823-172620-1445546843468460619113.log
Picked up JAVA_TOOL_OPTIONS: -Dmaven.ext.class.path="f:\jenkins\jenkins-home\82467a7c\workspace\_box_maven-javadoc-plugin_master@2@tmp\withMaven72506788\pipeline-maven-spy.jar" -Dorg.jenkinsci.plugins.pipeline.maven.reportsFolder="f:\jenkins\jenkins-home\82467a7c\workspace\_box_maven-javadoc-plugin_master@2@tmp\withMaven72506788"
[Pipeline] }
[Pipeline] // dir
[Pipeline] }
[withMaven] artifactsPublisher - Archive artifact windows-jdk8-m3.3.x_build\pom.xml under org\apache\maven\plugins\maven-javadoc-plugin\3.3.1-SNAPSHOT\maven-javadoc-plugin-3.3.1-SNAPSHOT.pom
[withMaven] artifactsPublisher - Archive artifact windows-jdk8-m3.3.x_build\target\maven-javadoc-plugin-3.3.1-SNAPSHOT.jar under org\apache\maven\plugins\maven-javadoc-plugin\3.3.1-SNAPSHOT\maven-javadoc-plugin-3.3.1-SNAPSHOT.jar
[Fast Archiver] Compressed 529.54 KB of artifacts by 54.4% relative to #99
[withMaven] junitPublisher - Archive test results for Maven artifact org.apache.maven.plugins:maven-javadoc-plugin:maven-plugin:3.3.1-SNAPSHOT generated by maven-surefire-plugin:test (default-test): windows-jdk8-m3.3.x_build\target\surefire-reports\*.xml
Recording test results
[withMaven] Jenkins Task Scanner Plugin not found, don't display results of source code scanning for 'TODO' and 'FIXME' in pipeline screen.
[withMaven] invokerPublisher - Archive invoker results for Maven artifact MavenArtifact{org.apache.maven.plugins:maven-javadoc-plugin:maven-plugin:3.3.1-SNAPSHOT(version: 3.3.1-SNAPSHOT, snapshot:false) } generated by PluginInvocation{org.apache.maven.plugins:maven-invoker-plugin:3.2.1@integration-test integration-test}: windows-jdk8-m3.3.x_build\target\invoker-reports\*.xml
[withMaven] Publishers: Generated Artifacts Publisher: 4941 ms, Junit Publisher: 8332 ms, Open Task Scanner Publisher: 11 ms, Invoker Publisher: 126367 ms, Pipeline Graph Publisher: 4 ms
[Pipeline] // withMaven
[Pipeline] cleanWs
[WS-CLEANUP] Deleting project workspace...
[WS-CLEANUP] Deferred wipeout is used...
[WS-CLEANUP] done
[Pipeline] }
[Pipeline] // stage
[Pipeline] }
[Pipeline] // ws
[Pipeline] }
[Pipeline] // node
[Pipeline] }
[withMaven] Publishers: Generated Artifacts Publisher: 826 ms, Junit Publisher: 1105 ms, Open Task Scanner Publisher: 1 ms, Invoker Publisher: 61957 ms, Pipeline Graph Publisher: 4 ms
[Pipeline] // withMaven
[Pipeline] cleanWs
[WS-CLEANUP] Deleting project workspace...
[WS-CLEANUP] Deferred wipeout is used...
[WS-CLEANUP] done
[Pipeline] }
[Pipeline] // stage
[Pipeline] }
[Pipeline] // ws
[Pipeline] }
[Pipeline] // node
[Pipeline] }
[withMaven] Publishers: Generated Artifacts Publisher: 4915 ms, Junit Publisher: 8062 ms, Open Task Scanner Publisher: 13 ms, Invoker Publisher: 122600 ms, Pipeline Graph Publisher: 2 ms
[Pipeline] // withMaven
[Pipeline] cleanWs
[WS-CLEANUP] Deleting project workspace...
[WS-CLEANUP] Deferred wipeout is used...
[WS-CLEANUP] done
[Pipeline] }
[Pipeline] // stage
[Pipeline] }
[Pipeline] // ws
[Pipeline] }
[Pipeline] // node
[Pipeline] }
[Pipeline] // parallel
[Pipeline] stage
[Pipeline] { (Notifications)
[Pipeline] echo
Build result: UNSTABLE
[Pipeline] jiraIssueSelector
[Pipeline] jiraComment
[Pipeline] echo
The authors of changes [rfscholte].
[Pipeline] echo
Sending email ...
[Pipeline] emailext