You are viewing a plain text version of this content. The canonical link for it is here.
Posted to builds@beam.apache.org by Apache Jenkins Server <je...@builds.apache.org> on 2019/04/16 11:59:35 UTC
Build failed in Jenkins:
beam_PostCommit_Java_ValidatesRunner_Dataflow #2478
See <https://builds.apache.org/job/beam_PostCommit_Java_ValidatesRunner_Dataflow/2478/display/redirect?page=changes>
Changes:
[thw] [BEAM-6993] Ignore missing artifacts dir during cleanup
------------------------------------------
[...truncated 1.69 KB...]
[EnvInject] - Variables injected successfully.
[Gradle] - Launching build.
[src] $ <https://builds.apache.org/job/beam_PostCommit_Java_ValidatesRunner_Dataflow/ws/src/gradlew> --continue --max-workers=120 -Dorg.gradle.jvmargs=-Xms2g -Dorg.gradle.jvmargs=-Xmx4g :beam-runners-google-cloud-dataflow-java:validatesRunner
To honour the JVM settings for this build a new JVM will be forked. Please consider using the daemon: https://docs.gradle.org/5.2.1/userguide/gradle_daemon.html.
Daemon will be stopped at the end of the build stopping after processing
> Task :buildSrc:compileJava NO-SOURCE
> Task :buildSrc:compileGroovy FROM-CACHE
> Task :buildSrc:pluginDescriptors
> Task :buildSrc:processResources
> Task :buildSrc:classes
> Task :buildSrc:jar
> Task :buildSrc:assemble
> Task :buildSrc:spotlessGroovy
> Task :buildSrc:spotlessGroovyCheck
> Task :buildSrc:spotlessGroovyGradle
> Task :buildSrc:spotlessGroovyGradleCheck
> Task :buildSrc:spotlessCheck
> Task :buildSrc:pluginUnderTestMetadata
> Task :buildSrc:compileTestJava NO-SOURCE
> Task :buildSrc:compileTestGroovy NO-SOURCE
> Task :buildSrc:processTestResources NO-SOURCE
> Task :buildSrc:testClasses UP-TO-DATE
> Task :buildSrc:test NO-SOURCE
> Task :buildSrc:validateTaskProperties FROM-CACHE
> Task :buildSrc:check
> Task :buildSrc:build
Configuration on demand is an incubating feature.
> Task :beam-sdks-java-core:generateAvroProtocol NO-SOURCE
> Task :beam-vendor-sdks-java-extensions-protobuf:processResources NO-SOURCE
> Task :beam-sdks-java-extensions-google-cloud-platform-core:processResources NO-SOURCE
> Task :beam-sdks-java-harness:processResources NO-SOURCE
> Task :beam-runners-core-java:processResources NO-SOURCE
> Task :beam-runners-java-fn-execution:processResources NO-SOURCE
> Task :beam-sdks-java-io-google-cloud-platform:processResources NO-SOURCE
> Task :beam-runners-core-construction-java:processResources NO-SOURCE
> Task :beam-runners-google-cloud-dataflow-java-legacy-worker:processResources NO-SOURCE
> Task :beam-sdks-java-fn-execution:processResources NO-SOURCE
> Task :beam-sdks-java-core:generateAvroJava NO-SOURCE
> Task :beam-sdks-java-extensions-protobuf:extractProto
> Task :beam-model-fn-execution:extractProto
> Task :beam-model-job-management:extractProto
> Task :beam-sdks-java-extensions-protobuf:processResources NO-SOURCE
> Task :beam-sdks-java-core:generateGrammarSource FROM-CACHE
> Task :beam-runners-google-cloud-dataflow-java:processResources
> Task :beam-model-job-management:processResources
> Task :beam-model-fn-execution:processResources
> Task :beam-sdks-java-core:processResources
> Task :beam-sdks-java-core:generateTestAvroProtocol NO-SOURCE
> Task :beam-runners-google-cloud-dataflow-java-windmill:extractIncludeProto
> Task :beam-runners-google-cloud-dataflow-java-windmill:extractProto
> Task :beam-model-pipeline:extractIncludeProto
> Task :beam-model-pipeline:extractProto
> Task :beam-sdks-java-core:generateTestAvroJava
> Task :beam-sdks-java-core:generateTestGrammarSource NO-SOURCE
> Task :beam-sdks-java-core:processTestResources NO-SOURCE
> Task :beam-runners-google-cloud-dataflow-java-windmill:generateProto
> Task :beam-runners-google-cloud-dataflow-java-windmill:compileJava FROM-CACHE
> Task :beam-runners-google-cloud-dataflow-java-windmill:processResources
> Task :beam-runners-google-cloud-dataflow-java-windmill:classes
> Task :beam-model-pipeline:generateProto
> Task :beam-model-pipeline:compileJava FROM-CACHE
> Task :beam-model-pipeline:processResources
> Task :beam-model-pipeline:classes
> Task :beam-model-pipeline:jar
> Task :beam-model-job-management:extractIncludeProto
> Task :beam-model-fn-execution:extractIncludeProto
> Task :beam-model-job-management:generateProto
> Task :beam-model-fn-execution:generateProto
> Task :beam-model-job-management:compileJava FROM-CACHE
> Task :beam-model-fn-execution:compileJava FROM-CACHE
> Task :beam-model-job-management:classes
> Task :beam-model-fn-execution:classes
> Task :beam-runners-google-cloud-dataflow-java-windmill:shadowJar
> Task :beam-model-pipeline:shadowJar
> Task :beam-model-job-management:shadowJar
> Task :beam-model-fn-execution:shadowJar
> Task :beam-sdks-java-core:compileJava FROM-CACHE
> Task :beam-sdks-java-core:classes
> Task :beam-sdks-java-core:shadowJar
> Task :beam-sdks-java-extensions-protobuf:extractIncludeProto
> Task :beam-sdks-java-extensions-protobuf:generateProto NO-SOURCE
> Task :beam-vendor-sdks-java-extensions-protobuf:compileJava FROM-CACHE
> Task :beam-vendor-sdks-java-extensions-protobuf:classes UP-TO-DATE
> Task :beam-sdks-java-extensions-protobuf:compileJava FROM-CACHE
> Task :beam-sdks-java-extensions-protobuf:classes UP-TO-DATE
> Task :beam-sdks-java-extensions-protobuf:shadowJar
> Task :beam-runners-core-construction-java:compileJava FROM-CACHE
> Task :beam-runners-core-construction-java:classes UP-TO-DATE
> Task :beam-sdks-java-extensions-google-cloud-platform-core:compileJava FROM-CACHE
> Task :beam-sdks-java-extensions-google-cloud-platform-core:classes UP-TO-DATE
> Task :beam-sdks-java-core:compileTestJava FROM-CACHE
> Task :beam-sdks-java-core:testClasses UP-TO-DATE
> Task :beam-runners-core-construction-java:shadowJar
> Task :beam-sdks-java-fn-execution:compileJava FROM-CACHE
> Task :beam-sdks-java-fn-execution:classes UP-TO-DATE
> Task :beam-sdks-java-fn-execution:shadowJar
> Task :beam-runners-core-java:compileJava FROM-CACHE
> Task :beam-runners-core-java:classes UP-TO-DATE
> Task :beam-runners-core-java:shadowJar
> Task :beam-vendor-sdks-java-extensions-protobuf:shadowJar
> Task :beam-sdks-java-extensions-google-cloud-platform-core:shadowJar
> Task :beam-sdks-java-harness:compileJava FROM-CACHE
> Task :beam-sdks-java-harness:classes UP-TO-DATE
> Task :beam-sdks-java-harness:jar
> Task :beam-sdks-java-io-google-cloud-platform:compileJava FROM-CACHE
> Task :beam-sdks-java-io-google-cloud-platform:classes UP-TO-DATE
> Task :beam-sdks-java-io-google-cloud-platform:shadowJar
> Task :beam-runners-google-cloud-dataflow-java:compileJava FROM-CACHE
> Task :beam-runners-google-cloud-dataflow-java:classes
> Task :beam-runners-google-cloud-dataflow-java:shadowJar
> Task :beam-sdks-java-core:shadowTestJar
> Task :beam-sdks-java-harness:shadowJar
> Task :beam-runners-java-fn-execution:compileJava FROM-CACHE
> Task :beam-runners-java-fn-execution:classes UP-TO-DATE
> Task :beam-runners-java-fn-execution:shadowJar
> Task :beam-runners-google-cloud-dataflow-java-legacy-worker:compileJava FROM-CACHE
> Task :beam-runners-google-cloud-dataflow-java-legacy-worker:classes UP-TO-DATE
> Task :beam-runners-google-cloud-dataflow-java-legacy-worker:shadowJar
> Task :beam-runners-google-cloud-dataflow-java:validatesRunnerLegacyWorkerTest
org.apache.beam.sdk.transforms.ParDoTest$MultipleInputsAndOutputTests > testSideInputsWithMultipleWindows FAILED
java.lang.RuntimeException at ParDoTest.java:895
org.apache.beam.sdk.transforms.ReifyTimestampsTest > inValuesSucceeds FAILED
java.lang.RuntimeException at ReifyTimestampsTest.java:60
org.apache.beam.sdk.transforms.CreateTest > testCreateWithNullsAndValues FAILED
java.lang.RuntimeException at CreateTest.java:161
org.apache.beam.sdk.transforms.CombineTest$WindowingTests > testCombineGloballyAsSingletonView FAILED
java.lang.RuntimeException at CombineTest.java:1326
org.apache.beam.sdk.transforms.windowing.WindowingTest > testNonPartitioningWindowing FAILED
java.lang.RuntimeException at WindowingTest.java:150
org.apache.beam.sdk.transforms.ParDoTest$BasicTests > testParDoEmpty FAILED
java.lang.RuntimeException at ParDoTest.java:362
org.apache.beam.sdk.transforms.SplittableDoFnTest > testPairWithIndexBasicUnbounded FAILED
java.lang.RuntimeException at SplittableDoFnTest.java:153
org.apache.beam.sdk.transforms.join.CoGroupByKeyTest > testCoGroupByKeyHandleResults FAILED
java.lang.RuntimeException at CoGroupByKeyTest.java:466
org.apache.beam.sdk.transforms.CreateTest > testCreateWithVoidType FAILED
java.lang.RuntimeException at CreateTest.java:325
org.apache.beam.sdk.transforms.CombineTest$WindowingTests > testWindowedCombineEmpty FAILED
java.lang.RuntimeException at CombineTest.java:1300
org.apache.beam.sdk.transforms.windowing.WindowTest > testMergingCustomWindows FAILED
java.lang.RuntimeException at WindowTest.java:632
org.apache.beam.sdk.transforms.ParDoTest$MultipleInputsAndOutputTests > testParDoEmptyWithTaggedOutput FAILED
java.lang.RuntimeException at ParDoTest.java:634
org.apache.beam.sdk.transforms.ParDoTest$BasicTests > testParDoInCustomTransform FAILED
java.lang.RuntimeException at ParDoTest.java:408
org.apache.beam.sdk.testing.PAssertTest > testIsEqualTo FAILED
java.lang.RuntimeException at PAssertTest.java:308
org.apache.beam.sdk.transforms.CreateTest > testCreate FAILED
java.lang.RuntimeException at CreateTest.java:90
org.apache.beam.sdk.transforms.join.CoGroupByKeyTest > testCoGroupByKeyWithWindowing FAILED
java.lang.RuntimeException at CoGroupByKeyTest.java:494
org.apache.beam.sdk.transforms.FlattenTest > testFlattenIterablesEmpty FAILED
java.lang.RuntimeException at FlattenTest.java:312
org.apache.beam.sdk.transforms.windowing.WindowTest > testNoWindowFnDoesNotReassignWindows FAILED
java.lang.RuntimeException at WindowTest.java:434
org.apache.beam.sdk.testing.PAssertTest > testEmpty FAILED
java.lang.RuntimeException at PAssertTest.java:451
org.apache.beam.sdk.transforms.windowing.WindowTest > testMergingCustomWindowsKeyedCollection FAILED
java.lang.RuntimeException at WindowTest.java:659
org.apache.beam.sdk.transforms.CombineTest$WindowingTests > testSlidingWindowsCombine FAILED
java.lang.RuntimeException at CombineTest.java:1131
org.apache.beam.sdk.transforms.ParDoTest$TimerTests > testEventTimeTimerBounded FAILED
java.lang.RuntimeException at ParDoTest.java:2536
org.apache.beam.sdk.transforms.FlattenTest > testFlattenIterablesLists FAILED
java.lang.RuntimeException at FlattenTest.java:265
org.apache.beam.sdk.transforms.CombineTest$BasicTests > testCombinePerKeyLambda FAILED
java.lang.RuntimeException at CombineTest.java:907
org.apache.beam.sdk.transforms.ParDoTest$TimerTests > testEventTimeTimerAlignBounded FAILED
java.lang.RuntimeException at ParDoTest.java:2619
org.apache.beam.sdk.transforms.FlattenTest > testFlattenInputMultipleCopies FAILED
java.lang.RuntimeException at FlattenTest.java:162
org.apache.beam.sdk.transforms.CombineTest$BasicTests > testHotKeyCombining FAILED
java.lang.RuntimeException at CombineTest.java:736
org.apache.beam.sdk.transforms.GroupByKeyTest$BasicTests > testTimestampCombinerEarliest FAILED
java.lang.RuntimeException at GroupByKeyTest.java:270
org.apache.beam.sdk.transforms.CombineTest$WindowingTests > testSessionsCombine FAILED
java.lang.RuntimeException at CombineTest.java:1235
org.apache.beam.sdk.transforms.ViewTest > testEmptyIterableSideInput FAILED
java.lang.RuntimeException at ViewTest.java:470
org.apache.beam.sdk.PipelineTest > testMultipleApply FAILED
java.lang.RuntimeException at PipelineTest.java:228
org.apache.beam.sdk.testing.PAssertTest > testWindowedContainsInAnyOrder FAILED
java.lang.RuntimeException at PAssertTest.java:441
org.apache.beam.sdk.testing.PAssertTest > testPAssertEqualsSingletonFalse FAILED
java.lang.AssertionError at PAssertTest.java:369
org.apache.beam.sdk.transforms.CombineTest$WindowingTests > testWindowedCombineGloballyAsSingletonView FAILED
java.lang.RuntimeException at CombineTest.java:1369
215 tests completed, 34 failed, 2 skipped
> Task :beam-runners-google-cloud-dataflow-java:validatesRunnerLegacyWorkerTest FAILED
FAILURE: Build failed with an exception.
* What went wrong:
Execution failed for task ':beam-runners-google-cloud-dataflow-java:validatesRunnerLegacyWorkerTest'.
> There were failing tests. See the report at: file://<https://builds.apache.org/job/beam_PostCommit_Java_ValidatesRunner_Dataflow/ws/src/runners/google-cloud-dataflow-java/build/reports/tests/validatesRunnerLegacyWorkerTest/index.html>
* Try:
Run with --stacktrace option to get the stack trace. Run with --info or --debug option to get more log output. Run with --scan to get full insights.
* Get more help at https://help.gradle.org
Deprecated Gradle features were used in this build, making it incompatible with Gradle 6.0.
Use '--warning-mode all' to show the individual deprecation warnings.
See https://docs.gradle.org/5.2.1/userguide/command_line_interface.html#sec:command_line_warnings
BUILD FAILED in 2h 57m 15s
59 actionable tasks: 41 executed, 18 from cache
Publishing build scan...
https://gradle.com/s/a6oep2x72nqcm
Build step 'Invoke Gradle script' changed build result to FAILURE
Build step 'Invoke Gradle script' marked build as failure
---------------------------------------------------------------------
To unsubscribe, e-mail: builds-unsubscribe@beam.apache.org
For additional commands, e-mail: builds-help@beam.apache.org