You are viewing a plain text version of this content. The canonical link for it is here.
Posted to dev@hbase.apache.org by Apache Jenkins Server <je...@builds.apache.org> on 2011/11/04 05:38:08 UTC
Build failed in Jenkins: HBase-0.92 #106
See <https://builds.apache.org/job/HBase-0.92/106/changes>
Changes:
[stack] HBASE-4722 TestGlobalMemStoreSize has started failing; ADDENDUM
------------------------------------------
[...truncated 6466 lines...]
Running org.apache.hadoop.hbase.rest.TestMultiRowResource
Tests run: 3, Failures: 0, Errors: 0, Skipped: 0, Time elapsed: 16.852 sec
Forking command line: /bin/sh -c cd <https://builds.apache.org/job/HBase-0.92/ws/trunk> && /home/jenkins/tools/java/jdk1.6.0_27-32/jre/bin/java -enableassertions -Xmx1400m -jar <https://builds.apache.org/job/HBase-0.92/ws/trunk/target/surefire/surefirebooter8679080983190131947.jar> <https://builds.apache.org/job/HBase-0.92/ws/trunk/target/surefire/surefire1474541391138919339tmp> <https://builds.apache.org/job/HBase-0.92/ws/trunk/target/surefire/surefire3086664286420465512tmp>
Running org.apache.hadoop.hbase.rest.TestScannersWithFilters
Tests run: 10, Failures: 0, Errors: 0, Skipped: 0, Time elapsed: 18.468 sec
Forking command line: /bin/sh -c cd <https://builds.apache.org/job/HBase-0.92/ws/trunk> && /home/jenkins/tools/java/jdk1.6.0_27-32/jre/bin/java -enableassertions -Xmx1400m -jar <https://builds.apache.org/job/HBase-0.92/ws/trunk/target/surefire/surefirebooter4874515420818695293.jar> <https://builds.apache.org/job/HBase-0.92/ws/trunk/target/surefire/surefire9153328936258849286tmp> <https://builds.apache.org/job/HBase-0.92/ws/trunk/target/surefire/surefire5223717394662429818tmp>
Running org.apache.hadoop.hbase.rest.TestRowResource
Tests run: 11, Failures: 0, Errors: 0, Skipped: 0, Time elapsed: 16.305 sec
Forking command line: /bin/sh -c cd <https://builds.apache.org/job/HBase-0.92/ws/trunk> && /home/jenkins/tools/java/jdk1.6.0_27-32/jre/bin/java -enableassertions -Xmx1400m -jar <https://builds.apache.org/job/HBase-0.92/ws/trunk/target/surefire/surefirebooter1114809945266947736.jar> <https://builds.apache.org/job/HBase-0.92/ws/trunk/target/surefire/surefire2304867383126008667tmp> <https://builds.apache.org/job/HBase-0.92/ws/trunk/target/surefire/surefire8878980799698145711tmp>
Running org.apache.hadoop.hbase.rest.model.TestCellModel
Tests run: 3, Failures: 0, Errors: 0, Skipped: 0, Time elapsed: 0.369 sec
Forking command line: /bin/sh -c cd <https://builds.apache.org/job/HBase-0.92/ws/trunk> && /home/jenkins/tools/java/jdk1.6.0_27-32/jre/bin/java -enableassertions -Xmx1400m -jar <https://builds.apache.org/job/HBase-0.92/ws/trunk/target/surefire/surefirebooter7192222072403316146.jar> <https://builds.apache.org/job/HBase-0.92/ws/trunk/target/surefire/surefire4131885944119394156tmp> <https://builds.apache.org/job/HBase-0.92/ws/trunk/target/surefire/surefire5750966491385687409tmp>
Running org.apache.hadoop.hbase.rest.model.TestCellSetModel
Tests run: 3, Failures: 0, Errors: 0, Skipped: 0, Time elapsed: 0.406 sec
Forking command line: /bin/sh -c cd <https://builds.apache.org/job/HBase-0.92/ws/trunk> && /home/jenkins/tools/java/jdk1.6.0_27-32/jre/bin/java -enableassertions -Xmx1400m -jar <https://builds.apache.org/job/HBase-0.92/ws/trunk/target/surefire/surefirebooter9063289962058997999.jar> <https://builds.apache.org/job/HBase-0.92/ws/trunk/target/surefire/surefire2363995212796351839tmp> <https://builds.apache.org/job/HBase-0.92/ws/trunk/target/surefire/surefire4251201556826223787tmp>
Running org.apache.hadoop.hbase.rest.model.TestTableListModel
Tests run: 3, Failures: 0, Errors: 0, Skipped: 0, Time elapsed: 0.385 sec
Forking command line: /bin/sh -c cd <https://builds.apache.org/job/HBase-0.92/ws/trunk> && /home/jenkins/tools/java/jdk1.6.0_27-32/jre/bin/java -enableassertions -Xmx1400m -jar <https://builds.apache.org/job/HBase-0.92/ws/trunk/target/surefire/surefirebooter7876478901856943394.jar> <https://builds.apache.org/job/HBase-0.92/ws/trunk/target/surefire/surefire5698514964633277505tmp> <https://builds.apache.org/job/HBase-0.92/ws/trunk/target/surefire/surefire386623553558261235tmp>
Running org.apache.hadoop.hbase.rest.model.TestVersionModel
Tests run: 3, Failures: 0, Errors: 0, Skipped: 0, Time elapsed: 0.367 sec
Forking command line: /bin/sh -c cd <https://builds.apache.org/job/HBase-0.92/ws/trunk> && /home/jenkins/tools/java/jdk1.6.0_27-32/jre/bin/java -enableassertions -Xmx1400m -jar <https://builds.apache.org/job/HBase-0.92/ws/trunk/target/surefire/surefirebooter1036198557627686000.jar> <https://builds.apache.org/job/HBase-0.92/ws/trunk/target/surefire/surefire17490200732610329tmp> <https://builds.apache.org/job/HBase-0.92/ws/trunk/target/surefire/surefire8458961206963461185tmp>
Running org.apache.hadoop.hbase.rest.model.TestColumnSchemaModel
Tests run: 2, Failures: 0, Errors: 0, Skipped: 0, Time elapsed: 0.275 sec
Forking command line: /bin/sh -c cd <https://builds.apache.org/job/HBase-0.92/ws/trunk> && /home/jenkins/tools/java/jdk1.6.0_27-32/jre/bin/java -enableassertions -Xmx1400m -jar <https://builds.apache.org/job/HBase-0.92/ws/trunk/target/surefire/surefirebooter2748996214703303732.jar> <https://builds.apache.org/job/HBase-0.92/ws/trunk/target/surefire/surefire8827140587990341740tmp> <https://builds.apache.org/job/HBase-0.92/ws/trunk/target/surefire/surefire1453182264515835738tmp>
Running org.apache.hadoop.hbase.rest.model.TestTableInfoModel
Tests run: 3, Failures: 0, Errors: 0, Skipped: 0, Time elapsed: 0.4 sec
Forking command line: /bin/sh -c cd <https://builds.apache.org/job/HBase-0.92/ws/trunk> && /home/jenkins/tools/java/jdk1.6.0_27-32/jre/bin/java -enableassertions -Xmx1400m -jar <https://builds.apache.org/job/HBase-0.92/ws/trunk/target/surefire/surefirebooter4741361369224452809.jar> <https://builds.apache.org/job/HBase-0.92/ws/trunk/target/surefire/surefire1551557315664376928tmp> <https://builds.apache.org/job/HBase-0.92/ws/trunk/target/surefire/surefire5954589344549370921tmp>
Running org.apache.hadoop.hbase.rest.model.TestRowModel
Tests run: 2, Failures: 0, Errors: 0, Skipped: 0, Time elapsed: 0.37 sec
Forking command line: /bin/sh -c cd <https://builds.apache.org/job/HBase-0.92/ws/trunk> && /home/jenkins/tools/java/jdk1.6.0_27-32/jre/bin/java -enableassertions -Xmx1400m -jar <https://builds.apache.org/job/HBase-0.92/ws/trunk/target/surefire/surefirebooter7387045788028024748.jar> <https://builds.apache.org/job/HBase-0.92/ws/trunk/target/surefire/surefire2093406058563459094tmp> <https://builds.apache.org/job/HBase-0.92/ws/trunk/target/surefire/surefire129175226028460tmp>
Running org.apache.hadoop.hbase.rest.model.TestTableSchemaModel
Tests run: 3, Failures: 0, Errors: 0, Skipped: 0, Time elapsed: 0.405 sec
Forking command line: /bin/sh -c cd <https://builds.apache.org/job/HBase-0.92/ws/trunk> && /home/jenkins/tools/java/jdk1.6.0_27-32/jre/bin/java -enableassertions -Xmx1400m -jar <https://builds.apache.org/job/HBase-0.92/ws/trunk/target/surefire/surefirebooter8883062189749383919.jar> <https://builds.apache.org/job/HBase-0.92/ws/trunk/target/surefire/surefire6573910966568023143tmp> <https://builds.apache.org/job/HBase-0.92/ws/trunk/target/surefire/surefire4002262174532439380tmp>
Running org.apache.hadoop.hbase.rest.model.TestStorageClusterVersionModel
Tests run: 2, Failures: 0, Errors: 0, Skipped: 0, Time elapsed: 0.269 sec
Forking command line: /bin/sh -c cd <https://builds.apache.org/job/HBase-0.92/ws/trunk> && /home/jenkins/tools/java/jdk1.6.0_27-32/jre/bin/java -enableassertions -Xmx1400m -jar <https://builds.apache.org/job/HBase-0.92/ws/trunk/target/surefire/surefirebooter4164801494838883591.jar> <https://builds.apache.org/job/HBase-0.92/ws/trunk/target/surefire/surefire5533613187504227755tmp> <https://builds.apache.org/job/HBase-0.92/ws/trunk/target/surefire/surefire6703203149824321991tmp>
Running org.apache.hadoop.hbase.rest.model.TestTableRegionModel
Tests run: 4, Failures: 0, Errors: 0, Skipped: 0, Time elapsed: 0.473 sec
Forking command line: /bin/sh -c cd <https://builds.apache.org/job/HBase-0.92/ws/trunk> && /home/jenkins/tools/java/jdk1.6.0_27-32/jre/bin/java -enableassertions -Xmx1400m -jar <https://builds.apache.org/job/HBase-0.92/ws/trunk/target/surefire/surefirebooter1843883862345708857.jar> <https://builds.apache.org/job/HBase-0.92/ws/trunk/target/surefire/surefire8618379728433823786tmp> <https://builds.apache.org/job/HBase-0.92/ws/trunk/target/surefire/surefire1787617314129299819tmp>
Running org.apache.hadoop.hbase.rest.model.TestStorageClusterStatusModel
Tests run: 3, Failures: 0, Errors: 0, Skipped: 0, Time elapsed: 0.45 sec
Forking command line: /bin/sh -c cd <https://builds.apache.org/job/HBase-0.92/ws/trunk> && /home/jenkins/tools/java/jdk1.6.0_27-32/jre/bin/java -enableassertions -Xmx1400m -jar <https://builds.apache.org/job/HBase-0.92/ws/trunk/target/surefire/surefirebooter4280030520278677761.jar> <https://builds.apache.org/job/HBase-0.92/ws/trunk/target/surefire/surefire888009227990792897tmp> <https://builds.apache.org/job/HBase-0.92/ws/trunk/target/surefire/surefire4572198896801942379tmp>
Running org.apache.hadoop.hbase.rest.model.TestScannerModel
Tests run: 3, Failures: 0, Errors: 0, Skipped: 0, Time elapsed: 0.405 sec
Forking command line: /bin/sh -c cd <https://builds.apache.org/job/HBase-0.92/ws/trunk> && /home/jenkins/tools/java/jdk1.6.0_27-32/jre/bin/java -enableassertions -Xmx1400m -jar <https://builds.apache.org/job/HBase-0.92/ws/trunk/target/surefire/surefirebooter7568047045060504979.jar> <https://builds.apache.org/job/HBase-0.92/ws/trunk/target/surefire/surefire5713200283752716763tmp> <https://builds.apache.org/job/HBase-0.92/ws/trunk/target/surefire/surefire4120777093635943049tmp>
Running org.apache.hadoop.hbase.rest.client.TestRemoteAdmin
Tests run: 1, Failures: 0, Errors: 0, Skipped: 0, Time elapsed: 20.856 sec
Forking command line: /bin/sh -c cd <https://builds.apache.org/job/HBase-0.92/ws/trunk> && /home/jenkins/tools/java/jdk1.6.0_27-32/jre/bin/java -enableassertions -Xmx1400m -jar <https://builds.apache.org/job/HBase-0.92/ws/trunk/target/surefire/surefirebooter5186945309195329291.jar> <https://builds.apache.org/job/HBase-0.92/ws/trunk/target/surefire/surefire8880446884662909643tmp> <https://builds.apache.org/job/HBase-0.92/ws/trunk/target/surefire/surefire607908420400404886tmp>
Running org.apache.hadoop.hbase.rest.client.TestRemoteTable
Tests run: 3, Failures: 0, Errors: 0, Skipped: 0, Time elapsed: 15.918 sec
Forking command line: /bin/sh -c cd <https://builds.apache.org/job/HBase-0.92/ws/trunk> && /home/jenkins/tools/java/jdk1.6.0_27-32/jre/bin/java -enableassertions -Xmx1400m -jar <https://builds.apache.org/job/HBase-0.92/ws/trunk/target/surefire/surefirebooter2132148081856540751.jar> <https://builds.apache.org/job/HBase-0.92/ws/trunk/target/surefire/surefire5087748392675690362tmp> <https://builds.apache.org/job/HBase-0.92/ws/trunk/target/surefire/surefire5884993333619755827tmp>
Running org.apache.hadoop.hbase.rest.TestVersionResource
Tests run: 7, Failures: 0, Errors: 0, Skipped: 0, Time elapsed: 14.951 sec
Forking command line: /bin/sh -c cd <https://builds.apache.org/job/HBase-0.92/ws/trunk> && /home/jenkins/tools/java/jdk1.6.0_27-32/jre/bin/java -enableassertions -Xmx1400m -jar <https://builds.apache.org/job/HBase-0.92/ws/trunk/target/surefire/surefirebooter1510775074136512509.jar> <https://builds.apache.org/job/HBase-0.92/ws/trunk/target/surefire/surefire7693374073392327368tmp> <https://builds.apache.org/job/HBase-0.92/ws/trunk/target/surefire/surefire1150581003494991730tmp>
Running org.apache.hadoop.hbase.rest.TestScannerResource
Tests run: 5, Failures: 0, Errors: 0, Skipped: 0, Time elapsed: 32.045 sec
Forking command line: /bin/sh -c cd <https://builds.apache.org/job/HBase-0.92/ws/trunk> && /home/jenkins/tools/java/jdk1.6.0_27-32/jre/bin/java -enableassertions -Xmx1400m -jar <https://builds.apache.org/job/HBase-0.92/ws/trunk/target/surefire/surefirebooter7129903507612129774.jar> <https://builds.apache.org/job/HBase-0.92/ws/trunk/target/surefire/surefire6526585827879003479tmp> <https://builds.apache.org/job/HBase-0.92/ws/trunk/target/surefire/surefire7278487290642627834tmp>
Running org.apache.hadoop.hbase.rest.TestTransform
Tests run: 1, Failures: 0, Errors: 0, Skipped: 0, Time elapsed: 15.598 sec
Forking command line: /bin/sh -c cd <https://builds.apache.org/job/HBase-0.92/ws/trunk> && /home/jenkins/tools/java/jdk1.6.0_27-32/jre/bin/java -enableassertions -Xmx1400m -jar <https://builds.apache.org/job/HBase-0.92/ws/trunk/target/surefire/surefirebooter6049610046769572642.jar> <https://builds.apache.org/job/HBase-0.92/ws/trunk/target/surefire/surefire8784970827025730127tmp> <https://builds.apache.org/job/HBase-0.92/ws/trunk/target/surefire/surefire575042760311522484tmp>
Running org.apache.hadoop.hbase.rest.TestTableResource
Tests run: 8, Failures: 0, Errors: 0, Skipped: 0, Time elapsed: 23.194 sec
Forking command line: /bin/sh -c cd <https://builds.apache.org/job/HBase-0.92/ws/trunk> && /home/jenkins/tools/java/jdk1.6.0_27-32/jre/bin/java -enableassertions -Xmx1400m -jar <https://builds.apache.org/job/HBase-0.92/ws/trunk/target/surefire/surefirebooter9009572573184397820.jar> <https://builds.apache.org/job/HBase-0.92/ws/trunk/target/surefire/surefire3239008450483723046tmp> <https://builds.apache.org/job/HBase-0.92/ws/trunk/target/surefire/surefire1961290992597978586tmp>
Running org.apache.hadoop.hbase.rest.TestStatusResource
Tests run: 2, Failures: 0, Errors: 0, Skipped: 0, Time elapsed: 13.068 sec
Forking command line: /bin/sh -c cd <https://builds.apache.org/job/HBase-0.92/ws/trunk> && /home/jenkins/tools/java/jdk1.6.0_27-32/jre/bin/java -enableassertions -Xmx1400m -jar <https://builds.apache.org/job/HBase-0.92/ws/trunk/target/surefire/surefirebooter5478871828947824372.jar> <https://builds.apache.org/job/HBase-0.92/ws/trunk/target/surefire/surefire4703469607466139997tmp> <https://builds.apache.org/job/HBase-0.92/ws/trunk/target/surefire/surefire4424604348816674849tmp>
Running org.apache.hadoop.hbase.rest.TestSchemaResource
Tests run: 2, Failures: 0, Errors: 0, Skipped: 0, Time elapsed: 21.977 sec
Forking command line: /bin/sh -c cd <https://builds.apache.org/job/HBase-0.92/ws/trunk> && /home/jenkins/tools/java/jdk1.6.0_27-32/jre/bin/java -enableassertions -Xmx1400m -jar <https://builds.apache.org/job/HBase-0.92/ws/trunk/target/surefire/surefirebooter4687972381924743122.jar> <https://builds.apache.org/job/HBase-0.92/ws/trunk/target/surefire/surefire880995395991081156tmp> <https://builds.apache.org/job/HBase-0.92/ws/trunk/target/surefire/surefire6655161223840720137tmp>
Running org.apache.hadoop.hbase.thrift.TestThriftServer
Tests run: 1, Failures: 0, Errors: 0, Skipped: 0, Time elapsed: 19.614 sec
Forking command line: /bin/sh -c cd <https://builds.apache.org/job/HBase-0.92/ws/trunk> && /home/jenkins/tools/java/jdk1.6.0_27-32/jre/bin/java -enableassertions -Xmx1400m -jar <https://builds.apache.org/job/HBase-0.92/ws/trunk/target/surefire/surefirebooter6650611744588709489.jar> <https://builds.apache.org/job/HBase-0.92/ws/trunk/target/surefire/surefire1703920566499949673tmp> <https://builds.apache.org/job/HBase-0.92/ws/trunk/target/surefire/surefire9035370473008406998tmp>
Running org.apache.hadoop.hbase.io.TestHeapSize
Tests run: 2, Failures: 0, Errors: 0, Skipped: 0, Time elapsed: 0.156 sec
Forking command line: /bin/sh -c cd <https://builds.apache.org/job/HBase-0.92/ws/trunk> && /home/jenkins/tools/java/jdk1.6.0_27-32/jre/bin/java -enableassertions -Xmx1400m -jar <https://builds.apache.org/job/HBase-0.92/ws/trunk/target/surefire/surefirebooter833341675545813470.jar> <https://builds.apache.org/job/HBase-0.92/ws/trunk/target/surefire/surefire7525796987920817740tmp> <https://builds.apache.org/job/HBase-0.92/ws/trunk/target/surefire/surefire7544268769664240678tmp>
Running org.apache.hadoop.hbase.io.hfile.TestHFileSeek
Tests run: 1, Failures: 0, Errors: 0, Skipped: 0, Time elapsed: 5.665 sec
Forking command line: /bin/sh -c cd <https://builds.apache.org/job/HBase-0.92/ws/trunk> && /home/jenkins/tools/java/jdk1.6.0_27-32/jre/bin/java -enableassertions -Xmx1400m -jar <https://builds.apache.org/job/HBase-0.92/ws/trunk/target/surefire/surefirebooter5445977449358087584.jar> <https://builds.apache.org/job/HBase-0.92/ws/trunk/target/surefire/surefire8831039517031246344tmp> <https://builds.apache.org/job/HBase-0.92/ws/trunk/target/surefire/surefire4845403608107171942tmp>
Running org.apache.hadoop.hbase.io.hfile.slab.TestSlab
Tests run: 1, Failures: 0, Errors: 0, Skipped: 0, Time elapsed: 0.143 sec
Forking command line: /bin/sh -c cd <https://builds.apache.org/job/HBase-0.92/ws/trunk> && /home/jenkins/tools/java/jdk1.6.0_27-32/jre/bin/java -enableassertions -Xmx1400m -jar <https://builds.apache.org/job/HBase-0.92/ws/trunk/target/surefire/surefirebooter2232929433645964487.jar> <https://builds.apache.org/job/HBase-0.92/ws/trunk/target/surefire/surefire3777183911982010595tmp> <https://builds.apache.org/job/HBase-0.92/ws/trunk/target/surefire/surefire8729187530020971894tmp>
Running org.apache.hadoop.hbase.io.hfile.slab.TestSlabCache
Tests run: 7, Failures: 0, Errors: 0, Skipped: 0, Time elapsed: 19.152 sec
Forking command line: /bin/sh -c cd <https://builds.apache.org/job/HBase-0.92/ws/trunk> && /home/jenkins/tools/java/jdk1.6.0_27-32/jre/bin/java -enableassertions -Xmx1400m -jar <https://builds.apache.org/job/HBase-0.92/ws/trunk/target/surefire/surefirebooter2129092287406891001.jar> <https://builds.apache.org/job/HBase-0.92/ws/trunk/target/surefire/surefire2317899279495369794tmp> <https://builds.apache.org/job/HBase-0.92/ws/trunk/target/surefire/surefire7106257032081132917tmp>
Running org.apache.hadoop.hbase.io.hfile.slab.TestSingleSizeCache
Tests run: 5, Failures: 0, Errors: 0, Skipped: 0, Time elapsed: 23.98 sec
Forking command line: /bin/sh -c cd <https://builds.apache.org/job/HBase-0.92/ws/trunk> && /home/jenkins/tools/java/jdk1.6.0_27-32/jre/bin/java -enableassertions -Xmx1400m -jar <https://builds.apache.org/job/HBase-0.92/ws/trunk/target/surefire/surefirebooter8410739516591612474.jar> <https://builds.apache.org/job/HBase-0.92/ws/trunk/target/surefire/surefire1243915517420989804tmp> <https://builds.apache.org/job/HBase-0.92/ws/trunk/target/surefire/surefire8212149724813383486tmp>
Running org.apache.hadoop.hbase.io.hfile.TestCachedBlockQueue
Tests run: 2, Failures: 0, Errors: 0, Skipped: 0, Time elapsed: 0.103 sec
Forking command line: /bin/sh -c cd <https://builds.apache.org/job/HBase-0.92/ws/trunk> && /home/jenkins/tools/java/jdk1.6.0_27-32/jre/bin/java -enableassertions -Xmx1400m -jar <https://builds.apache.org/job/HBase-0.92/ws/trunk/target/surefire/surefirebooter8240118686392468710.jar> <https://builds.apache.org/job/HBase-0.92/ws/trunk/target/surefire/surefire3841934673317566782tmp> <https://builds.apache.org/job/HBase-0.92/ws/trunk/target/surefire/surefire5601223026151373090tmp>
Running org.apache.hadoop.hbase.io.hfile.TestHFileBlockIndex
Tests run: 10, Failures: 0, Errors: 0, Skipped: 0, Time elapsed: 10.363 sec
Forking command line: /bin/sh -c cd <https://builds.apache.org/job/HBase-0.92/ws/trunk> && /home/jenkins/tools/java/jdk1.6.0_27-32/jre/bin/java -enableassertions -Xmx1400m -jar <https://builds.apache.org/job/HBase-0.92/ws/trunk/target/surefire/surefirebooter984785154361758981.jar> <https://builds.apache.org/job/HBase-0.92/ws/trunk/target/surefire/surefire1634609630503618453tmp> <https://builds.apache.org/job/HBase-0.92/ws/trunk/target/surefire/surefire7354760756373533872tmp>
Running org.apache.hadoop.hbase.io.hfile.TestLruBlockCache
Tests run: 7, Failures: 0, Errors: 0, Skipped: 0, Time elapsed: 0.359 sec
Forking command line: /bin/sh -c cd <https://builds.apache.org/job/HBase-0.92/ws/trunk> && /home/jenkins/tools/java/jdk1.6.0_27-32/jre/bin/java -enableassertions -Xmx1400m -jar <https://builds.apache.org/job/HBase-0.92/ws/trunk/target/surefire/surefirebooter6571013623739747064.jar> <https://builds.apache.org/job/HBase-0.92/ws/trunk/target/surefire/surefire6159513231851457187tmp> <https://builds.apache.org/job/HBase-0.92/ws/trunk/target/surefire/surefire5313011607560189083tmp>
Running org.apache.hadoop.hbase.io.hfile.TestHFilePerformance
Tests run: 1, Failures: 0, Errors: 0, Skipped: 0, Time elapsed: 5.834 sec
Forking command line: /bin/sh -c cd <https://builds.apache.org/job/HBase-0.92/ws/trunk> && /home/jenkins/tools/java/jdk1.6.0_27-32/jre/bin/java -enableassertions -Xmx1400m -jar <https://builds.apache.org/job/HBase-0.92/ws/trunk/target/surefire/surefirebooter6496249598449413121.jar> <https://builds.apache.org/job/HBase-0.92/ws/trunk/target/surefire/surefire1755217138201459356tmp> <https://builds.apache.org/job/HBase-0.92/ws/trunk/target/surefire/surefire7770273704244505102tmp>
Running org.apache.hadoop.hbase.io.hfile.TestFixedFileTrailer
Tests run: 2, Failures: 0, Errors: 0, Skipped: 0, Time elapsed: 0.56 sec
Forking command line: /bin/sh -c cd <https://builds.apache.org/job/HBase-0.92/ws/trunk> && /home/jenkins/tools/java/jdk1.6.0_27-32/jre/bin/java -enableassertions -Xmx1400m -jar <https://builds.apache.org/job/HBase-0.92/ws/trunk/target/surefire/surefirebooter4349070878787513276.jar> <https://builds.apache.org/job/HBase-0.92/ws/trunk/target/surefire/surefire7826032628550927972tmp> <https://builds.apache.org/job/HBase-0.92/ws/trunk/target/surefire/surefire3021396299698397879tmp>
Running org.apache.hadoop.hbase.io.hfile.TestHFileWriterV2
Tests run: 1, Failures: 0, Errors: 0, Skipped: 0, Time elapsed: 0.947 sec
Forking command line: /bin/sh -c cd <https://builds.apache.org/job/HBase-0.92/ws/trunk> && /home/jenkins/tools/java/jdk1.6.0_27-32/jre/bin/java -enableassertions -Xmx1400m -jar <https://builds.apache.org/job/HBase-0.92/ws/trunk/target/surefire/surefirebooter8773328884854997010.jar> <https://builds.apache.org/job/HBase-0.92/ws/trunk/target/surefire/surefire1751141281096842364tmp> <https://builds.apache.org/job/HBase-0.92/ws/trunk/target/surefire/surefire3936003391383955696tmp>
Running org.apache.hadoop.hbase.io.hfile.TestBlockCacheColumnFamilySummary
Tests run: 4, Failures: 0, Errors: 0, Skipped: 0, Time elapsed: 0.056 sec
Forking command line: /bin/sh -c cd <https://builds.apache.org/job/HBase-0.92/ws/trunk> && /home/jenkins/tools/java/jdk1.6.0_27-32/jre/bin/java -enableassertions -Xmx1400m -jar <https://builds.apache.org/job/HBase-0.92/ws/trunk/target/surefire/surefirebooter3112981665335730797.jar> <https://builds.apache.org/job/HBase-0.92/ws/trunk/target/surefire/surefire381820600880756672tmp> <https://builds.apache.org/job/HBase-0.92/ws/trunk/target/surefire/surefire4027817084284327569tmp>
Running org.apache.hadoop.hbase.io.hfile.TestHFileReaderV1
Tests run: 1, Failures: 0, Errors: 0, Skipped: 0, Time elapsed: 0.595 sec
Forking command line: /bin/sh -c cd <https://builds.apache.org/job/HBase-0.92/ws/trunk> && /home/jenkins/tools/java/jdk1.6.0_27-32/jre/bin/java -enableassertions -Xmx1400m -jar <https://builds.apache.org/job/HBase-0.92/ws/trunk/target/surefire/surefirebooter4937848370099025152.jar> <https://builds.apache.org/job/HBase-0.92/ws/trunk/target/surefire/surefire4185525692307977922tmp> <https://builds.apache.org/job/HBase-0.92/ws/trunk/target/surefire/surefire5641955880092051646tmp>
Running org.apache.hadoop.hbase.io.hfile.TestHFile
Tests run: 6, Failures: 0, Errors: 0, Skipped: 0, Time elapsed: 0.892 sec
Forking command line: /bin/sh -c cd <https://builds.apache.org/job/HBase-0.92/ws/trunk> && /home/jenkins/tools/java/jdk1.6.0_27-32/jre/bin/java -enableassertions -Xmx1400m -jar <https://builds.apache.org/job/HBase-0.92/ws/trunk/target/surefire/surefirebooter4235144002335665589.jar> <https://builds.apache.org/job/HBase-0.92/ws/trunk/target/surefire/surefire2122161583215863837tmp> <https://builds.apache.org/job/HBase-0.92/ws/trunk/target/surefire/surefire1241180335724624327tmp>
Running org.apache.hadoop.hbase.io.hfile.TestReseekTo
Tests run: 1, Failures: 0, Errors: 0, Skipped: 0, Time elapsed: 0.642 sec
Forking command line: /bin/sh -c cd <https://builds.apache.org/job/HBase-0.92/ws/trunk> && /home/jenkins/tools/java/jdk1.6.0_27-32/jre/bin/java -enableassertions -Xmx1400m -jar <https://builds.apache.org/job/HBase-0.92/ws/trunk/target/surefire/surefirebooter1805693901249325103.jar> <https://builds.apache.org/job/HBase-0.92/ws/trunk/target/surefire/surefire5451713406769642246tmp> <https://builds.apache.org/job/HBase-0.92/ws/trunk/target/surefire/surefire4940445626571110725tmp>
Running org.apache.hadoop.hbase.io.hfile.TestHFileBlock
Tests run: 7, Failures: 0, Errors: 0, Skipped: 0, Time elapsed: 25.417 sec
Forking command line: /bin/sh -c cd <https://builds.apache.org/job/HBase-0.92/ws/trunk> && /home/jenkins/tools/java/jdk1.6.0_27-32/jre/bin/java -enableassertions -Xmx1400m -jar <https://builds.apache.org/job/HBase-0.92/ws/trunk/target/surefire/surefirebooter2901044147341484113.jar> <https://builds.apache.org/job/HBase-0.92/ws/trunk/target/surefire/surefire5102156582720829736tmp> <https://builds.apache.org/job/HBase-0.92/ws/trunk/target/surefire/surefire4669970704949282090tmp>
Running org.apache.hadoop.hbase.io.hfile.TestSeekTo
Tests run: 3, Failures: 0, Errors: 0, Skipped: 0, Time elapsed: 0.667 sec
Forking command line: /bin/sh -c cd <https://builds.apache.org/job/HBase-0.92/ws/trunk> && /home/jenkins/tools/java/jdk1.6.0_27-32/jre/bin/java -enableassertions -Xmx1400m -jar <https://builds.apache.org/job/HBase-0.92/ws/trunk/target/surefire/surefirebooter3784254462803718217.jar> <https://builds.apache.org/job/HBase-0.92/ws/trunk/target/surefire/surefire8681713748566627395tmp> <https://builds.apache.org/job/HBase-0.92/ws/trunk/target/surefire/surefire4170694666807822224tmp>
Running org.apache.hadoop.hbase.io.hfile.TestCacheOnWrite
Tests run: 6, Failures: 0, Errors: 0, Skipped: 0, Time elapsed: 7.455 sec
Forking command line: /bin/sh -c cd <https://builds.apache.org/job/HBase-0.92/ws/trunk> && /home/jenkins/tools/java/jdk1.6.0_27-32/jre/bin/java -enableassertions -Xmx1400m -jar <https://builds.apache.org/job/HBase-0.92/ws/trunk/target/surefire/surefirebooter2436091508027408280.jar> <https://builds.apache.org/job/HBase-0.92/ws/trunk/target/surefire/surefire6724335974722553168tmp> <https://builds.apache.org/job/HBase-0.92/ws/trunk/target/surefire/surefire2389469399146850299tmp>
Running org.apache.hadoop.hbase.io.TestHbaseObjectWritable
Tests run: 4, Failures: 0, Errors: 0, Skipped: 0, Time elapsed: 0.466 sec
Forking command line: /bin/sh -c cd <https://builds.apache.org/job/HBase-0.92/ws/trunk> && /home/jenkins/tools/java/jdk1.6.0_27-32/jre/bin/java -enableassertions -Xmx1400m -jar <https://builds.apache.org/job/HBase-0.92/ws/trunk/target/surefire/surefirebooter7757786585063111385.jar> <https://builds.apache.org/job/HBase-0.92/ws/trunk/target/surefire/surefire8653044183989591261tmp> <https://builds.apache.org/job/HBase-0.92/ws/trunk/target/surefire/surefire6697181719381131958tmp>
Running org.apache.hadoop.hbase.io.TestImmutableBytesWritable
Tests run: 3, Failures: 0, Errors: 0, Skipped: 0, Time elapsed: 0.109 sec
Forking command line: /bin/sh -c cd <https://builds.apache.org/job/HBase-0.92/ws/trunk> && /home/jenkins/tools/java/jdk1.6.0_27-32/jre/bin/java -enableassertions -Xmx1400m -jar <https://builds.apache.org/job/HBase-0.92/ws/trunk/target/surefire/surefirebooter8337824147017938391.jar> <https://builds.apache.org/job/HBase-0.92/ws/trunk/target/surefire/surefire7952158614817900228tmp> <https://builds.apache.org/job/HBase-0.92/ws/trunk/target/surefire/surefire7807230819350423977tmp>
Running org.apache.hadoop.hbase.io.TestHalfStoreFileReader
Tests run: 1, Failures: 0, Errors: 0, Skipped: 0, Time elapsed: 0.681 sec
Forking command line: /bin/sh -c cd <https://builds.apache.org/job/HBase-0.92/ws/trunk> && /home/jenkins/tools/java/jdk1.6.0_27-32/jre/bin/java -enableassertions -Xmx1400m -jar <https://builds.apache.org/job/HBase-0.92/ws/trunk/target/surefire/surefirebooter9113225436613105436.jar> <https://builds.apache.org/job/HBase-0.92/ws/trunk/target/surefire/surefire7776313658616459872tmp> <https://builds.apache.org/job/HBase-0.92/ws/trunk/target/surefire/surefire3998118920016863994tmp>
Running org.apache.hadoop.hbase.migration.TestMigrationFrom090To092
Tests run: 1, Failures: 0, Errors: 0, Skipped: 0, Time elapsed: 0.27 sec
Forking command line: /bin/sh -c cd <https://builds.apache.org/job/HBase-0.92/ws/trunk> && /home/jenkins/tools/java/jdk1.6.0_27-32/jre/bin/java -enableassertions -Xmx1400m -jar <https://builds.apache.org/job/HBase-0.92/ws/trunk/target/surefire/surefirebooter757312845287774171.jar> <https://builds.apache.org/job/HBase-0.92/ws/trunk/target/surefire/surefire726519096255796789tmp> <https://builds.apache.org/job/HBase-0.92/ws/trunk/target/surefire/surefire4331204711855591653tmp>
Running org.apache.hadoop.hbase.TestFSTableDescriptorForceCreation
Tests run: 3, Failures: 0, Errors: 0, Skipped: 0, Time elapsed: 0.52 sec
Forking command line: /bin/sh -c cd <https://builds.apache.org/job/HBase-0.92/ws/trunk> && /home/jenkins/tools/java/jdk1.6.0_27-32/jre/bin/java -enableassertions -Xmx1400m -jar <https://builds.apache.org/job/HBase-0.92/ws/trunk/target/surefire/surefirebooter5680082700406364217.jar> <https://builds.apache.org/job/HBase-0.92/ws/trunk/target/surefire/surefire7560169781500660684tmp> <https://builds.apache.org/job/HBase-0.92/ws/trunk/target/surefire/surefire2500827522907442824tmp>
Running org.apache.hadoop.hbase.avro.TestAvroUtil
Tests run: 1, Failures: 0, Errors: 0, Skipped: 0, Time elapsed: 0.627 sec
Forking command line: /bin/sh -c cd <https://builds.apache.org/job/HBase-0.92/ws/trunk> && /home/jenkins/tools/java/jdk1.6.0_27-32/jre/bin/java -enableassertions -Xmx1400m -jar <https://builds.apache.org/job/HBase-0.92/ws/trunk/target/surefire/surefirebooter1247171089922136137.jar> <https://builds.apache.org/job/HBase-0.92/ws/trunk/target/surefire/surefire410315446002975004tmp> <https://builds.apache.org/job/HBase-0.92/ws/trunk/target/surefire/surefire4570260762069961564tmp>
Running org.apache.hadoop.hbase.avro.TestAvroServer
Tests run: 3, Failures: 0, Errors: 0, Skipped: 0, Time elapsed: 29.564 sec
Forking command line: /bin/sh -c cd <https://builds.apache.org/job/HBase-0.92/ws/trunk> && /home/jenkins/tools/java/jdk1.6.0_27-32/jre/bin/java -enableassertions -Xmx1400m -jar <https://builds.apache.org/job/HBase-0.92/ws/trunk/target/surefire/surefirebooter8513506428737261490.jar> <https://builds.apache.org/job/HBase-0.92/ws/trunk/target/surefire/surefire2523930408154784244tmp> <https://builds.apache.org/job/HBase-0.92/ws/trunk/target/surefire/surefire8026757138226581874tmp>
Running org.apache.hadoop.hbase.TestKeyValue
Tests run: 11, Failures: 0, Errors: 0, Skipped: 0, Time elapsed: 0.13 sec
Forking command line: /bin/sh -c cd <https://builds.apache.org/job/HBase-0.92/ws/trunk> && /home/jenkins/tools/java/jdk1.6.0_27-32/jre/bin/java -enableassertions -Xmx1400m -jar <https://builds.apache.org/job/HBase-0.92/ws/trunk/target/surefire/surefirebooter3172465975251401931.jar> <https://builds.apache.org/job/HBase-0.92/ws/trunk/target/surefire/surefire6146071687432581816tmp> <https://builds.apache.org/job/HBase-0.92/ws/trunk/target/surefire/surefire698097037158682025tmp>
Running org.apache.hadoop.hbase.replication.TestMultiSlaveReplication
Tests run: 1, Failures: 0, Errors: 0, Skipped: 0, Time elapsed: 48.464 sec
Forking command line: /bin/sh -c cd <https://builds.apache.org/job/HBase-0.92/ws/trunk> && /home/jenkins/tools/java/jdk1.6.0_27-32/jre/bin/java -enableassertions -Xmx1400m -jar <https://builds.apache.org/job/HBase-0.92/ws/trunk/target/surefire/surefirebooter7732595705874583936.jar> <https://builds.apache.org/job/HBase-0.92/ws/trunk/target/surefire/surefire5194138815312365678tmp> <https://builds.apache.org/job/HBase-0.92/ws/trunk/target/surefire/surefire807664780808849686tmp>
Running org.apache.hadoop.hbase.replication.regionserver.TestReplicationSourceManager
Tests run: 1, Failures: 0, Errors: 0, Skipped: 0, Time elapsed: 0.955 sec
Forking command line: /bin/sh -c cd <https://builds.apache.org/job/HBase-0.92/ws/trunk> && /home/jenkins/tools/java/jdk1.6.0_27-32/jre/bin/java -enableassertions -Xmx1400m -jar <https://builds.apache.org/job/HBase-0.92/ws/trunk/target/surefire/surefirebooter7874600554512640537.jar> <https://builds.apache.org/job/HBase-0.92/ws/trunk/target/surefire/surefire1760003646896823381tmp> <https://builds.apache.org/job/HBase-0.92/ws/trunk/target/surefire/surefire8174892128618175572tmp>
Running org.apache.hadoop.hbase.replication.regionserver.TestReplicationSink
Tests run: 5, Failures: 0, Errors: 0, Skipped: 0, Time elapsed: 18.176 sec
Forking command line: /bin/sh -c cd <https://builds.apache.org/job/HBase-0.92/ws/trunk> && /home/jenkins/tools/java/jdk1.6.0_27-32/jre/bin/java -enableassertions -Xmx1400m -jar <https://builds.apache.org/job/HBase-0.92/ws/trunk/target/surefire/surefirebooter6765846556064445916.jar> <https://builds.apache.org/job/HBase-0.92/ws/trunk/target/surefire/surefire1243973045661867749tmp> <https://builds.apache.org/job/HBase-0.92/ws/trunk/target/surefire/surefire3982382414949479908tmp>
Running org.apache.hadoop.hbase.replication.TestMasterReplication
Tests run: 2, Failures: 0, Errors: 0, Skipped: 0, Time elapsed: 75.507 sec
Forking command line: /bin/sh -c cd <https://builds.apache.org/job/HBase-0.92/ws/trunk> && /home/jenkins/tools/java/jdk1.6.0_27-32/jre/bin/java -enableassertions -Xmx1400m -jar <https://builds.apache.org/job/HBase-0.92/ws/trunk/target/surefire/surefirebooter8500087345283133550.jar> <https://builds.apache.org/job/HBase-0.92/ws/trunk/target/surefire/surefire8012446628016762130tmp> <https://builds.apache.org/job/HBase-0.92/ws/trunk/target/surefire/surefire1716359273453874994tmp>
Running org.apache.hadoop.hbase.replication.TestReplicationSource
Tests run: 1, Failures: 0, Errors: 0, Skipped: 0, Time elapsed: 5.126 sec
Forking command line: /bin/sh -c cd <https://builds.apache.org/job/HBase-0.92/ws/trunk> && /home/jenkins/tools/java/jdk1.6.0_27-32/jre/bin/java -enableassertions -Xmx1400m -jar <https://builds.apache.org/job/HBase-0.92/ws/trunk/target/surefire/surefirebooter312960260872091102.jar> <https://builds.apache.org/job/HBase-0.92/ws/trunk/target/surefire/surefire4906100638054176878tmp> <https://builds.apache.org/job/HBase-0.92/ws/trunk/target/surefire/surefire9040587363855841490tmp>
Running org.apache.hadoop.hbase.replication.TestReplicationPeer
Tests run: 1, Failures: 0, Errors: 0, Skipped: 0, Time elapsed: 25.52 sec
Forking command line: /bin/sh -c cd <https://builds.apache.org/job/HBase-0.92/ws/trunk> && /home/jenkins/tools/java/jdk1.6.0_27-32/jre/bin/java -enableassertions -Xmx1400m -jar <https://builds.apache.org/job/HBase-0.92/ws/trunk/target/surefire/surefirebooter3119549443969637418.jar> <https://builds.apache.org/job/HBase-0.92/ws/trunk/target/surefire/surefire8956379322421838648tmp> <https://builds.apache.org/job/HBase-0.92/ws/trunk/target/surefire/surefire4364881172367268840tmp>
Running org.apache.hadoop.hbase.replication.TestReplication
Tests run: 7, Failures: 0, Errors: 0, Skipped: 0, Time elapsed: 168.87 sec
Forking command line: /bin/sh -c cd <https://builds.apache.org/job/HBase-0.92/ws/trunk> && /home/jenkins/tools/java/jdk1.6.0_27-32/jre/bin/java -enableassertions -Xmx1400m -jar <https://builds.apache.org/job/HBase-0.92/ws/trunk/target/surefire/surefirebooter1844434442059013743.jar> <https://builds.apache.org/job/HBase-0.92/ws/trunk/target/surefire/surefire4915313321776958341tmp> <https://builds.apache.org/job/HBase-0.92/ws/trunk/target/surefire/surefire4913054505284520425tmp>
Running org.apache.hadoop.hbase.ipc.TestDelayedRpc
Tests run: 4, Failures: 0, Errors: 0, Skipped: 0, Time elapsed: 2.518 sec
Forking command line: /bin/sh -c cd <https://builds.apache.org/job/HBase-0.92/ws/trunk> && /home/jenkins/tools/java/jdk1.6.0_27-32/jre/bin/java -enableassertions -Xmx1400m -jar <https://builds.apache.org/job/HBase-0.92/ws/trunk/target/surefire/surefirebooter5538314688505386694.jar> <https://builds.apache.org/job/HBase-0.92/ws/trunk/target/surefire/surefire531252195912555003tmp> <https://builds.apache.org/job/HBase-0.92/ws/trunk/target/surefire/surefire7569990819717722433tmp>
Running org.apache.hadoop.hbase.TestCompare
Tests run: 1, Failures: 0, Errors: 0, Skipped: 0, Time elapsed: 0.239 sec
Forking command line: /bin/sh -c cd <https://builds.apache.org/job/HBase-0.92/ws/trunk> && /home/jenkins/tools/java/jdk1.6.0_27-32/jre/bin/java -enableassertions -Xmx1400m -jar <https://builds.apache.org/job/HBase-0.92/ws/trunk/target/surefire/surefirebooter202834110056816187.jar> <https://builds.apache.org/job/HBase-0.92/ws/trunk/target/surefire/surefire4894381499940148601tmp> <https://builds.apache.org/job/HBase-0.92/ws/trunk/target/surefire/surefire6823728801936131483tmp>
Running org.apache.hadoop.hbase.TestZooKeeper
Tests run: 7, Failures: 0, Errors: 0, Skipped: 0, Time elapsed: 82.108 sec
Forking command line: /bin/sh -c cd <https://builds.apache.org/job/HBase-0.92/ws/trunk> && /home/jenkins/tools/java/jdk1.6.0_27-32/jre/bin/java -enableassertions -Xmx1400m -jar <https://builds.apache.org/job/HBase-0.92/ws/trunk/target/surefire/surefirebooter5672443856141065884.jar> <https://builds.apache.org/job/HBase-0.92/ws/trunk/target/surefire/surefire4647481998753135982tmp> <https://builds.apache.org/job/HBase-0.92/ws/trunk/target/surefire/surefire7927276995879570553tmp>
Running org.apache.hadoop.hbase.TestHBaseTestingUtility
Tests run: 7, Failures: 0, Errors: 0, Skipped: 0, Time elapsed: 77.127 sec
Results :
Failed tests: testWorkerAbort(org.apache.hadoop.hbase.master.TestDistributedLogSplitting): expected:<1> but was:<0>
Tests run: 1046, Failures: 1, Errors: 0, Skipped: 10
[INFO] ------------------------------------------------------------------------
[INFO] BUILD FAILURE
[INFO] ------------------------------------------------------------------------
[INFO] Total time: 1:40:11.954s
[INFO] Finished at: Fri Nov 04 04:35:51 UTC 2011
[INFO] Final Memory: 37M/805M
[INFO] ------------------------------------------------------------------------
[ERROR] Failed to execute goal org.apache.maven.plugins:maven-surefire-plugin:2.9:test (default-test) on project hbase: There are test failures.
[ERROR]
[ERROR] Please refer to <https://builds.apache.org/job/HBase-0.92/ws/trunk/target/surefire-reports> for the individual test results.
[ERROR] -> [Help 1]
org.apache.maven.lifecycle.LifecycleExecutionException: Failed to execute goal org.apache.maven.plugins:maven-surefire-plugin:2.9:test (default-test) on project hbase: There are test failures.
Please refer to <https://builds.apache.org/job/HBase-0.92/ws/trunk/target/surefire-reports> for the individual test results.
at org.apache.maven.lifecycle.internal.MojoExecutor.execute(MojoExecutor.java:213)
at org.apache.maven.lifecycle.internal.MojoExecutor.execute(MojoExecutor.java:153)
at org.apache.maven.lifecycle.internal.MojoExecutor.execute(MojoExecutor.java:145)
at org.apache.maven.lifecycle.internal.MojoExecutor.executeForkedExecutions(MojoExecutor.java:365)
at org.apache.maven.lifecycle.internal.MojoExecutor.execute(MojoExecutor.java:199)
at org.apache.maven.lifecycle.internal.MojoExecutor.execute(MojoExecutor.java:153)
at org.apache.maven.lifecycle.internal.MojoExecutor.execute(MojoExecutor.java:145)
at org.apache.maven.lifecycle.internal.LifecycleModuleBuilder.buildProject(LifecycleModuleBuilder.java:84)
at org.apache.maven.lifecycle.internal.LifecycleModuleBuilder.buildProject(LifecycleModuleBuilder.java:59)
at org.apache.maven.lifecycle.internal.LifecycleStarter.singleThreadedBuild(LifecycleStarter.java:183)
at org.apache.maven.lifecycle.internal.LifecycleStarter.execute(LifecycleStarter.java:161)
at org.apache.maven.DefaultMaven.doExecute(DefaultMaven.java:319)
at org.apache.maven.DefaultMaven.execute(DefaultMaven.java:156)
at org.apache.maven.cli.MavenCli.execute(MavenCli.java:537)
at org.apache.maven.cli.MavenCli.doMain(MavenCli.java:196)
at org.apache.maven.cli.MavenCli.main(MavenCli.java:141)
at sun.reflect.NativeMethodAccessorImpl.invoke0(Native Method)
at sun.reflect.NativeMethodAccessorImpl.invoke(NativeMethodAccessorImpl.java:39)
at sun.reflect.DelegatingMethodAccessorImpl.invoke(DelegatingMethodAccessorImpl.java:25)
at java.lang.reflect.Method.invoke(Method.java:597)
at org.codehaus.plexus.classworlds.launcher.Launcher.launchEnhanced(Launcher.java:290)
at org.codehaus.plexus.classworlds.launcher.Launcher.launch(Launcher.java:230)
at org.codehaus.plexus.classworlds.launcher.Launcher.mainWithExitCode(Launcher.java:409)
at org.codehaus.plexus.classworlds.launcher.Launcher.main(Launcher.java:352)
Caused by: org.apache.maven.plugin.MojoFailureException: There are test failures.
Please refer to <https://builds.apache.org/job/HBase-0.92/ws/trunk/target/surefire-reports> for the individual test results.
at org.apache.maven.plugin.surefire.SurefireHelper.reportExecution(SurefireHelper.java:87)
at org.apache.maven.plugin.surefire.SurefirePlugin.writeSummary(SurefirePlugin.java:631)
at org.apache.maven.plugin.surefire.SurefirePlugin.handleSummary(SurefirePlugin.java:605)
at org.apache.maven.plugin.surefire.AbstractSurefireMojo.executeAfterPreconditionsChecked(AbstractSurefireMojo.java:136)
at org.apache.maven.plugin.surefire.AbstractSurefireMojo.execute(AbstractSurefireMojo.java:97)
at org.apache.maven.plugin.DefaultBuildPluginManager.executeMojo(DefaultBuildPluginManager.java:101)
at org.apache.maven.lifecycle.internal.MojoExecutor.execute(MojoExecutor.java:209)
... 23 more
[ERROR]
[ERROR]
[ERROR] For more information about the errors and possible solutions, please read the following articles:
[ERROR] [Help 1] http://cwiki.apache.org/confluence/display/MAVEN/MojoFailureException
Build step 'Invoke top-level Maven targets' marked build as failure
[locks-and-latches] Releasing all the locks
[locks-and-latches] All the locks released
Archiving artifacts
Recording test results
Error updating JIRA issues. Saving issues for next build.
(503)Service Temporarily Unavailable
Build failed in Jenkins: HBase-0.92 #111
Posted by Apache Jenkins Server <je...@builds.apache.org>.
See <https://builds.apache.org/job/HBase-0.92/111/changes>
Changes:
[apurtell] HBASE-4745 LRU statistics thread should be daemon
------------------------------------------
[...truncated 6422 lines...]
Running org.apache.hadoop.hbase.regionserver.TestMasterAddressManager
Tests run: 1, Failures: 0, Errors: 0, Skipped: 0, Time elapsed: 0.525 sec
Forking command line: /bin/sh -c cd <https://builds.apache.org/job/HBase-0.92/ws/trunk> && /home/jenkins/tools/java/jdk1.6.0_27-32/jre/bin/java -enableassertions -Xmx1400m -jar <https://builds.apache.org/job/HBase-0.92/ws/trunk/target/surefire/surefirebooter844292910974290194.jar> <https://builds.apache.org/job/HBase-0.92/ws/trunk/target/surefire/surefire4489855519001599156tmp> <https://builds.apache.org/job/HBase-0.92/ws/trunk/target/surefire/surefire947627200299345559tmp>
Running org.apache.hadoop.hbase.regionserver.TestCompoundBloomFilter
Tests run: 3, Failures: 0, Errors: 0, Skipped: 0, Time elapsed: 21.791 sec
Forking command line: /bin/sh -c cd <https://builds.apache.org/job/HBase-0.92/ws/trunk> && /home/jenkins/tools/java/jdk1.6.0_27-32/jre/bin/java -enableassertions -Xmx1400m -jar <https://builds.apache.org/job/HBase-0.92/ws/trunk/target/surefire/surefirebooter3862905059639389588.jar> <https://builds.apache.org/job/HBase-0.92/ws/trunk/target/surefire/surefire6813901485929050506tmp> <https://builds.apache.org/job/HBase-0.92/ws/trunk/target/surefire/surefire4800870107825110765tmp>
Running org.apache.hadoop.hbase.regionserver.TestSplitLogWorker
Tests run: 5, Failures: 0, Errors: 0, Skipped: 0, Time elapsed: 2.066 sec
Forking command line: /bin/sh -c cd <https://builds.apache.org/job/HBase-0.92/ws/trunk> && /home/jenkins/tools/java/jdk1.6.0_27-32/jre/bin/java -enableassertions -Xmx1400m -jar <https://builds.apache.org/job/HBase-0.92/ws/trunk/target/surefire/surefirebooter3912599936153729769.jar> <https://builds.apache.org/job/HBase-0.92/ws/trunk/target/surefire/surefire7038802398841269730tmp> <https://builds.apache.org/job/HBase-0.92/ws/trunk/target/surefire/surefire3547348867790181202tmp>
Running org.apache.hadoop.hbase.regionserver.TestServerCustomProtocol
Tests run: 6, Failures: 0, Errors: 0, Skipped: 0, Time elapsed: 18.035 sec
Forking command line: /bin/sh -c cd <https://builds.apache.org/job/HBase-0.92/ws/trunk> && /home/jenkins/tools/java/jdk1.6.0_27-32/jre/bin/java -enableassertions -Xmx1400m -jar <https://builds.apache.org/job/HBase-0.92/ws/trunk/target/surefire/surefirebooter721001660606561410.jar> <https://builds.apache.org/job/HBase-0.92/ws/trunk/target/surefire/surefire3079785083249699550tmp> <https://builds.apache.org/job/HBase-0.92/ws/trunk/target/surefire/surefire5765559277634162257tmp>
Running org.apache.hadoop.hbase.regionserver.TestScanWithBloomError
Tests run: 3, Failures: 0, Errors: 0, Skipped: 0, Time elapsed: 1.021 sec
Forking command line: /bin/sh -c cd <https://builds.apache.org/job/HBase-0.92/ws/trunk> && /home/jenkins/tools/java/jdk1.6.0_27-32/jre/bin/java -enableassertions -Xmx1400m -jar <https://builds.apache.org/job/HBase-0.92/ws/trunk/target/surefire/surefirebooter3964846748024497187.jar> <https://builds.apache.org/job/HBase-0.92/ws/trunk/target/surefire/surefire8793524275164234541tmp> <https://builds.apache.org/job/HBase-0.92/ws/trunk/target/surefire/surefire3630558036185173752tmp>
Running org.apache.hadoop.hbase.regionserver.TestStoreFileBlockCacheSummary
Tests run: 1, Failures: 0, Errors: 0, Skipped: 0, Time elapsed: 18.473 sec
Forking command line: /bin/sh -c cd <https://builds.apache.org/job/HBase-0.92/ws/trunk> && /home/jenkins/tools/java/jdk1.6.0_27-32/jre/bin/java -enableassertions -Xmx1400m -jar <https://builds.apache.org/job/HBase-0.92/ws/trunk/target/surefire/surefirebooter1892998468127270694.jar> <https://builds.apache.org/job/HBase-0.92/ws/trunk/target/surefire/surefire2125708189703308989tmp> <https://builds.apache.org/job/HBase-0.92/ws/trunk/target/surefire/surefire943407367587242574tmp>
Running org.apache.hadoop.hbase.regionserver.TestStore
Tests run: 11, Failures: 0, Errors: 0, Skipped: 0, Time elapsed: 1.796 sec
Forking command line: /bin/sh -c cd <https://builds.apache.org/job/HBase-0.92/ws/trunk> && /home/jenkins/tools/java/jdk1.6.0_27-32/jre/bin/java -enableassertions -Xmx1400m -jar <https://builds.apache.org/job/HBase-0.92/ws/trunk/target/surefire/surefirebooter836440644471966814.jar> <https://builds.apache.org/job/HBase-0.92/ws/trunk/target/surefire/surefire6978448390676626609tmp> <https://builds.apache.org/job/HBase-0.92/ws/trunk/target/surefire/surefire1344136819039309553tmp>
Running org.apache.hadoop.hbase.regionserver.TestBlocksRead
Tests run: 3, Failures: 0, Errors: 0, Skipped: 0, Time elapsed: 0.98 sec
Forking command line: /bin/sh -c cd <https://builds.apache.org/job/HBase-0.92/ws/trunk> && /home/jenkins/tools/java/jdk1.6.0_27-32/jre/bin/java -enableassertions -Xmx1400m -jar <https://builds.apache.org/job/HBase-0.92/ws/trunk/target/surefire/surefirebooter7269484396013272349.jar> <https://builds.apache.org/job/HBase-0.92/ws/trunk/target/surefire/surefire5798752539436537337tmp> <https://builds.apache.org/job/HBase-0.92/ws/trunk/target/surefire/surefire5292904164758950305tmp>
Running org.apache.hadoop.hbase.regionserver.TestFSErrorsExposed
Tests run: 3, Failures: 0, Errors: 0, Skipped: 0, Time elapsed: 29.13 sec
Forking command line: /bin/sh -c cd <https://builds.apache.org/job/HBase-0.92/ws/trunk> && /home/jenkins/tools/java/jdk1.6.0_27-32/jre/bin/java -enableassertions -Xmx1400m -jar <https://builds.apache.org/job/HBase-0.92/ws/trunk/target/surefire/surefirebooter969123803537687184.jar> <https://builds.apache.org/job/HBase-0.92/ws/trunk/target/surefire/surefire5915022743535511786tmp> <https://builds.apache.org/job/HBase-0.92/ws/trunk/target/surefire/surefire7246069210672215007tmp>
Running org.apache.hadoop.hbase.regionserver.handler.TestCloseRegionHandler
Tests run: 1, Failures: 0, Errors: 0, Skipped: 0, Time elapsed: 0.816 sec
Forking command line: /bin/sh -c cd <https://builds.apache.org/job/HBase-0.92/ws/trunk> && /home/jenkins/tools/java/jdk1.6.0_27-32/jre/bin/java -enableassertions -Xmx1400m -jar <https://builds.apache.org/job/HBase-0.92/ws/trunk/target/surefire/surefirebooter2093815744847033406.jar> <https://builds.apache.org/job/HBase-0.92/ws/trunk/target/surefire/surefire3214764605046172308tmp> <https://builds.apache.org/job/HBase-0.92/ws/trunk/target/surefire/surefire3896126732146778464tmp>
Running org.apache.hadoop.hbase.regionserver.handler.TestOpenRegionHandler
Tests run: 3, Failures: 0, Errors: 0, Skipped: 0, Time elapsed: 0.907 sec
Forking command line: /bin/sh -c cd <https://builds.apache.org/job/HBase-0.92/ws/trunk> && /home/jenkins/tools/java/jdk1.6.0_27-32/jre/bin/java -enableassertions -Xmx1400m -jar <https://builds.apache.org/job/HBase-0.92/ws/trunk/target/surefire/surefirebooter7157116925041484643.jar> <https://builds.apache.org/job/HBase-0.92/ws/trunk/target/surefire/surefire5242019080773497450tmp> <https://builds.apache.org/job/HBase-0.92/ws/trunk/target/surefire/surefire4657521142996200577tmp>
Running org.apache.hadoop.hbase.regionserver.TestScanDeleteTracker
Tests run: 6, Failures: 0, Errors: 0, Skipped: 0, Time elapsed: 0.596 sec
Forking command line: /bin/sh -c cd <https://builds.apache.org/job/HBase-0.92/ws/trunk> && /home/jenkins/tools/java/jdk1.6.0_27-32/jre/bin/java -enableassertions -Xmx1400m -jar <https://builds.apache.org/job/HBase-0.92/ws/trunk/target/surefire/surefirebooter1127620157443087770.jar> <https://builds.apache.org/job/HBase-0.92/ws/trunk/target/surefire/surefire7488282750326121853tmp> <https://builds.apache.org/job/HBase-0.92/ws/trunk/target/surefire/surefire8701956570322484046tmp>
Running org.apache.hadoop.hbase.regionserver.TestSplitTransactionOnCluster
Tests run: 4, Failures: 0, Errors: 0, Skipped: 0, Time elapsed: 47.143 sec
Forking command line: /bin/sh -c cd <https://builds.apache.org/job/HBase-0.92/ws/trunk> && /home/jenkins/tools/java/jdk1.6.0_27-32/jre/bin/java -enableassertions -Xmx1400m -jar <https://builds.apache.org/job/HBase-0.92/ws/trunk/target/surefire/surefirebooter7833229111900460852.jar> <https://builds.apache.org/job/HBase-0.92/ws/trunk/target/surefire/surefire7377121022132871806tmp> <https://builds.apache.org/job/HBase-0.92/ws/trunk/target/surefire/surefire1174275103686818506tmp>
Running org.apache.hadoop.hbase.regionserver.TestHRegionServerBulkLoad
Tests run: 1, Failures: 0, Errors: 0, Skipped: 0, Time elapsed: 48.667 sec
Forking command line: /bin/sh -c cd <https://builds.apache.org/job/HBase-0.92/ws/trunk> && /home/jenkins/tools/java/jdk1.6.0_27-32/jre/bin/java -enableassertions -Xmx1400m -jar <https://builds.apache.org/job/HBase-0.92/ws/trunk/target/surefire/surefirebooter2522203713038262696.jar> <https://builds.apache.org/job/HBase-0.92/ws/trunk/target/surefire/surefire4388850591352787049tmp> <https://builds.apache.org/job/HBase-0.92/ws/trunk/target/surefire/surefire3631189643817061432tmp>
Running org.apache.hadoop.hbase.regionserver.TestSplitTransaction
Tests run: 6, Failures: 0, Errors: 0, Skipped: 0, Time elapsed: 3.828 sec
Forking command line: /bin/sh -c cd <https://builds.apache.org/job/HBase-0.92/ws/trunk> && /home/jenkins/tools/java/jdk1.6.0_27-32/jre/bin/java -enableassertions -Xmx1400m -jar <https://builds.apache.org/job/HBase-0.92/ws/trunk/target/surefire/surefirebooter7012443082186258895.jar> <https://builds.apache.org/job/HBase-0.92/ws/trunk/target/surefire/surefire2927358817030989048tmp> <https://builds.apache.org/job/HBase-0.92/ws/trunk/target/surefire/surefire5536751944694825482tmp>
Running org.apache.hadoop.hbase.regionserver.TestReadWriteConsistencyControl
Tests run: 1, Failures: 0, Errors: 0, Skipped: 0, Time elapsed: 10.106 sec
Forking command line: /bin/sh -c cd <https://builds.apache.org/job/HBase-0.92/ws/trunk> && /home/jenkins/tools/java/jdk1.6.0_27-32/jre/bin/java -enableassertions -Xmx1400m -jar <https://builds.apache.org/job/HBase-0.92/ws/trunk/target/surefire/surefirebooter5762276092919797700.jar> <https://builds.apache.org/job/HBase-0.92/ws/trunk/target/surefire/surefire4575917381002992227tmp> <https://builds.apache.org/job/HBase-0.92/ws/trunk/target/surefire/surefire3203544816826986205tmp>
Running org.apache.hadoop.hbase.regionserver.TestKeyValueHeap
Tests run: 3, Failures: 0, Errors: 0, Skipped: 0, Time elapsed: 0.502 sec
Forking command line: /bin/sh -c cd <https://builds.apache.org/job/HBase-0.92/ws/trunk> && /home/jenkins/tools/java/jdk1.6.0_27-32/jre/bin/java -enableassertions -Xmx1400m -jar <https://builds.apache.org/job/HBase-0.92/ws/trunk/target/surefire/surefirebooter8051399586759636295.jar> <https://builds.apache.org/job/HBase-0.92/ws/trunk/target/surefire/surefire6999809799979461826tmp> <https://builds.apache.org/job/HBase-0.92/ws/trunk/target/surefire/surefire2088499239076672181tmp>
Running org.apache.hadoop.hbase.regionserver.TestCompactSelection
Tests run: 1, Failures: 0, Errors: 0, Skipped: 0, Time elapsed: 0.639 sec
Forking command line: /bin/sh -c cd <https://builds.apache.org/job/HBase-0.92/ws/trunk> && /home/jenkins/tools/java/jdk1.6.0_27-32/jre/bin/java -enableassertions -Xmx1400m -jar <https://builds.apache.org/job/HBase-0.92/ws/trunk/target/surefire/surefirebooter5444022421589833232.jar> <https://builds.apache.org/job/HBase-0.92/ws/trunk/target/surefire/surefire6208575798176037468tmp> <https://builds.apache.org/job/HBase-0.92/ws/trunk/target/surefire/surefire6628442707010258990tmp>
Running org.apache.hadoop.hbase.regionserver.TestMinVersions
Tests run: 6, Failures: 0, Errors: 0, Skipped: 0, Time elapsed: 1.176 sec
Forking command line: /bin/sh -c cd <https://builds.apache.org/job/HBase-0.92/ws/trunk> && /home/jenkins/tools/java/jdk1.6.0_27-32/jre/bin/java -enableassertions -Xmx1400m -jar <https://builds.apache.org/job/HBase-0.92/ws/trunk/target/surefire/surefirebooter9166419228190558893.jar> <https://builds.apache.org/job/HBase-0.92/ws/trunk/target/surefire/surefire6991185035538715060tmp> <https://builds.apache.org/job/HBase-0.92/ws/trunk/target/surefire/surefire1208309950728238270tmp>
Running org.apache.hadoop.hbase.regionserver.TestWideScanner
Tests run: 1, Failures: 0, Errors: 0, Skipped: 0, Time elapsed: 1.871 sec
Forking command line: /bin/sh -c cd <https://builds.apache.org/job/HBase-0.92/ws/trunk> && /home/jenkins/tools/java/jdk1.6.0_27-32/jre/bin/java -enableassertions -Xmx1400m -jar <https://builds.apache.org/job/HBase-0.92/ws/trunk/target/surefire/surefirebooter2218896592708644627.jar> <https://builds.apache.org/job/HBase-0.92/ws/trunk/target/surefire/surefire921145572746682250tmp> <https://builds.apache.org/job/HBase-0.92/ws/trunk/target/surefire/surefire2461537764280172278tmp>
Running org.apache.hadoop.hbase.regionserver.TestColumnSeeking
Tests run: 2, Failures: 0, Errors: 0, Skipped: 0, Time elapsed: 4.652 sec
Forking command line: /bin/sh -c cd <https://builds.apache.org/job/HBase-0.92/ws/trunk> && /home/jenkins/tools/java/jdk1.6.0_27-32/jre/bin/java -enableassertions -Xmx1400m -jar <https://builds.apache.org/job/HBase-0.92/ws/trunk/target/surefire/surefirebooter6520348466165134346.jar> <https://builds.apache.org/job/HBase-0.92/ws/trunk/target/surefire/surefire4810839501794650912tmp> <https://builds.apache.org/job/HBase-0.92/ws/trunk/target/surefire/surefire3418418284620295926tmp>
Running org.apache.hadoop.hbase.regionserver.TestGetClosestAtOrBefore
Tests run: 3, Failures: 0, Errors: 0, Skipped: 0, Time elapsed: 1.151 sec
Forking command line: /bin/sh -c cd <https://builds.apache.org/job/HBase-0.92/ws/trunk> && /home/jenkins/tools/java/jdk1.6.0_27-32/jre/bin/java -enableassertions -Xmx1400m -jar <https://builds.apache.org/job/HBase-0.92/ws/trunk/target/surefire/surefirebooter1626100033799700945.jar> <https://builds.apache.org/job/HBase-0.92/ws/trunk/target/surefire/surefire5877458676108357917tmp> <https://builds.apache.org/job/HBase-0.92/ws/trunk/target/surefire/surefire2421994357843629869tmp>
Running org.apache.hadoop.hbase.regionserver.TestExplicitColumnTracker
Tests run: 4, Failures: 0, Errors: 0, Skipped: 0, Time elapsed: 0.897 sec
Forking command line: /bin/sh -c cd <https://builds.apache.org/job/HBase-0.92/ws/trunk> && /home/jenkins/tools/java/jdk1.6.0_27-32/jre/bin/java -enableassertions -Xmx1400m -jar <https://builds.apache.org/job/HBase-0.92/ws/trunk/target/surefire/surefirebooter6227129434715754099.jar> <https://builds.apache.org/job/HBase-0.92/ws/trunk/target/surefire/surefire1940352763702205043tmp> <https://builds.apache.org/job/HBase-0.92/ws/trunk/target/surefire/surefire6806953781951470727tmp>
Running org.apache.hadoop.hbase.regionserver.TestMemStoreLAB
Tests run: 3, Failures: 0, Errors: 0, Skipped: 0, Time elapsed: 1.259 sec
Forking command line: /bin/sh -c cd <https://builds.apache.org/job/HBase-0.92/ws/trunk> && /home/jenkins/tools/java/jdk1.6.0_27-32/jre/bin/java -enableassertions -Xmx1400m -jar <https://builds.apache.org/job/HBase-0.92/ws/trunk/target/surefire/surefirebooter6762201659986744492.jar> <https://builds.apache.org/job/HBase-0.92/ws/trunk/target/surefire/surefire192008180154551339tmp> <https://builds.apache.org/job/HBase-0.92/ws/trunk/target/surefire/surefire605223465548314614tmp>
Running org.apache.hadoop.hbase.regionserver.TestKeyValueScanFixture
Tests run: 1, Failures: 0, Errors: 0, Skipped: 0, Time elapsed: 0.115 sec
Forking command line: /bin/sh -c cd <https://builds.apache.org/job/HBase-0.92/ws/trunk> && /home/jenkins/tools/java/jdk1.6.0_27-32/jre/bin/java -enableassertions -Xmx1400m -jar <https://builds.apache.org/job/HBase-0.92/ws/trunk/target/surefire/surefirebooter7536829833847708097.jar> <https://builds.apache.org/job/HBase-0.92/ws/trunk/target/surefire/surefire256188193184290654tmp> <https://builds.apache.org/job/HBase-0.92/ws/trunk/target/surefire/surefire3761743602922528515tmp>
Running org.apache.hadoop.hbase.regionserver.wal.TestLogRollAbort
Tests run: 1, Failures: 0, Errors: 0, Skipped: 0, Time elapsed: 161.005 sec
Forking command line: /bin/sh -c cd <https://builds.apache.org/job/HBase-0.92/ws/trunk> && /home/jenkins/tools/java/jdk1.6.0_27-32/jre/bin/java -enableassertions -Xmx1400m -jar <https://builds.apache.org/job/HBase-0.92/ws/trunk/target/surefire/surefirebooter7725772947619164414.jar> <https://builds.apache.org/job/HBase-0.92/ws/trunk/target/surefire/surefire5959136813052307972tmp> <https://builds.apache.org/job/HBase-0.92/ws/trunk/target/surefire/surefire573978781625019980tmp>
Running org.apache.hadoop.hbase.regionserver.wal.TestWALActionsListener
Tests run: 1, Failures: 0, Errors: 0, Skipped: 0, Time elapsed: 0.613 sec
Forking command line: /bin/sh -c cd <https://builds.apache.org/job/HBase-0.92/ws/trunk> && /home/jenkins/tools/java/jdk1.6.0_27-32/jre/bin/java -enableassertions -Xmx1400m -jar <https://builds.apache.org/job/HBase-0.92/ws/trunk/target/surefire/surefirebooter828087206847833274.jar> <https://builds.apache.org/job/HBase-0.92/ws/trunk/target/surefire/surefire7682662164283234417tmp> <https://builds.apache.org/job/HBase-0.92/ws/trunk/target/surefire/surefire3313746470730384273tmp>
Running org.apache.hadoop.hbase.regionserver.wal.TestLogRolling
Tests run: 3, Failures: 0, Errors: 0, Skipped: 0, Time elapsed: 328.355 sec
Forking command line: /bin/sh -c cd <https://builds.apache.org/job/HBase-0.92/ws/trunk> && /home/jenkins/tools/java/jdk1.6.0_27-32/jre/bin/java -enableassertions -Xmx1400m -jar <https://builds.apache.org/job/HBase-0.92/ws/trunk/target/surefire/surefirebooter6572621923396387935.jar> <https://builds.apache.org/job/HBase-0.92/ws/trunk/target/surefire/surefire970614185336509809tmp> <https://builds.apache.org/job/HBase-0.92/ws/trunk/target/surefire/surefire4139819151820755360tmp>
Running org.apache.hadoop.hbase.regionserver.wal.TestHLog
Tests run: 9, Failures: 0, Errors: 0, Skipped: 0, Time elapsed: 59.868 sec
Forking command line: /bin/sh -c cd <https://builds.apache.org/job/HBase-0.92/ws/trunk> && /home/jenkins/tools/java/jdk1.6.0_27-32/jre/bin/java -enableassertions -Xmx1400m -jar <https://builds.apache.org/job/HBase-0.92/ws/trunk/target/surefire/surefirebooter2524455223453116091.jar> <https://builds.apache.org/job/HBase-0.92/ws/trunk/target/surefire/surefire538570729833151456tmp> <https://builds.apache.org/job/HBase-0.92/ws/trunk/target/surefire/surefire1208726529306992985tmp>
Running org.apache.hadoop.hbase.regionserver.wal.TestHLogSplit
Tests run: 29, Failures: 0, Errors: 0, Skipped: 1, Time elapsed: 230.243 sec
Forking command line: /bin/sh -c cd <https://builds.apache.org/job/HBase-0.92/ws/trunk> && /home/jenkins/tools/java/jdk1.6.0_27-32/jre/bin/java -enableassertions -Xmx1400m -jar <https://builds.apache.org/job/HBase-0.92/ws/trunk/target/surefire/surefirebooter3110514031139981348.jar> <https://builds.apache.org/job/HBase-0.92/ws/trunk/target/surefire/surefire5978910515785883001tmp> <https://builds.apache.org/job/HBase-0.92/ws/trunk/target/surefire/surefire4298379630203024873tmp>
Running org.apache.hadoop.hbase.regionserver.wal.TestWALReplay
Tests run: 5, Failures: 0, Errors: 0, Skipped: 0, Time elapsed: 27.377 sec
Forking command line: /bin/sh -c cd <https://builds.apache.org/job/HBase-0.92/ws/trunk> && /home/jenkins/tools/java/jdk1.6.0_27-32/jre/bin/java -enableassertions -Xmx1400m -jar <https://builds.apache.org/job/HBase-0.92/ws/trunk/target/surefire/surefirebooter1106607894880294597.jar> <https://builds.apache.org/job/HBase-0.92/ws/trunk/target/surefire/surefire3330780074201697610tmp> <https://builds.apache.org/job/HBase-0.92/ws/trunk/target/surefire/surefire3782364349909180130tmp>
Running org.apache.hadoop.hbase.regionserver.wal.TestHLogMethods
Tests run: 3, Failures: 0, Errors: 0, Skipped: 0, Time elapsed: 0.805 sec
Forking command line: /bin/sh -c cd <https://builds.apache.org/job/HBase-0.92/ws/trunk> && /home/jenkins/tools/java/jdk1.6.0_27-32/jre/bin/java -enableassertions -Xmx1400m -jar <https://builds.apache.org/job/HBase-0.92/ws/trunk/target/surefire/surefirebooter4755136943055541149.jar> <https://builds.apache.org/job/HBase-0.92/ws/trunk/target/surefire/surefire2619814384991680911tmp> <https://builds.apache.org/job/HBase-0.92/ws/trunk/target/surefire/surefire5634779395551307779tmp>
Running org.apache.hadoop.hbase.regionserver.TestRSStatusServlet
Tests run: 2, Failures: 0, Errors: 0, Skipped: 0, Time elapsed: 0.675 sec
Forking command line: /bin/sh -c cd <https://builds.apache.org/job/HBase-0.92/ws/trunk> && /home/jenkins/tools/java/jdk1.6.0_27-32/jre/bin/java -enableassertions -Xmx1400m -jar <https://builds.apache.org/job/HBase-0.92/ws/trunk/target/surefire/surefirebooter652940494446756782.jar> <https://builds.apache.org/job/HBase-0.92/ws/trunk/target/surefire/surefire5024168397787036356tmp> <https://builds.apache.org/job/HBase-0.92/ws/trunk/target/surefire/surefire8522272168398667397tmp>
Running org.apache.hadoop.hbase.regionserver.TestStoreScanner
Tests run: 14, Failures: 0, Errors: 0, Skipped: 0, Time elapsed: 0.141 sec
Forking command line: /bin/sh -c cd <https://builds.apache.org/job/HBase-0.92/ws/trunk> && /home/jenkins/tools/java/jdk1.6.0_27-32/jre/bin/java -enableassertions -Xmx1400m -jar <https://builds.apache.org/job/HBase-0.92/ws/trunk/target/surefire/surefirebooter8952231046250277082.jar> <https://builds.apache.org/job/HBase-0.92/ws/trunk/target/surefire/surefire3445609384213986686tmp> <https://builds.apache.org/job/HBase-0.92/ws/trunk/target/surefire/surefire2142161230317619944tmp>
Running org.apache.hadoop.hbase.regionserver.TestResettingCounters
Tests run: 1, Failures: 0, Errors: 0, Skipped: 0, Time elapsed: 0.71 sec
Forking command line: /bin/sh -c cd <https://builds.apache.org/job/HBase-0.92/ws/trunk> && /home/jenkins/tools/java/jdk1.6.0_27-32/jre/bin/java -enableassertions -Xmx1400m -jar <https://builds.apache.org/job/HBase-0.92/ws/trunk/target/surefire/surefirebooter2746901570114649766.jar> <https://builds.apache.org/job/HBase-0.92/ws/trunk/target/surefire/surefire4959826608785105870tmp> <https://builds.apache.org/job/HBase-0.92/ws/trunk/target/surefire/surefire8504846944671127841tmp>
Running org.apache.hadoop.hbase.regionserver.TestStoreFile
Tests run: 8, Failures: 0, Errors: 0, Skipped: 0, Time elapsed: 1.676 sec
Forking command line: /bin/sh -c cd <https://builds.apache.org/job/HBase-0.92/ws/trunk> && /home/jenkins/tools/java/jdk1.6.0_27-32/jre/bin/java -enableassertions -Xmx1400m -jar <https://builds.apache.org/job/HBase-0.92/ws/trunk/target/surefire/surefirebooter7397301313953668695.jar> <https://builds.apache.org/job/HBase-0.92/ws/trunk/target/surefire/surefire2261025860760590930tmp> <https://builds.apache.org/job/HBase-0.92/ws/trunk/target/surefire/surefire8656858469140828218tmp>
Running org.apache.hadoop.hbase.regionserver.TestEndToEndSplitTransaction
Tests run: 1, Failures: 0, Errors: 0, Skipped: 0, Time elapsed: 45.56 sec
Forking command line: /bin/sh -c cd <https://builds.apache.org/job/HBase-0.92/ws/trunk> && /home/jenkins/tools/java/jdk1.6.0_27-32/jre/bin/java -enableassertions -Xmx1400m -jar <https://builds.apache.org/job/HBase-0.92/ws/trunk/target/surefire/surefirebooter7962016956324398253.jar> <https://builds.apache.org/job/HBase-0.92/ws/trunk/target/surefire/surefire1209896907066927106tmp> <https://builds.apache.org/job/HBase-0.92/ws/trunk/target/surefire/surefire3625434238283493711tmp>
Running org.apache.hadoop.hbase.regionserver.TestScanWildcardColumnTracker
Tests run: 2, Failures: 0, Errors: 0, Skipped: 0, Time elapsed: 0.457 sec
Forking command line: /bin/sh -c cd <https://builds.apache.org/job/HBase-0.92/ws/trunk> && /home/jenkins/tools/java/jdk1.6.0_27-32/jre/bin/java -enableassertions -Xmx1400m -jar <https://builds.apache.org/job/HBase-0.92/ws/trunk/target/surefire/surefirebooter4518620846201953150.jar> <https://builds.apache.org/job/HBase-0.92/ws/trunk/target/surefire/surefire4147140396716405163tmp> <https://builds.apache.org/job/HBase-0.92/ws/trunk/target/surefire/surefire8370716915846033330tmp>
Running org.apache.hadoop.hbase.regionserver.TestCompaction
Tests run: 10, Failures: 0, Errors: 0, Skipped: 0, Time elapsed: 12.029 sec
Forking command line: /bin/sh -c cd <https://builds.apache.org/job/HBase-0.92/ws/trunk> && /home/jenkins/tools/java/jdk1.6.0_27-32/jre/bin/java -enableassertions -Xmx1400m -jar <https://builds.apache.org/job/HBase-0.92/ws/trunk/target/surefire/surefirebooter2740733293609125752.jar> <https://builds.apache.org/job/HBase-0.92/ws/trunk/target/surefire/surefire235331277365498003tmp> <https://builds.apache.org/job/HBase-0.92/ws/trunk/target/surefire/surefire9045800556486945298tmp>
Running org.apache.hadoop.hbase.regionserver.TestQueryMatcher
Tests run: 4, Failures: 0, Errors: 0, Skipped: 0, Time elapsed: 0.544 sec
Forking command line: /bin/sh -c cd <https://builds.apache.org/job/HBase-0.92/ws/trunk> && /home/jenkins/tools/java/jdk1.6.0_27-32/jre/bin/java -enableassertions -Xmx1400m -jar <https://builds.apache.org/job/HBase-0.92/ws/trunk/target/surefire/surefirebooter7534248851129099127.jar> <https://builds.apache.org/job/HBase-0.92/ws/trunk/target/surefire/surefire3897546342730134442tmp> <https://builds.apache.org/job/HBase-0.92/ws/trunk/target/surefire/surefire1866291013807212712tmp>
Running org.apache.hadoop.hbase.regionserver.TestRpcMetrics
Tests run: 1, Failures: 0, Errors: 0, Skipped: 0, Time elapsed: 2.025 sec
Forking command line: /bin/sh -c cd <https://builds.apache.org/job/HBase-0.92/ws/trunk> && /home/jenkins/tools/java/jdk1.6.0_27-32/jre/bin/java -enableassertions -Xmx1400m -jar <https://builds.apache.org/job/HBase-0.92/ws/trunk/target/surefire/surefirebooter181265061842717114.jar> <https://builds.apache.org/job/HBase-0.92/ws/trunk/target/surefire/surefire3368888834983859424tmp> <https://builds.apache.org/job/HBase-0.92/ws/trunk/target/surefire/surefire8521943050335712805tmp>
Running org.apache.hadoop.hbase.regionserver.TestScanner
Tests run: 6, Failures: 0, Errors: 0, Skipped: 0, Time elapsed: 4.531 sec
Forking command line: /bin/sh -c cd <https://builds.apache.org/job/HBase-0.92/ws/trunk> && /home/jenkins/tools/java/jdk1.6.0_27-32/jre/bin/java -enableassertions -Xmx1400m -jar <https://builds.apache.org/job/HBase-0.92/ws/trunk/target/surefire/surefirebooter8283356236013146242.jar> <https://builds.apache.org/job/HBase-0.92/ws/trunk/target/surefire/surefire537356387340225903tmp> <https://builds.apache.org/job/HBase-0.92/ws/trunk/target/surefire/surefire3116488298567385612tmp>
Running org.apache.hadoop.hbase.regionserver.TestMultiColumnScanner
Tests run: 6, Failures: 0, Errors: 0, Skipped: 0, Time elapsed: 18.096 sec
Forking command line: /bin/sh -c cd <https://builds.apache.org/job/HBase-0.92/ws/trunk> && /home/jenkins/tools/java/jdk1.6.0_27-32/jre/bin/java -enableassertions -Xmx1400m -jar <https://builds.apache.org/job/HBase-0.92/ws/trunk/target/surefire/surefirebooter969174711483109996.jar> <https://builds.apache.org/job/HBase-0.92/ws/trunk/target/surefire/surefire5835103385547553847tmp> <https://builds.apache.org/job/HBase-0.92/ws/trunk/target/surefire/surefire8229575639900536309tmp>
Running org.apache.hadoop.hbase.regionserver.TestRegionSplitPolicy
Tests run: 3, Failures: 0, Errors: 0, Skipped: 0, Time elapsed: 0.697 sec
Forking command line: /bin/sh -c cd <https://builds.apache.org/job/HBase-0.92/ws/trunk> && /home/jenkins/tools/java/jdk1.6.0_27-32/jre/bin/java -enableassertions -Xmx1400m -jar <https://builds.apache.org/job/HBase-0.92/ws/trunk/target/surefire/surefirebooter1302249668238343027.jar> <https://builds.apache.org/job/HBase-0.92/ws/trunk/target/surefire/surefire7550893998398029987tmp> <https://builds.apache.org/job/HBase-0.92/ws/trunk/target/surefire/surefire4019716513913220543tmp>
Running org.apache.hadoop.hbase.regionserver.TestKeyValueSkipListSet
Tests run: 4, Failures: 0, Errors: 0, Skipped: 0, Time elapsed: 0.12 sec
Forking command line: /bin/sh -c cd <https://builds.apache.org/job/HBase-0.92/ws/trunk> && /home/jenkins/tools/java/jdk1.6.0_27-32/jre/bin/java -enableassertions -Xmx1400m -jar <https://builds.apache.org/job/HBase-0.92/ws/trunk/target/surefire/surefirebooter5084959476567255726.jar> <https://builds.apache.org/job/HBase-0.92/ws/trunk/target/surefire/surefire1796565473007008699tmp> <https://builds.apache.org/job/HBase-0.92/ws/trunk/target/surefire/surefire2159507516896146875tmp>
Running org.apache.hadoop.hbase.mapred.TestTableMapReduce
Tests run: 1, Failures: 0, Errors: 0, Skipped: 0, Time elapsed: 62.388 sec
Forking command line: /bin/sh -c cd <https://builds.apache.org/job/HBase-0.92/ws/trunk> && /home/jenkins/tools/java/jdk1.6.0_27-32/jre/bin/java -enableassertions -Xmx1400m -jar <https://builds.apache.org/job/HBase-0.92/ws/trunk/target/surefire/surefirebooter3512821748019560171.jar> <https://builds.apache.org/job/HBase-0.92/ws/trunk/target/surefire/surefire1091300767538625820tmp> <https://builds.apache.org/job/HBase-0.92/ws/trunk/target/surefire/surefire1561082595841770172tmp>
Running org.apache.hadoop.hbase.mapred.TestTableInputFormat
Tests run: 6, Failures: 0, Errors: 0, Skipped: 0, Time elapsed: 28.376 sec
Forking command line: /bin/sh -c cd <https://builds.apache.org/job/HBase-0.92/ws/trunk> && /home/jenkins/tools/java/jdk1.6.0_27-32/jre/bin/java -enableassertions -Xmx1400m -jar <https://builds.apache.org/job/HBase-0.92/ws/trunk/target/surefire/surefirebooter9043004053400036539.jar> <https://builds.apache.org/job/HBase-0.92/ws/trunk/target/surefire/surefire4906470134472908844tmp> <https://builds.apache.org/job/HBase-0.92/ws/trunk/target/surefire/surefire7663565540714247144tmp>
Running org.apache.hadoop.hbase.TestDrainingServer
Tests run: 1, Failures: 1, Errors: 0, Skipped: 0, Time elapsed: 20.238 sec <<< FAILURE!
Forking command line: /bin/sh -c cd <https://builds.apache.org/job/HBase-0.92/ws/trunk> && /home/jenkins/tools/java/jdk1.6.0_27-32/jre/bin/java -enableassertions -Xmx1400m -jar <https://builds.apache.org/job/HBase-0.92/ws/trunk/target/surefire/surefirebooter3731956268889799246.jar> <https://builds.apache.org/job/HBase-0.92/ws/trunk/target/surefire/surefire214265083319588296tmp> <https://builds.apache.org/job/HBase-0.92/ws/trunk/target/surefire/surefire2706574480041269682tmp>
Running org.apache.hadoop.hbase.TestFSTableDescriptorForceCreation
Tests run: 3, Failures: 0, Errors: 0, Skipped: 0, Time elapsed: 0.519 sec
Forking command line: /bin/sh -c cd <https://builds.apache.org/job/HBase-0.92/ws/trunk> && /home/jenkins/tools/java/jdk1.6.0_27-32/jre/bin/java -enableassertions -Xmx1400m -jar <https://builds.apache.org/job/HBase-0.92/ws/trunk/target/surefire/surefirebooter182767352976008750.jar> <https://builds.apache.org/job/HBase-0.92/ws/trunk/target/surefire/surefire2897858691434563531tmp> <https://builds.apache.org/job/HBase-0.92/ws/trunk/target/surefire/surefire4084619784843663124tmp>
Running org.apache.hadoop.hbase.executor.TestExecutorService
Tests run: 1, Failures: 0, Errors: 0, Skipped: 0, Time elapsed: 2.436 sec
Forking command line: /bin/sh -c cd <https://builds.apache.org/job/HBase-0.92/ws/trunk> && /home/jenkins/tools/java/jdk1.6.0_27-32/jre/bin/java -enableassertions -Xmx1400m -jar <https://builds.apache.org/job/HBase-0.92/ws/trunk/target/surefire/surefirebooter6378385717606518574.jar> <https://builds.apache.org/job/HBase-0.92/ws/trunk/target/surefire/surefire5218565419180822994tmp> <https://builds.apache.org/job/HBase-0.92/ws/trunk/target/surefire/surefire2994872832827538254tmp>
Running org.apache.hadoop.hbase.mapreduce.TestTimeRangeMapRed
Tests run: 1, Failures: 0, Errors: 0, Skipped: 0, Time elapsed: 39.461 sec
Forking command line: /bin/sh -c cd <https://builds.apache.org/job/HBase-0.92/ws/trunk> && /home/jenkins/tools/java/jdk1.6.0_27-32/jre/bin/java -enableassertions -Xmx1400m -jar <https://builds.apache.org/job/HBase-0.92/ws/trunk/target/surefire/surefirebooter4935446893903800982.jar> <https://builds.apache.org/job/HBase-0.92/ws/trunk/target/surefire/surefire952586537340691279tmp> <https://builds.apache.org/job/HBase-0.92/ws/trunk/target/surefire/surefire5027284399089335047tmp>
Running org.apache.hadoop.hbase.mapreduce.TestHFileOutputFormat
Tests run: 8, Failures: 1, Errors: 0, Skipped: 0, Time elapsed: 144.423 sec <<< FAILURE!
Forking command line: /bin/sh -c cd <https://builds.apache.org/job/HBase-0.92/ws/trunk> && /home/jenkins/tools/java/jdk1.6.0_27-32/jre/bin/java -enableassertions -Xmx1400m -jar <https://builds.apache.org/job/HBase-0.92/ws/trunk/target/surefire/surefirebooter2081772104494128445.jar> <https://builds.apache.org/job/HBase-0.92/ws/trunk/target/surefire/surefire1599898626045671224tmp> <https://builds.apache.org/job/HBase-0.92/ws/trunk/target/surefire/surefire714203305019028858tmp>
Running org.apache.hadoop.hbase.mapreduce.TestImportTsv
Tests run: 8, Failures: 0, Errors: 0, Skipped: 0, Time elapsed: 40.015 sec
Forking command line: /bin/sh -c cd <https://builds.apache.org/job/HBase-0.92/ws/trunk> && /home/jenkins/tools/java/jdk1.6.0_27-32/jre/bin/java -enableassertions -Xmx1400m -jar <https://builds.apache.org/job/HBase-0.92/ws/trunk/target/surefire/surefirebooter2240216040645825404.jar> <https://builds.apache.org/job/HBase-0.92/ws/trunk/target/surefire/surefire5871978061149635756tmp> <https://builds.apache.org/job/HBase-0.92/ws/trunk/target/surefire/surefire663950626805549342tmp>
Running org.apache.hadoop.hbase.mapreduce.TestTableInputFormatScan
Tests run: 11, Failures: 0, Errors: 0, Skipped: 0, Time elapsed: 455.904 sec
Forking command line: /bin/sh -c cd <https://builds.apache.org/job/HBase-0.92/ws/trunk> && /home/jenkins/tools/java/jdk1.6.0_27-32/jre/bin/java -enableassertions -Xmx1400m -jar <https://builds.apache.org/job/HBase-0.92/ws/trunk/target/surefire/surefirebooter2255281340085254191.jar> <https://builds.apache.org/job/HBase-0.92/ws/trunk/target/surefire/surefire303342383892784219tmp> <https://builds.apache.org/job/HBase-0.92/ws/trunk/target/surefire/surefire6165748661378496013tmp>
Running org.apache.hadoop.hbase.mapreduce.TestLoadIncrementalHFilesSplitRecovery
Tests run: 3, Failures: 0, Errors: 0, Skipped: 0, Time elapsed: 75.611 sec
Forking command line: /bin/sh -c cd <https://builds.apache.org/job/HBase-0.92/ws/trunk> && /home/jenkins/tools/java/jdk1.6.0_27-32/jre/bin/java -enableassertions -Xmx1400m -jar <https://builds.apache.org/job/HBase-0.92/ws/trunk/target/surefire/surefirebooter4436299578206025152.jar> <https://builds.apache.org/job/HBase-0.92/ws/trunk/target/surefire/surefire8082163669078877344tmp> <https://builds.apache.org/job/HBase-0.92/ws/trunk/target/surefire/surefire3397546503235747070tmp>
Running org.apache.hadoop.hbase.mapreduce.TestTableSplit
Tests run: 1, Failures: 0, Errors: 0, Skipped: 0, Time elapsed: 0.134 sec
Forking command line: /bin/sh -c cd <https://builds.apache.org/job/HBase-0.92/ws/trunk> && /home/jenkins/tools/java/jdk1.6.0_27-32/jre/bin/java -enableassertions -Xmx1400m -jar <https://builds.apache.org/job/HBase-0.92/ws/trunk/target/surefire/surefirebooter3190055920553625825.jar> <https://builds.apache.org/job/HBase-0.92/ws/trunk/target/surefire/surefire6216053541985844400tmp> <https://builds.apache.org/job/HBase-0.92/ws/trunk/target/surefire/surefire1461944800998639309tmp>
Running org.apache.hadoop.hbase.mapreduce.TestSimpleTotalOrderPartitioner
Tests run: 1, Failures: 0, Errors: 0, Skipped: 0, Time elapsed: 0.421 sec
Forking command line: /bin/sh -c cd <https://builds.apache.org/job/HBase-0.92/ws/trunk> && /home/jenkins/tools/java/jdk1.6.0_27-32/jre/bin/java -enableassertions -Xmx1400m -jar <https://builds.apache.org/job/HBase-0.92/ws/trunk/target/surefire/surefirebooter7794578810271457514.jar> <https://builds.apache.org/job/HBase-0.92/ws/trunk/target/surefire/surefire7498637315786695792tmp> <https://builds.apache.org/job/HBase-0.92/ws/trunk/target/surefire/surefire3859194951472091323tmp>
Running org.apache.hadoop.hbase.mapreduce.TestTableMapReduce
Tests run: 1, Failures: 0, Errors: 0, Skipped: 0, Time elapsed: 90.405 sec
Forking command line: /bin/sh -c cd <https://builds.apache.org/job/HBase-0.92/ws/trunk> && /home/jenkins/tools/java/jdk1.6.0_27-32/jre/bin/java -enableassertions -Xmx1400m -jar <https://builds.apache.org/job/HBase-0.92/ws/trunk/target/surefire/surefirebooter4823274070820482037.jar> <https://builds.apache.org/job/HBase-0.92/ws/trunk/target/surefire/surefire5361281429799726671tmp> <https://builds.apache.org/job/HBase-0.92/ws/trunk/target/surefire/surefire7152772670516468904tmp>
Running org.apache.hadoop.hbase.mapreduce.TestLoadIncrementalHFiles
Tests run: 6, Failures: 0, Errors: 0, Skipped: 0, Time elapsed: 28.89 sec
Forking command line: /bin/sh -c cd <https://builds.apache.org/job/HBase-0.92/ws/trunk> && /home/jenkins/tools/java/jdk1.6.0_27-32/jre/bin/java -enableassertions -Xmx1400m -jar <https://builds.apache.org/job/HBase-0.92/ws/trunk/target/surefire/surefirebooter8311703381054484348.jar> <https://builds.apache.org/job/HBase-0.92/ws/trunk/target/surefire/surefire1224129318043972622tmp> <https://builds.apache.org/job/HBase-0.92/ws/trunk/target/surefire/surefire5261468057711509272tmp>
Running org.apache.hadoop.hbase.TestHRegionLocation
Tests run: 3, Failures: 0, Errors: 0, Skipped: 0, Time elapsed: 0.139 sec
Results :
Failed tests: org.apache.hadoop.hbase.TestDrainingServer
testMRIncrementalLoadWithSplit(org.apache.hadoop.hbase.mapreduce.TestHFileOutputFormat): LoadIncrementalHFiles should put expected data in table expected:<1024> but was:<895>
Tests in error:
testExceptionFromCoprocessorDuringPut(org.apache.hadoop.hbase.coprocessor.TestRegionServerCoprocessorExceptionWithAbort): -1
Tests run: 1050, Failures: 2, Errors: 1, Skipped: 10
[INFO] ------------------------------------------------------------------------
[INFO] BUILD FAILURE
[INFO] ------------------------------------------------------------------------
[INFO] Total time: 1:38:00.056s
[INFO] Finished at: Sat Nov 05 06:23:41 UTC 2011
[INFO] Final Memory: 40M/692M
[INFO] ------------------------------------------------------------------------
[ERROR] Failed to execute goal org.apache.maven.plugins:maven-surefire-plugin:2.10:test (default-test) on project hbase: There are test failures.
[ERROR]
[ERROR] Please refer to <https://builds.apache.org/job/HBase-0.92/ws/trunk/target/surefire-reports> for the individual test results.
[ERROR] -> [Help 1]
org.apache.maven.lifecycle.LifecycleExecutionException: Failed to execute goal org.apache.maven.plugins:maven-surefire-plugin:2.10:test (default-test) on project hbase: There are test failures.
Please refer to <https://builds.apache.org/job/HBase-0.92/ws/trunk/target/surefire-reports> for the individual test results.
at org.apache.maven.lifecycle.internal.MojoExecutor.execute(MojoExecutor.java:213)
at org.apache.maven.lifecycle.internal.MojoExecutor.execute(MojoExecutor.java:153)
at org.apache.maven.lifecycle.internal.MojoExecutor.execute(MojoExecutor.java:145)
at org.apache.maven.lifecycle.internal.MojoExecutor.executeForkedExecutions(MojoExecutor.java:365)
at org.apache.maven.lifecycle.internal.MojoExecutor.execute(MojoExecutor.java:199)
at org.apache.maven.lifecycle.internal.MojoExecutor.execute(MojoExecutor.java:153)
at org.apache.maven.lifecycle.internal.MojoExecutor.execute(MojoExecutor.java:145)
at org.apache.maven.lifecycle.internal.LifecycleModuleBuilder.buildProject(LifecycleModuleBuilder.java:84)
at org.apache.maven.lifecycle.internal.LifecycleModuleBuilder.buildProject(LifecycleModuleBuilder.java:59)
at org.apache.maven.lifecycle.internal.LifecycleStarter.singleThreadedBuild(LifecycleStarter.java:183)
at org.apache.maven.lifecycle.internal.LifecycleStarter.execute(LifecycleStarter.java:161)
at org.apache.maven.DefaultMaven.doExecute(DefaultMaven.java:319)
at org.apache.maven.DefaultMaven.execute(DefaultMaven.java:156)
at org.apache.maven.cli.MavenCli.execute(MavenCli.java:537)
at org.apache.maven.cli.MavenCli.doMain(MavenCli.java:196)
at org.apache.maven.cli.MavenCli.main(MavenCli.java:141)
at sun.reflect.NativeMethodAccessorImpl.invoke0(Native Method)
at sun.reflect.NativeMethodAccessorImpl.invoke(NativeMethodAccessorImpl.java:39)
at sun.reflect.DelegatingMethodAccessorImpl.invoke(DelegatingMethodAccessorImpl.java:25)
at java.lang.reflect.Method.invoke(Method.java:597)
at org.codehaus.plexus.classworlds.launcher.Launcher.launchEnhanced(Launcher.java:290)
at org.codehaus.plexus.classworlds.launcher.Launcher.launch(Launcher.java:230)
at org.codehaus.plexus.classworlds.launcher.Launcher.mainWithExitCode(Launcher.java:409)
at org.codehaus.plexus.classworlds.launcher.Launcher.main(Launcher.java:352)
Caused by: org.apache.maven.plugin.MojoFailureException: There are test failures.
Please refer to <https://builds.apache.org/job/HBase-0.92/ws/trunk/target/surefire-reports> for the individual test results.
at org.apache.maven.plugin.surefire.SurefireHelper.reportExecution(SurefireHelper.java:87)
at org.apache.maven.plugin.surefire.SurefirePlugin.writeSummary(SurefirePlugin.java:641)
at org.apache.maven.plugin.surefire.SurefirePlugin.handleSummary(SurefirePlugin.java:615)
at org.apache.maven.plugin.surefire.AbstractSurefireMojo.executeAfterPreconditionsChecked(AbstractSurefireMojo.java:137)
at org.apache.maven.plugin.surefire.AbstractSurefireMojo.execute(AbstractSurefireMojo.java:98)
at org.apache.maven.plugin.DefaultBuildPluginManager.executeMojo(DefaultBuildPluginManager.java:101)
at org.apache.maven.lifecycle.internal.MojoExecutor.execute(MojoExecutor.java:209)
... 23 more
[ERROR]
[ERROR]
[ERROR] For more information about the errors and possible solutions, please read the following articles:
[ERROR] [Help 1] http://cwiki.apache.org/confluence/display/MAVEN/MojoFailureException
Build step 'Invoke top-level Maven targets' marked build as failure
[locks-and-latches] Releasing all the locks
[locks-and-latches] All the locks released
Archiving artifacts
Recording test results
Updating HBASE-4745
Build failed in Jenkins: HBase-0.92 #110
Posted by Apache Jenkins Server <je...@builds.apache.org>.
See <https://builds.apache.org/job/HBase-0.92/110/changes>
Changes:
[tedyu] HBASE-4747 Upgrade maven surefire plugin to 2.10
------------------------------------------
[...truncated 6467 lines...]
Running org.apache.hadoop.hbase.rest.TestMultiRowResource
Tests run: 3, Failures: 0, Errors: 0, Skipped: 0, Time elapsed: 21.916 sec
Forking command line: /bin/sh -c cd <https://builds.apache.org/job/HBase-0.92/ws/trunk> && /home/jenkins/tools/java/jdk1.6.0_27-32/jre/bin/java -enableassertions -Xmx1400m -jar <https://builds.apache.org/job/HBase-0.92/ws/trunk/target/surefire/surefirebooter6002251520256045641.jar> <https://builds.apache.org/job/HBase-0.92/ws/trunk/target/surefire/surefire4382812903173737324tmp> <https://builds.apache.org/job/HBase-0.92/ws/trunk/target/surefire/surefire3366813259139503256tmp>
Running org.apache.hadoop.hbase.rest.TestScannersWithFilters
Tests run: 10, Failures: 0, Errors: 0, Skipped: 0, Time elapsed: 18.107 sec
Forking command line: /bin/sh -c cd <https://builds.apache.org/job/HBase-0.92/ws/trunk> && /home/jenkins/tools/java/jdk1.6.0_27-32/jre/bin/java -enableassertions -Xmx1400m -jar <https://builds.apache.org/job/HBase-0.92/ws/trunk/target/surefire/surefirebooter523719477366641364.jar> <https://builds.apache.org/job/HBase-0.92/ws/trunk/target/surefire/surefire930393576613777899tmp> <https://builds.apache.org/job/HBase-0.92/ws/trunk/target/surefire/surefire2477238929563191216tmp>
Running org.apache.hadoop.hbase.rest.TestRowResource
Tests run: 11, Failures: 0, Errors: 0, Skipped: 0, Time elapsed: 17.872 sec
Forking command line: /bin/sh -c cd <https://builds.apache.org/job/HBase-0.92/ws/trunk> && /home/jenkins/tools/java/jdk1.6.0_27-32/jre/bin/java -enableassertions -Xmx1400m -jar <https://builds.apache.org/job/HBase-0.92/ws/trunk/target/surefire/surefirebooter3730817170580570358.jar> <https://builds.apache.org/job/HBase-0.92/ws/trunk/target/surefire/surefire2930783438800295011tmp> <https://builds.apache.org/job/HBase-0.92/ws/trunk/target/surefire/surefire897968747862660645tmp>
Running org.apache.hadoop.hbase.rest.model.TestCellModel
Tests run: 3, Failures: 0, Errors: 0, Skipped: 0, Time elapsed: 0.371 sec
Forking command line: /bin/sh -c cd <https://builds.apache.org/job/HBase-0.92/ws/trunk> && /home/jenkins/tools/java/jdk1.6.0_27-32/jre/bin/java -enableassertions -Xmx1400m -jar <https://builds.apache.org/job/HBase-0.92/ws/trunk/target/surefire/surefirebooter2786803525585912730.jar> <https://builds.apache.org/job/HBase-0.92/ws/trunk/target/surefire/surefire6276456424682079414tmp> <https://builds.apache.org/job/HBase-0.92/ws/trunk/target/surefire/surefire2558930967603490223tmp>
Running org.apache.hadoop.hbase.rest.model.TestCellSetModel
Tests run: 3, Failures: 0, Errors: 0, Skipped: 0, Time elapsed: 0.405 sec
Forking command line: /bin/sh -c cd <https://builds.apache.org/job/HBase-0.92/ws/trunk> && /home/jenkins/tools/java/jdk1.6.0_27-32/jre/bin/java -enableassertions -Xmx1400m -jar <https://builds.apache.org/job/HBase-0.92/ws/trunk/target/surefire/surefirebooter7581979443044685556.jar> <https://builds.apache.org/job/HBase-0.92/ws/trunk/target/surefire/surefire5274808593687723501tmp> <https://builds.apache.org/job/HBase-0.92/ws/trunk/target/surefire/surefire8949689477003254331tmp>
Running org.apache.hadoop.hbase.rest.model.TestTableListModel
Tests run: 3, Failures: 0, Errors: 0, Skipped: 0, Time elapsed: 0.385 sec
Forking command line: /bin/sh -c cd <https://builds.apache.org/job/HBase-0.92/ws/trunk> && /home/jenkins/tools/java/jdk1.6.0_27-32/jre/bin/java -enableassertions -Xmx1400m -jar <https://builds.apache.org/job/HBase-0.92/ws/trunk/target/surefire/surefirebooter6223276639126036170.jar> <https://builds.apache.org/job/HBase-0.92/ws/trunk/target/surefire/surefire7674189050817501953tmp> <https://builds.apache.org/job/HBase-0.92/ws/trunk/target/surefire/surefire5007251395475322604tmp>
Running org.apache.hadoop.hbase.rest.model.TestVersionModel
Tests run: 3, Failures: 0, Errors: 0, Skipped: 0, Time elapsed: 0.366 sec
Forking command line: /bin/sh -c cd <https://builds.apache.org/job/HBase-0.92/ws/trunk> && /home/jenkins/tools/java/jdk1.6.0_27-32/jre/bin/java -enableassertions -Xmx1400m -jar <https://builds.apache.org/job/HBase-0.92/ws/trunk/target/surefire/surefirebooter818316543854312149.jar> <https://builds.apache.org/job/HBase-0.92/ws/trunk/target/surefire/surefire5887007214228918279tmp> <https://builds.apache.org/job/HBase-0.92/ws/trunk/target/surefire/surefire6397381303199095776tmp>
Running org.apache.hadoop.hbase.rest.model.TestColumnSchemaModel
Tests run: 2, Failures: 0, Errors: 0, Skipped: 0, Time elapsed: 0.276 sec
Forking command line: /bin/sh -c cd <https://builds.apache.org/job/HBase-0.92/ws/trunk> && /home/jenkins/tools/java/jdk1.6.0_27-32/jre/bin/java -enableassertions -Xmx1400m -jar <https://builds.apache.org/job/HBase-0.92/ws/trunk/target/surefire/surefirebooter9020594771150856375.jar> <https://builds.apache.org/job/HBase-0.92/ws/trunk/target/surefire/surefire8368611472200781228tmp> <https://builds.apache.org/job/HBase-0.92/ws/trunk/target/surefire/surefire5272136977341533680tmp>
Running org.apache.hadoop.hbase.rest.model.TestTableInfoModel
Tests run: 3, Failures: 0, Errors: 0, Skipped: 0, Time elapsed: 0.399 sec
Forking command line: /bin/sh -c cd <https://builds.apache.org/job/HBase-0.92/ws/trunk> && /home/jenkins/tools/java/jdk1.6.0_27-32/jre/bin/java -enableassertions -Xmx1400m -jar <https://builds.apache.org/job/HBase-0.92/ws/trunk/target/surefire/surefirebooter2715748156020485857.jar> <https://builds.apache.org/job/HBase-0.92/ws/trunk/target/surefire/surefire13398094670389042tmp> <https://builds.apache.org/job/HBase-0.92/ws/trunk/target/surefire/surefire2217995379515568823tmp>
Running org.apache.hadoop.hbase.rest.model.TestRowModel
Tests run: 2, Failures: 0, Errors: 0, Skipped: 0, Time elapsed: 0.37 sec
Forking command line: /bin/sh -c cd <https://builds.apache.org/job/HBase-0.92/ws/trunk> && /home/jenkins/tools/java/jdk1.6.0_27-32/jre/bin/java -enableassertions -Xmx1400m -jar <https://builds.apache.org/job/HBase-0.92/ws/trunk/target/surefire/surefirebooter5555879413216057621.jar> <https://builds.apache.org/job/HBase-0.92/ws/trunk/target/surefire/surefire4902779047449912853tmp> <https://builds.apache.org/job/HBase-0.92/ws/trunk/target/surefire/surefire7583742742357128533tmp>
Running org.apache.hadoop.hbase.rest.model.TestTableSchemaModel
Tests run: 3, Failures: 0, Errors: 0, Skipped: 0, Time elapsed: 0.405 sec
Forking command line: /bin/sh -c cd <https://builds.apache.org/job/HBase-0.92/ws/trunk> && /home/jenkins/tools/java/jdk1.6.0_27-32/jre/bin/java -enableassertions -Xmx1400m -jar <https://builds.apache.org/job/HBase-0.92/ws/trunk/target/surefire/surefirebooter8136461197051692996.jar> <https://builds.apache.org/job/HBase-0.92/ws/trunk/target/surefire/surefire894196956895499217tmp> <https://builds.apache.org/job/HBase-0.92/ws/trunk/target/surefire/surefire3268867004838408651tmp>
Running org.apache.hadoop.hbase.rest.model.TestStorageClusterVersionModel
Tests run: 2, Failures: 0, Errors: 0, Skipped: 0, Time elapsed: 0.271 sec
Forking command line: /bin/sh -c cd <https://builds.apache.org/job/HBase-0.92/ws/trunk> && /home/jenkins/tools/java/jdk1.6.0_27-32/jre/bin/java -enableassertions -Xmx1400m -jar <https://builds.apache.org/job/HBase-0.92/ws/trunk/target/surefire/surefirebooter5892159592506773465.jar> <https://builds.apache.org/job/HBase-0.92/ws/trunk/target/surefire/surefire8682794440070646128tmp> <https://builds.apache.org/job/HBase-0.92/ws/trunk/target/surefire/surefire4299094391861748153tmp>
Running org.apache.hadoop.hbase.rest.model.TestTableRegionModel
Tests run: 4, Failures: 0, Errors: 0, Skipped: 0, Time elapsed: 0.469 sec
Forking command line: /bin/sh -c cd <https://builds.apache.org/job/HBase-0.92/ws/trunk> && /home/jenkins/tools/java/jdk1.6.0_27-32/jre/bin/java -enableassertions -Xmx1400m -jar <https://builds.apache.org/job/HBase-0.92/ws/trunk/target/surefire/surefirebooter5250277437311820607.jar> <https://builds.apache.org/job/HBase-0.92/ws/trunk/target/surefire/surefire4776198136399937675tmp> <https://builds.apache.org/job/HBase-0.92/ws/trunk/target/surefire/surefire62934790490917880tmp>
Running org.apache.hadoop.hbase.rest.model.TestStorageClusterStatusModel
Tests run: 3, Failures: 0, Errors: 0, Skipped: 0, Time elapsed: 0.444 sec
Forking command line: /bin/sh -c cd <https://builds.apache.org/job/HBase-0.92/ws/trunk> && /home/jenkins/tools/java/jdk1.6.0_27-32/jre/bin/java -enableassertions -Xmx1400m -jar <https://builds.apache.org/job/HBase-0.92/ws/trunk/target/surefire/surefirebooter3096999131804780189.jar> <https://builds.apache.org/job/HBase-0.92/ws/trunk/target/surefire/surefire4829940717859106163tmp> <https://builds.apache.org/job/HBase-0.92/ws/trunk/target/surefire/surefire3800227877139688312tmp>
Running org.apache.hadoop.hbase.rest.model.TestScannerModel
Tests run: 3, Failures: 0, Errors: 0, Skipped: 0, Time elapsed: 0.406 sec
Forking command line: /bin/sh -c cd <https://builds.apache.org/job/HBase-0.92/ws/trunk> && /home/jenkins/tools/java/jdk1.6.0_27-32/jre/bin/java -enableassertions -Xmx1400m -jar <https://builds.apache.org/job/HBase-0.92/ws/trunk/target/surefire/surefirebooter2019554099625486607.jar> <https://builds.apache.org/job/HBase-0.92/ws/trunk/target/surefire/surefire5511969268278805774tmp> <https://builds.apache.org/job/HBase-0.92/ws/trunk/target/surefire/surefire135599768633706104tmp>
Running org.apache.hadoop.hbase.rest.client.TestRemoteAdmin
Tests run: 1, Failures: 0, Errors: 0, Skipped: 0, Time elapsed: 17.034 sec
Forking command line: /bin/sh -c cd <https://builds.apache.org/job/HBase-0.92/ws/trunk> && /home/jenkins/tools/java/jdk1.6.0_27-32/jre/bin/java -enableassertions -Xmx1400m -jar <https://builds.apache.org/job/HBase-0.92/ws/trunk/target/surefire/surefirebooter8060222840322664892.jar> <https://builds.apache.org/job/HBase-0.92/ws/trunk/target/surefire/surefire8836141551652165061tmp> <https://builds.apache.org/job/HBase-0.92/ws/trunk/target/surefire/surefire4415621137506054459tmp>
Running org.apache.hadoop.hbase.rest.client.TestRemoteTable
Tests run: 3, Failures: 0, Errors: 0, Skipped: 0, Time elapsed: 14.472 sec
Forking command line: /bin/sh -c cd <https://builds.apache.org/job/HBase-0.92/ws/trunk> && /home/jenkins/tools/java/jdk1.6.0_27-32/jre/bin/java -enableassertions -Xmx1400m -jar <https://builds.apache.org/job/HBase-0.92/ws/trunk/target/surefire/surefirebooter2048377400258240227.jar> <https://builds.apache.org/job/HBase-0.92/ws/trunk/target/surefire/surefire5577682484059537615tmp> <https://builds.apache.org/job/HBase-0.92/ws/trunk/target/surefire/surefire8193003690359111252tmp>
Running org.apache.hadoop.hbase.rest.TestVersionResource
Tests run: 7, Failures: 0, Errors: 0, Skipped: 0, Time elapsed: 15.229 sec
Forking command line: /bin/sh -c cd <https://builds.apache.org/job/HBase-0.92/ws/trunk> && /home/jenkins/tools/java/jdk1.6.0_27-32/jre/bin/java -enableassertions -Xmx1400m -jar <https://builds.apache.org/job/HBase-0.92/ws/trunk/target/surefire/surefirebooter3346909503138169365.jar> <https://builds.apache.org/job/HBase-0.92/ws/trunk/target/surefire/surefire5075426682560584949tmp> <https://builds.apache.org/job/HBase-0.92/ws/trunk/target/surefire/surefire8182252523488856673tmp>
Running org.apache.hadoop.hbase.rest.TestScannerResource
Tests run: 5, Failures: 0, Errors: 0, Skipped: 0, Time elapsed: 29.436 sec
Forking command line: /bin/sh -c cd <https://builds.apache.org/job/HBase-0.92/ws/trunk> && /home/jenkins/tools/java/jdk1.6.0_27-32/jre/bin/java -enableassertions -Xmx1400m -jar <https://builds.apache.org/job/HBase-0.92/ws/trunk/target/surefire/surefirebooter5894829502193656820.jar> <https://builds.apache.org/job/HBase-0.92/ws/trunk/target/surefire/surefire3559989107553940048tmp> <https://builds.apache.org/job/HBase-0.92/ws/trunk/target/surefire/surefire4531314483495441499tmp>
Running org.apache.hadoop.hbase.rest.TestTransform
Tests run: 1, Failures: 0, Errors: 0, Skipped: 0, Time elapsed: 21.167 sec
Forking command line: /bin/sh -c cd <https://builds.apache.org/job/HBase-0.92/ws/trunk> && /home/jenkins/tools/java/jdk1.6.0_27-32/jre/bin/java -enableassertions -Xmx1400m -jar <https://builds.apache.org/job/HBase-0.92/ws/trunk/target/surefire/surefirebooter8378225265389984453.jar> <https://builds.apache.org/job/HBase-0.92/ws/trunk/target/surefire/surefire4687371079913420299tmp> <https://builds.apache.org/job/HBase-0.92/ws/trunk/target/surefire/surefire745456072402354915tmp>
Running org.apache.hadoop.hbase.rest.TestTableResource
Tests run: 8, Failures: 0, Errors: 0, Skipped: 0, Time elapsed: 22.817 sec
Forking command line: /bin/sh -c cd <https://builds.apache.org/job/HBase-0.92/ws/trunk> && /home/jenkins/tools/java/jdk1.6.0_27-32/jre/bin/java -enableassertions -Xmx1400m -jar <https://builds.apache.org/job/HBase-0.92/ws/trunk/target/surefire/surefirebooter2676320954412230066.jar> <https://builds.apache.org/job/HBase-0.92/ws/trunk/target/surefire/surefire7328600048367028728tmp> <https://builds.apache.org/job/HBase-0.92/ws/trunk/target/surefire/surefire1940326147734188440tmp>
Running org.apache.hadoop.hbase.rest.TestStatusResource
Tests run: 2, Failures: 0, Errors: 0, Skipped: 0, Time elapsed: 14.365 sec
Forking command line: /bin/sh -c cd <https://builds.apache.org/job/HBase-0.92/ws/trunk> && /home/jenkins/tools/java/jdk1.6.0_27-32/jre/bin/java -enableassertions -Xmx1400m -jar <https://builds.apache.org/job/HBase-0.92/ws/trunk/target/surefire/surefirebooter4465081706024237411.jar> <https://builds.apache.org/job/HBase-0.92/ws/trunk/target/surefire/surefire2585399585364529162tmp> <https://builds.apache.org/job/HBase-0.92/ws/trunk/target/surefire/surefire7441022132861841186tmp>
Running org.apache.hadoop.hbase.rest.TestSchemaResource
Tests run: 2, Failures: 0, Errors: 0, Skipped: 0, Time elapsed: 18.647 sec
Forking command line: /bin/sh -c cd <https://builds.apache.org/job/HBase-0.92/ws/trunk> && /home/jenkins/tools/java/jdk1.6.0_27-32/jre/bin/java -enableassertions -Xmx1400m -jar <https://builds.apache.org/job/HBase-0.92/ws/trunk/target/surefire/surefirebooter4720997291663508055.jar> <https://builds.apache.org/job/HBase-0.92/ws/trunk/target/surefire/surefire962654646054291024tmp> <https://builds.apache.org/job/HBase-0.92/ws/trunk/target/surefire/surefire321760529165761425tmp>
Running org.apache.hadoop.hbase.thrift.TestThriftServer
Tests run: 1, Failures: 0, Errors: 0, Skipped: 0, Time elapsed: 20.423 sec
Forking command line: /bin/sh -c cd <https://builds.apache.org/job/HBase-0.92/ws/trunk> && /home/jenkins/tools/java/jdk1.6.0_27-32/jre/bin/java -enableassertions -Xmx1400m -jar <https://builds.apache.org/job/HBase-0.92/ws/trunk/target/surefire/surefirebooter8329063185510812674.jar> <https://builds.apache.org/job/HBase-0.92/ws/trunk/target/surefire/surefire3146674087163037688tmp> <https://builds.apache.org/job/HBase-0.92/ws/trunk/target/surefire/surefire164578870136079807tmp>
Running org.apache.hadoop.hbase.io.TestHeapSize
Tests run: 2, Failures: 0, Errors: 0, Skipped: 0, Time elapsed: 0.156 sec
Forking command line: /bin/sh -c cd <https://builds.apache.org/job/HBase-0.92/ws/trunk> && /home/jenkins/tools/java/jdk1.6.0_27-32/jre/bin/java -enableassertions -Xmx1400m -jar <https://builds.apache.org/job/HBase-0.92/ws/trunk/target/surefire/surefirebooter564736456563034121.jar> <https://builds.apache.org/job/HBase-0.92/ws/trunk/target/surefire/surefire3800348178672321415tmp> <https://builds.apache.org/job/HBase-0.92/ws/trunk/target/surefire/surefire2035924577486558351tmp>
Running org.apache.hadoop.hbase.io.hfile.TestHFileSeek
Tests run: 1, Failures: 0, Errors: 0, Skipped: 0, Time elapsed: 5.586 sec
Forking command line: /bin/sh -c cd <https://builds.apache.org/job/HBase-0.92/ws/trunk> && /home/jenkins/tools/java/jdk1.6.0_27-32/jre/bin/java -enableassertions -Xmx1400m -jar <https://builds.apache.org/job/HBase-0.92/ws/trunk/target/surefire/surefirebooter1171783501822021898.jar> <https://builds.apache.org/job/HBase-0.92/ws/trunk/target/surefire/surefire7897419363429567475tmp> <https://builds.apache.org/job/HBase-0.92/ws/trunk/target/surefire/surefire4926422792573387056tmp>
Running org.apache.hadoop.hbase.io.hfile.slab.TestSlab
Tests run: 1, Failures: 0, Errors: 0, Skipped: 0, Time elapsed: 0.142 sec
Forking command line: /bin/sh -c cd <https://builds.apache.org/job/HBase-0.92/ws/trunk> && /home/jenkins/tools/java/jdk1.6.0_27-32/jre/bin/java -enableassertions -Xmx1400m -jar <https://builds.apache.org/job/HBase-0.92/ws/trunk/target/surefire/surefirebooter7602301365848622112.jar> <https://builds.apache.org/job/HBase-0.92/ws/trunk/target/surefire/surefire5853016754705968801tmp> <https://builds.apache.org/job/HBase-0.92/ws/trunk/target/surefire/surefire7060288951829298887tmp>
Running org.apache.hadoop.hbase.io.hfile.slab.TestSlabCache
Tests run: 7, Failures: 0, Errors: 0, Skipped: 0, Time elapsed: 19.962 sec
Forking command line: /bin/sh -c cd <https://builds.apache.org/job/HBase-0.92/ws/trunk> && /home/jenkins/tools/java/jdk1.6.0_27-32/jre/bin/java -enableassertions -Xmx1400m -jar <https://builds.apache.org/job/HBase-0.92/ws/trunk/target/surefire/surefirebooter3413542369595503303.jar> <https://builds.apache.org/job/HBase-0.92/ws/trunk/target/surefire/surefire3702455232829217298tmp> <https://builds.apache.org/job/HBase-0.92/ws/trunk/target/surefire/surefire3254205521532789142tmp>
Running org.apache.hadoop.hbase.io.hfile.slab.TestSingleSizeCache
Tests run: 5, Failures: 0, Errors: 0, Skipped: 0, Time elapsed: 24.256 sec
Forking command line: /bin/sh -c cd <https://builds.apache.org/job/HBase-0.92/ws/trunk> && /home/jenkins/tools/java/jdk1.6.0_27-32/jre/bin/java -enableassertions -Xmx1400m -jar <https://builds.apache.org/job/HBase-0.92/ws/trunk/target/surefire/surefirebooter7785908627591476680.jar> <https://builds.apache.org/job/HBase-0.92/ws/trunk/target/surefire/surefire6783170278999406668tmp> <https://builds.apache.org/job/HBase-0.92/ws/trunk/target/surefire/surefire6494879102230391037tmp>
Running org.apache.hadoop.hbase.io.hfile.TestCachedBlockQueue
Tests run: 2, Failures: 0, Errors: 0, Skipped: 0, Time elapsed: 0.103 sec
Forking command line: /bin/sh -c cd <https://builds.apache.org/job/HBase-0.92/ws/trunk> && /home/jenkins/tools/java/jdk1.6.0_27-32/jre/bin/java -enableassertions -Xmx1400m -jar <https://builds.apache.org/job/HBase-0.92/ws/trunk/target/surefire/surefirebooter3975132532652189600.jar> <https://builds.apache.org/job/HBase-0.92/ws/trunk/target/surefire/surefire12088634010307727tmp> <https://builds.apache.org/job/HBase-0.92/ws/trunk/target/surefire/surefire5057547494177503896tmp>
Running org.apache.hadoop.hbase.io.hfile.TestHFileBlockIndex
Tests run: 10, Failures: 0, Errors: 0, Skipped: 0, Time elapsed: 9.985 sec
Forking command line: /bin/sh -c cd <https://builds.apache.org/job/HBase-0.92/ws/trunk> && /home/jenkins/tools/java/jdk1.6.0_27-32/jre/bin/java -enableassertions -Xmx1400m -jar <https://builds.apache.org/job/HBase-0.92/ws/trunk/target/surefire/surefirebooter4299445895784026403.jar> <https://builds.apache.org/job/HBase-0.92/ws/trunk/target/surefire/surefire412956995297805471tmp> <https://builds.apache.org/job/HBase-0.92/ws/trunk/target/surefire/surefire5865083329760581337tmp>
Running org.apache.hadoop.hbase.io.hfile.TestLruBlockCache
Tests run: 7, Failures: 0, Errors: 0, Skipped: 0, Time elapsed: 0.342 sec
Forking command line: /bin/sh -c cd <https://builds.apache.org/job/HBase-0.92/ws/trunk> && /home/jenkins/tools/java/jdk1.6.0_27-32/jre/bin/java -enableassertions -Xmx1400m -jar <https://builds.apache.org/job/HBase-0.92/ws/trunk/target/surefire/surefirebooter7274295141159887614.jar> <https://builds.apache.org/job/HBase-0.92/ws/trunk/target/surefire/surefire7690195470075982672tmp> <https://builds.apache.org/job/HBase-0.92/ws/trunk/target/surefire/surefire4351557947272532168tmp>
Running org.apache.hadoop.hbase.io.hfile.TestHFilePerformance
Tests run: 1, Failures: 0, Errors: 0, Skipped: 0, Time elapsed: 5.794 sec
Forking command line: /bin/sh -c cd <https://builds.apache.org/job/HBase-0.92/ws/trunk> && /home/jenkins/tools/java/jdk1.6.0_27-32/jre/bin/java -enableassertions -Xmx1400m -jar <https://builds.apache.org/job/HBase-0.92/ws/trunk/target/surefire/surefirebooter2558560436418682551.jar> <https://builds.apache.org/job/HBase-0.92/ws/trunk/target/surefire/surefire8037145133151753775tmp> <https://builds.apache.org/job/HBase-0.92/ws/trunk/target/surefire/surefire3919680151012454985tmp>
Running org.apache.hadoop.hbase.io.hfile.TestFixedFileTrailer
Tests run: 2, Failures: 0, Errors: 0, Skipped: 0, Time elapsed: 0.556 sec
Forking command line: /bin/sh -c cd <https://builds.apache.org/job/HBase-0.92/ws/trunk> && /home/jenkins/tools/java/jdk1.6.0_27-32/jre/bin/java -enableassertions -Xmx1400m -jar <https://builds.apache.org/job/HBase-0.92/ws/trunk/target/surefire/surefirebooter3970296568478866516.jar> <https://builds.apache.org/job/HBase-0.92/ws/trunk/target/surefire/surefire7924802866672835577tmp> <https://builds.apache.org/job/HBase-0.92/ws/trunk/target/surefire/surefire7294128829152133508tmp>
Running org.apache.hadoop.hbase.io.hfile.TestHFileWriterV2
Tests run: 1, Failures: 0, Errors: 0, Skipped: 0, Time elapsed: 0.948 sec
Forking command line: /bin/sh -c cd <https://builds.apache.org/job/HBase-0.92/ws/trunk> && /home/jenkins/tools/java/jdk1.6.0_27-32/jre/bin/java -enableassertions -Xmx1400m -jar <https://builds.apache.org/job/HBase-0.92/ws/trunk/target/surefire/surefirebooter1705407905031706845.jar> <https://builds.apache.org/job/HBase-0.92/ws/trunk/target/surefire/surefire8388422484395956265tmp> <https://builds.apache.org/job/HBase-0.92/ws/trunk/target/surefire/surefire803850997446256240tmp>
Running org.apache.hadoop.hbase.io.hfile.TestBlockCacheColumnFamilySummary
Tests run: 4, Failures: 0, Errors: 0, Skipped: 0, Time elapsed: 0.056 sec
Forking command line: /bin/sh -c cd <https://builds.apache.org/job/HBase-0.92/ws/trunk> && /home/jenkins/tools/java/jdk1.6.0_27-32/jre/bin/java -enableassertions -Xmx1400m -jar <https://builds.apache.org/job/HBase-0.92/ws/trunk/target/surefire/surefirebooter4989159189811951902.jar> <https://builds.apache.org/job/HBase-0.92/ws/trunk/target/surefire/surefire8489868810507286779tmp> <https://builds.apache.org/job/HBase-0.92/ws/trunk/target/surefire/surefire3075435636756829585tmp>
Running org.apache.hadoop.hbase.io.hfile.TestHFileReaderV1
Tests run: 1, Failures: 0, Errors: 0, Skipped: 0, Time elapsed: 0.569 sec
Forking command line: /bin/sh -c cd <https://builds.apache.org/job/HBase-0.92/ws/trunk> && /home/jenkins/tools/java/jdk1.6.0_27-32/jre/bin/java -enableassertions -Xmx1400m -jar <https://builds.apache.org/job/HBase-0.92/ws/trunk/target/surefire/surefirebooter904597573925840008.jar> <https://builds.apache.org/job/HBase-0.92/ws/trunk/target/surefire/surefire7894598606054342871tmp> <https://builds.apache.org/job/HBase-0.92/ws/trunk/target/surefire/surefire7844008743089311253tmp>
Running org.apache.hadoop.hbase.io.hfile.TestHFile
Tests run: 6, Failures: 0, Errors: 0, Skipped: 0, Time elapsed: 0.864 sec
Forking command line: /bin/sh -c cd <https://builds.apache.org/job/HBase-0.92/ws/trunk> && /home/jenkins/tools/java/jdk1.6.0_27-32/jre/bin/java -enableassertions -Xmx1400m -jar <https://builds.apache.org/job/HBase-0.92/ws/trunk/target/surefire/surefirebooter5733204951687782684.jar> <https://builds.apache.org/job/HBase-0.92/ws/trunk/target/surefire/surefire2162540330930400763tmp> <https://builds.apache.org/job/HBase-0.92/ws/trunk/target/surefire/surefire5867175863007838709tmp>
Running org.apache.hadoop.hbase.io.hfile.TestReseekTo
Tests run: 1, Failures: 0, Errors: 0, Skipped: 0, Time elapsed: 0.639 sec
Forking command line: /bin/sh -c cd <https://builds.apache.org/job/HBase-0.92/ws/trunk> && /home/jenkins/tools/java/jdk1.6.0_27-32/jre/bin/java -enableassertions -Xmx1400m -jar <https://builds.apache.org/job/HBase-0.92/ws/trunk/target/surefire/surefirebooter4090504210226406747.jar> <https://builds.apache.org/job/HBase-0.92/ws/trunk/target/surefire/surefire6884411344504142932tmp> <https://builds.apache.org/job/HBase-0.92/ws/trunk/target/surefire/surefire7086004441495007839tmp>
Running org.apache.hadoop.hbase.io.hfile.TestHFileBlock
Tests run: 7, Failures: 0, Errors: 0, Skipped: 0, Time elapsed: 25.657 sec
Forking command line: /bin/sh -c cd <https://builds.apache.org/job/HBase-0.92/ws/trunk> && /home/jenkins/tools/java/jdk1.6.0_27-32/jre/bin/java -enableassertions -Xmx1400m -jar <https://builds.apache.org/job/HBase-0.92/ws/trunk/target/surefire/surefirebooter84693109138294944.jar> <https://builds.apache.org/job/HBase-0.92/ws/trunk/target/surefire/surefire5000639776226718542tmp> <https://builds.apache.org/job/HBase-0.92/ws/trunk/target/surefire/surefire722392608548792147tmp>
Running org.apache.hadoop.hbase.io.hfile.TestSeekTo
Tests run: 3, Failures: 0, Errors: 0, Skipped: 0, Time elapsed: 0.65 sec
Forking command line: /bin/sh -c cd <https://builds.apache.org/job/HBase-0.92/ws/trunk> && /home/jenkins/tools/java/jdk1.6.0_27-32/jre/bin/java -enableassertions -Xmx1400m -jar <https://builds.apache.org/job/HBase-0.92/ws/trunk/target/surefire/surefirebooter2409932057780284488.jar> <https://builds.apache.org/job/HBase-0.92/ws/trunk/target/surefire/surefire2005477324193471132tmp> <https://builds.apache.org/job/HBase-0.92/ws/trunk/target/surefire/surefire6206403206181592401tmp>
Running org.apache.hadoop.hbase.io.hfile.TestCacheOnWrite
Tests run: 6, Failures: 0, Errors: 0, Skipped: 0, Time elapsed: 7.455 sec
Forking command line: /bin/sh -c cd <https://builds.apache.org/job/HBase-0.92/ws/trunk> && /home/jenkins/tools/java/jdk1.6.0_27-32/jre/bin/java -enableassertions -Xmx1400m -jar <https://builds.apache.org/job/HBase-0.92/ws/trunk/target/surefire/surefirebooter6277169662116185756.jar> <https://builds.apache.org/job/HBase-0.92/ws/trunk/target/surefire/surefire5987556463332856658tmp> <https://builds.apache.org/job/HBase-0.92/ws/trunk/target/surefire/surefire5130439822319174849tmp>
Running org.apache.hadoop.hbase.io.TestHbaseObjectWritable
Tests run: 4, Failures: 0, Errors: 0, Skipped: 0, Time elapsed: 0.466 sec
Forking command line: /bin/sh -c cd <https://builds.apache.org/job/HBase-0.92/ws/trunk> && /home/jenkins/tools/java/jdk1.6.0_27-32/jre/bin/java -enableassertions -Xmx1400m -jar <https://builds.apache.org/job/HBase-0.92/ws/trunk/target/surefire/surefirebooter1725704955896393934.jar> <https://builds.apache.org/job/HBase-0.92/ws/trunk/target/surefire/surefire821804375273370947tmp> <https://builds.apache.org/job/HBase-0.92/ws/trunk/target/surefire/surefire870335838402541788tmp>
Running org.apache.hadoop.hbase.io.TestImmutableBytesWritable
Tests run: 3, Failures: 0, Errors: 0, Skipped: 0, Time elapsed: 0.109 sec
Forking command line: /bin/sh -c cd <https://builds.apache.org/job/HBase-0.92/ws/trunk> && /home/jenkins/tools/java/jdk1.6.0_27-32/jre/bin/java -enableassertions -Xmx1400m -jar <https://builds.apache.org/job/HBase-0.92/ws/trunk/target/surefire/surefirebooter5826330604722104085.jar> <https://builds.apache.org/job/HBase-0.92/ws/trunk/target/surefire/surefire2222060583404238101tmp> <https://builds.apache.org/job/HBase-0.92/ws/trunk/target/surefire/surefire575363656257410942tmp>
Running org.apache.hadoop.hbase.io.TestHalfStoreFileReader
Tests run: 1, Failures: 0, Errors: 0, Skipped: 0, Time elapsed: 0.684 sec
Forking command line: /bin/sh -c cd <https://builds.apache.org/job/HBase-0.92/ws/trunk> && /home/jenkins/tools/java/jdk1.6.0_27-32/jre/bin/java -enableassertions -Xmx1400m -jar <https://builds.apache.org/job/HBase-0.92/ws/trunk/target/surefire/surefirebooter5755072332225848631.jar> <https://builds.apache.org/job/HBase-0.92/ws/trunk/target/surefire/surefire795808907609189238tmp> <https://builds.apache.org/job/HBase-0.92/ws/trunk/target/surefire/surefire5715602057427516645tmp>
Running org.apache.hadoop.hbase.migration.TestMigrationFrom090To092
Tests run: 1, Failures: 0, Errors: 0, Skipped: 0, Time elapsed: 0.271 sec
Forking command line: /bin/sh -c cd <https://builds.apache.org/job/HBase-0.92/ws/trunk> && /home/jenkins/tools/java/jdk1.6.0_27-32/jre/bin/java -enableassertions -Xmx1400m -jar <https://builds.apache.org/job/HBase-0.92/ws/trunk/target/surefire/surefirebooter7668175931737815458.jar> <https://builds.apache.org/job/HBase-0.92/ws/trunk/target/surefire/surefire3177311835619122463tmp> <https://builds.apache.org/job/HBase-0.92/ws/trunk/target/surefire/surefire778709470507600285tmp>
Running org.apache.hadoop.hbase.TestFSTableDescriptorForceCreation
Tests run: 3, Failures: 0, Errors: 0, Skipped: 0, Time elapsed: 0.519 sec
Forking command line: /bin/sh -c cd <https://builds.apache.org/job/HBase-0.92/ws/trunk> && /home/jenkins/tools/java/jdk1.6.0_27-32/jre/bin/java -enableassertions -Xmx1400m -jar <https://builds.apache.org/job/HBase-0.92/ws/trunk/target/surefire/surefirebooter1753817896852478939.jar> <https://builds.apache.org/job/HBase-0.92/ws/trunk/target/surefire/surefire8279662145085761435tmp> <https://builds.apache.org/job/HBase-0.92/ws/trunk/target/surefire/surefire7296260635887178687tmp>
Running org.apache.hadoop.hbase.avro.TestAvroUtil
Tests run: 1, Failures: 0, Errors: 0, Skipped: 0, Time elapsed: 0.628 sec
Forking command line: /bin/sh -c cd <https://builds.apache.org/job/HBase-0.92/ws/trunk> && /home/jenkins/tools/java/jdk1.6.0_27-32/jre/bin/java -enableassertions -Xmx1400m -jar <https://builds.apache.org/job/HBase-0.92/ws/trunk/target/surefire/surefirebooter1900581760731967207.jar> <https://builds.apache.org/job/HBase-0.92/ws/trunk/target/surefire/surefire7477234841745906119tmp> <https://builds.apache.org/job/HBase-0.92/ws/trunk/target/surefire/surefire7272660066711048966tmp>
Running org.apache.hadoop.hbase.avro.TestAvroServer
Tests run: 3, Failures: 0, Errors: 0, Skipped: 0, Time elapsed: 30.944 sec
Forking command line: /bin/sh -c cd <https://builds.apache.org/job/HBase-0.92/ws/trunk> && /home/jenkins/tools/java/jdk1.6.0_27-32/jre/bin/java -enableassertions -Xmx1400m -jar <https://builds.apache.org/job/HBase-0.92/ws/trunk/target/surefire/surefirebooter877975227190403139.jar> <https://builds.apache.org/job/HBase-0.92/ws/trunk/target/surefire/surefire6218743663213741697tmp> <https://builds.apache.org/job/HBase-0.92/ws/trunk/target/surefire/surefire5625878084875251846tmp>
Running org.apache.hadoop.hbase.TestKeyValue
Tests run: 11, Failures: 0, Errors: 0, Skipped: 0, Time elapsed: 0.129 sec
Forking command line: /bin/sh -c cd <https://builds.apache.org/job/HBase-0.92/ws/trunk> && /home/jenkins/tools/java/jdk1.6.0_27-32/jre/bin/java -enableassertions -Xmx1400m -jar <https://builds.apache.org/job/HBase-0.92/ws/trunk/target/surefire/surefirebooter6132185368177813675.jar> <https://builds.apache.org/job/HBase-0.92/ws/trunk/target/surefire/surefire9181313643579479839tmp> <https://builds.apache.org/job/HBase-0.92/ws/trunk/target/surefire/surefire4587729008461973860tmp>
Running org.apache.hadoop.hbase.replication.TestMultiSlaveReplication
Tests run: 1, Failures: 0, Errors: 0, Skipped: 0, Time elapsed: 47.056 sec
Forking command line: /bin/sh -c cd <https://builds.apache.org/job/HBase-0.92/ws/trunk> && /home/jenkins/tools/java/jdk1.6.0_27-32/jre/bin/java -enableassertions -Xmx1400m -jar <https://builds.apache.org/job/HBase-0.92/ws/trunk/target/surefire/surefirebooter9028583813313065218.jar> <https://builds.apache.org/job/HBase-0.92/ws/trunk/target/surefire/surefire6098241485729540090tmp> <https://builds.apache.org/job/HBase-0.92/ws/trunk/target/surefire/surefire2686686588339192218tmp>
Running org.apache.hadoop.hbase.replication.regionserver.TestReplicationSourceManager
Tests run: 1, Failures: 0, Errors: 0, Skipped: 0, Time elapsed: 0.901 sec
Forking command line: /bin/sh -c cd <https://builds.apache.org/job/HBase-0.92/ws/trunk> && /home/jenkins/tools/java/jdk1.6.0_27-32/jre/bin/java -enableassertions -Xmx1400m -jar <https://builds.apache.org/job/HBase-0.92/ws/trunk/target/surefire/surefirebooter1064843663721239089.jar> <https://builds.apache.org/job/HBase-0.92/ws/trunk/target/surefire/surefire8628969643523473703tmp> <https://builds.apache.org/job/HBase-0.92/ws/trunk/target/surefire/surefire3844665613716287533tmp>
Running org.apache.hadoop.hbase.replication.regionserver.TestReplicationSink
Tests run: 5, Failures: 0, Errors: 0, Skipped: 0, Time elapsed: 17.807 sec
Forking command line: /bin/sh -c cd <https://builds.apache.org/job/HBase-0.92/ws/trunk> && /home/jenkins/tools/java/jdk1.6.0_27-32/jre/bin/java -enableassertions -Xmx1400m -jar <https://builds.apache.org/job/HBase-0.92/ws/trunk/target/surefire/surefirebooter1153226530632023577.jar> <https://builds.apache.org/job/HBase-0.92/ws/trunk/target/surefire/surefire1601751942381345090tmp> <https://builds.apache.org/job/HBase-0.92/ws/trunk/target/surefire/surefire3183238770814524533tmp>
Running org.apache.hadoop.hbase.replication.TestMasterReplication
Tests run: 2, Failures: 0, Errors: 0, Skipped: 0, Time elapsed: 81.441 sec
Forking command line: /bin/sh -c cd <https://builds.apache.org/job/HBase-0.92/ws/trunk> && /home/jenkins/tools/java/jdk1.6.0_27-32/jre/bin/java -enableassertions -Xmx1400m -jar <https://builds.apache.org/job/HBase-0.92/ws/trunk/target/surefire/surefirebooter318863547768721255.jar> <https://builds.apache.org/job/HBase-0.92/ws/trunk/target/surefire/surefire1476029966770736387tmp> <https://builds.apache.org/job/HBase-0.92/ws/trunk/target/surefire/surefire1678094374802411875tmp>
Running org.apache.hadoop.hbase.replication.TestReplicationSource
Tests run: 1, Failures: 0, Errors: 0, Skipped: 0, Time elapsed: 2.704 sec
Forking command line: /bin/sh -c cd <https://builds.apache.org/job/HBase-0.92/ws/trunk> && /home/jenkins/tools/java/jdk1.6.0_27-32/jre/bin/java -enableassertions -Xmx1400m -jar <https://builds.apache.org/job/HBase-0.92/ws/trunk/target/surefire/surefirebooter6905944368374375353.jar> <https://builds.apache.org/job/HBase-0.92/ws/trunk/target/surefire/surefire6704916657543770543tmp> <https://builds.apache.org/job/HBase-0.92/ws/trunk/target/surefire/surefire1162875709096308879tmp>
Running org.apache.hadoop.hbase.replication.TestReplicationPeer
Tests run: 1, Failures: 0, Errors: 0, Skipped: 0, Time elapsed: 25.511 sec
Forking command line: /bin/sh -c cd <https://builds.apache.org/job/HBase-0.92/ws/trunk> && /home/jenkins/tools/java/jdk1.6.0_27-32/jre/bin/java -enableassertions -Xmx1400m -jar <https://builds.apache.org/job/HBase-0.92/ws/trunk/target/surefire/surefirebooter3045852068222715710.jar> <https://builds.apache.org/job/HBase-0.92/ws/trunk/target/surefire/surefire2245476263517741264tmp> <https://builds.apache.org/job/HBase-0.92/ws/trunk/target/surefire/surefire6180533291944947863tmp>
Running org.apache.hadoop.hbase.replication.TestReplication
Tests run: 7, Failures: 0, Errors: 0, Skipped: 0, Time elapsed: 167.202 sec
Forking command line: /bin/sh -c cd <https://builds.apache.org/job/HBase-0.92/ws/trunk> && /home/jenkins/tools/java/jdk1.6.0_27-32/jre/bin/java -enableassertions -Xmx1400m -jar <https://builds.apache.org/job/HBase-0.92/ws/trunk/target/surefire/surefirebooter8165450844809088008.jar> <https://builds.apache.org/job/HBase-0.92/ws/trunk/target/surefire/surefire5069418997375975227tmp> <https://builds.apache.org/job/HBase-0.92/ws/trunk/target/surefire/surefire6039694559301291772tmp>
Running org.apache.hadoop.hbase.ipc.TestDelayedRpc
Tests run: 4, Failures: 0, Errors: 0, Skipped: 0, Time elapsed: 2.514 sec
Forking command line: /bin/sh -c cd <https://builds.apache.org/job/HBase-0.92/ws/trunk> && /home/jenkins/tools/java/jdk1.6.0_27-32/jre/bin/java -enableassertions -Xmx1400m -jar <https://builds.apache.org/job/HBase-0.92/ws/trunk/target/surefire/surefirebooter5850860657246782831.jar> <https://builds.apache.org/job/HBase-0.92/ws/trunk/target/surefire/surefire8379534279072891946tmp> <https://builds.apache.org/job/HBase-0.92/ws/trunk/target/surefire/surefire1756034669059409166tmp>
Running org.apache.hadoop.hbase.TestCompare
Tests run: 1, Failures: 0, Errors: 0, Skipped: 0, Time elapsed: 0.238 sec
Forking command line: /bin/sh -c cd <https://builds.apache.org/job/HBase-0.92/ws/trunk> && /home/jenkins/tools/java/jdk1.6.0_27-32/jre/bin/java -enableassertions -Xmx1400m -jar <https://builds.apache.org/job/HBase-0.92/ws/trunk/target/surefire/surefirebooter841450549912598284.jar> <https://builds.apache.org/job/HBase-0.92/ws/trunk/target/surefire/surefire5872534660376654747tmp> <https://builds.apache.org/job/HBase-0.92/ws/trunk/target/surefire/surefire5059258959660179482tmp>
Running org.apache.hadoop.hbase.TestZooKeeper
Tests run: 7, Failures: 0, Errors: 0, Skipped: 0, Time elapsed: 82.54 sec
Forking command line: /bin/sh -c cd <https://builds.apache.org/job/HBase-0.92/ws/trunk> && /home/jenkins/tools/java/jdk1.6.0_27-32/jre/bin/java -enableassertions -Xmx1400m -jar <https://builds.apache.org/job/HBase-0.92/ws/trunk/target/surefire/surefirebooter5580496704605290115.jar> <https://builds.apache.org/job/HBase-0.92/ws/trunk/target/surefire/surefire3777062692901694713tmp> <https://builds.apache.org/job/HBase-0.92/ws/trunk/target/surefire/surefire68433143653864227tmp>
Running org.apache.hadoop.hbase.TestHBaseTestingUtility
Tests run: 7, Failures: 0, Errors: 0, Skipped: 0, Time elapsed: 76.871 sec
Results :
Tests in error:
testMasterFailoverWithMockedRITOnDeadRS(org.apache.hadoop.hbase.master.TestMasterFailover): test timed out after 180000 milliseconds
Tests run: 1051, Failures: 0, Errors: 1, Skipped: 10
[INFO] ------------------------------------------------------------------------
[INFO] BUILD FAILURE
[INFO] ------------------------------------------------------------------------
[INFO] Total time: 1:42:19.529s
[INFO] Finished at: Sat Nov 05 02:42:14 UTC 2011
[INFO] Final Memory: 43M/576M
[INFO] ------------------------------------------------------------------------
[ERROR] Failed to execute goal org.apache.maven.plugins:maven-surefire-plugin:2.10:test (default-test) on project hbase: There are test failures.
[ERROR]
[ERROR] Please refer to <https://builds.apache.org/job/HBase-0.92/ws/trunk/target/surefire-reports> for the individual test results.
[ERROR] -> [Help 1]
org.apache.maven.lifecycle.LifecycleExecutionException: Failed to execute goal org.apache.maven.plugins:maven-surefire-plugin:2.10:test (default-test) on project hbase: There are test failures.
Please refer to <https://builds.apache.org/job/HBase-0.92/ws/trunk/target/surefire-reports> for the individual test results.
at org.apache.maven.lifecycle.internal.MojoExecutor.execute(MojoExecutor.java:213)
at org.apache.maven.lifecycle.internal.MojoExecutor.execute(MojoExecutor.java:153)
at org.apache.maven.lifecycle.internal.MojoExecutor.execute(MojoExecutor.java:145)
at org.apache.maven.lifecycle.internal.MojoExecutor.executeForkedExecutions(MojoExecutor.java:365)
at org.apache.maven.lifecycle.internal.MojoExecutor.execute(MojoExecutor.java:199)
at org.apache.maven.lifecycle.internal.MojoExecutor.execute(MojoExecutor.java:153)
at org.apache.maven.lifecycle.internal.MojoExecutor.execute(MojoExecutor.java:145)
at org.apache.maven.lifecycle.internal.LifecycleModuleBuilder.buildProject(LifecycleModuleBuilder.java:84)
at org.apache.maven.lifecycle.internal.LifecycleModuleBuilder.buildProject(LifecycleModuleBuilder.java:59)
at org.apache.maven.lifecycle.internal.LifecycleStarter.singleThreadedBuild(LifecycleStarter.java:183)
at org.apache.maven.lifecycle.internal.LifecycleStarter.execute(LifecycleStarter.java:161)
at org.apache.maven.DefaultMaven.doExecute(DefaultMaven.java:319)
at org.apache.maven.DefaultMaven.execute(DefaultMaven.java:156)
at org.apache.maven.cli.MavenCli.execute(MavenCli.java:537)
at org.apache.maven.cli.MavenCli.doMain(MavenCli.java:196)
at org.apache.maven.cli.MavenCli.main(MavenCli.java:141)
at sun.reflect.NativeMethodAccessorImpl.invoke0(Native Method)
at sun.reflect.NativeMethodAccessorImpl.invoke(NativeMethodAccessorImpl.java:39)
at sun.reflect.DelegatingMethodAccessorImpl.invoke(DelegatingMethodAccessorImpl.java:25)
at java.lang.reflect.Method.invoke(Method.java:597)
at org.codehaus.plexus.classworlds.launcher.Launcher.launchEnhanced(Launcher.java:290)
at org.codehaus.plexus.classworlds.launcher.Launcher.launch(Launcher.java:230)
at org.codehaus.plexus.classworlds.launcher.Launcher.mainWithExitCode(Launcher.java:409)
at org.codehaus.plexus.classworlds.launcher.Launcher.main(Launcher.java:352)
Caused by: org.apache.maven.plugin.MojoFailureException: There are test failures.
Please refer to <https://builds.apache.org/job/HBase-0.92/ws/trunk/target/surefire-reports> for the individual test results.
at org.apache.maven.plugin.surefire.SurefireHelper.reportExecution(SurefireHelper.java:87)
at org.apache.maven.plugin.surefire.SurefirePlugin.writeSummary(SurefirePlugin.java:641)
at org.apache.maven.plugin.surefire.SurefirePlugin.handleSummary(SurefirePlugin.java:615)
at org.apache.maven.plugin.surefire.AbstractSurefireMojo.executeAfterPreconditionsChecked(AbstractSurefireMojo.java:137)
at org.apache.maven.plugin.surefire.AbstractSurefireMojo.execute(AbstractSurefireMojo.java:98)
at org.apache.maven.plugin.DefaultBuildPluginManager.executeMojo(DefaultBuildPluginManager.java:101)
at org.apache.maven.lifecycle.internal.MojoExecutor.execute(MojoExecutor.java:209)
... 23 more
[ERROR]
[ERROR]
[ERROR] For more information about the errors and possible solutions, please read the following articles:
[ERROR] [Help 1] http://cwiki.apache.org/confluence/display/MAVEN/MojoFailureException
Build step 'Invoke top-level Maven targets' marked build as failure
[locks-and-latches] Releasing all the locks
[locks-and-latches] All the locks released
Archiving artifacts
Recording test results
Updating HBASE-4747
Build failed in Jenkins: HBase-0.92 #109
Posted by Apache Jenkins Server <je...@builds.apache.org>.
See <https://builds.apache.org/job/HBase-0.92/109/changes>
Changes:
[stack] HBASE-4725 NPE in AM#updateTimers
[stack] HBASE-4553 The update of .tableinfo is not atomic; we remove then rename
------------------------------------------
[...truncated 6437 lines...]
Running org.apache.hadoop.hbase.rest.TestScannersWithFilters
Tests run: 10, Failures: 0, Errors: 0, Skipped: 0, Time elapsed: 17.897 sec
Forking command line: /bin/sh -c cd <https://builds.apache.org/job/HBase-0.92/ws/trunk> && /home/jenkins/tools/java/jdk1.6.0_27-32/jre/bin/java -enableassertions -Xmx1400m -jar <https://builds.apache.org/job/HBase-0.92/ws/trunk/target/surefire/surefirebooter1850798039401932307.jar> <https://builds.apache.org/job/HBase-0.92/ws/trunk/target/surefire/surefire2888426370069805432tmp> <https://builds.apache.org/job/HBase-0.92/ws/trunk/target/surefire/surefire7713501070052236173tmp>
Running org.apache.hadoop.hbase.rest.TestRowResource
Tests run: 11, Failures: 0, Errors: 0, Skipped: 0, Time elapsed: 23.117 sec
Forking command line: /bin/sh -c cd <https://builds.apache.org/job/HBase-0.92/ws/trunk> && /home/jenkins/tools/java/jdk1.6.0_27-32/jre/bin/java -enableassertions -Xmx1400m -jar <https://builds.apache.org/job/HBase-0.92/ws/trunk/target/surefire/surefirebooter7208028311159771943.jar> <https://builds.apache.org/job/HBase-0.92/ws/trunk/target/surefire/surefire2716701765070049241tmp> <https://builds.apache.org/job/HBase-0.92/ws/trunk/target/surefire/surefire3098488466737412358tmp>
Running org.apache.hadoop.hbase.rest.model.TestCellModel
Tests run: 3, Failures: 0, Errors: 0, Skipped: 0, Time elapsed: 0.377 sec
Forking command line: /bin/sh -c cd <https://builds.apache.org/job/HBase-0.92/ws/trunk> && /home/jenkins/tools/java/jdk1.6.0_27-32/jre/bin/java -enableassertions -Xmx1400m -jar <https://builds.apache.org/job/HBase-0.92/ws/trunk/target/surefire/surefirebooter7750882421188317934.jar> <https://builds.apache.org/job/HBase-0.92/ws/trunk/target/surefire/surefire300820343858040705tmp> <https://builds.apache.org/job/HBase-0.92/ws/trunk/target/surefire/surefire7884489291233452306tmp>
Running org.apache.hadoop.hbase.rest.model.TestCellSetModel
Tests run: 3, Failures: 0, Errors: 0, Skipped: 0, Time elapsed: 0.419 sec
Forking command line: /bin/sh -c cd <https://builds.apache.org/job/HBase-0.92/ws/trunk> && /home/jenkins/tools/java/jdk1.6.0_27-32/jre/bin/java -enableassertions -Xmx1400m -jar <https://builds.apache.org/job/HBase-0.92/ws/trunk/target/surefire/surefirebooter4004805382537488750.jar> <https://builds.apache.org/job/HBase-0.92/ws/trunk/target/surefire/surefire2698185005770752301tmp> <https://builds.apache.org/job/HBase-0.92/ws/trunk/target/surefire/surefire8136151152618799289tmp>
Running org.apache.hadoop.hbase.rest.model.TestTableListModel
Tests run: 3, Failures: 0, Errors: 0, Skipped: 0, Time elapsed: 0.431 sec
Forking command line: /bin/sh -c cd <https://builds.apache.org/job/HBase-0.92/ws/trunk> && /home/jenkins/tools/java/jdk1.6.0_27-32/jre/bin/java -enableassertions -Xmx1400m -jar <https://builds.apache.org/job/HBase-0.92/ws/trunk/target/surefire/surefirebooter3765230179646779079.jar> <https://builds.apache.org/job/HBase-0.92/ws/trunk/target/surefire/surefire8579983439387418016tmp> <https://builds.apache.org/job/HBase-0.92/ws/trunk/target/surefire/surefire1397023172563566034tmp>
Running org.apache.hadoop.hbase.rest.model.TestVersionModel
Tests run: 3, Failures: 0, Errors: 0, Skipped: 0, Time elapsed: 0.369 sec
Forking command line: /bin/sh -c cd <https://builds.apache.org/job/HBase-0.92/ws/trunk> && /home/jenkins/tools/java/jdk1.6.0_27-32/jre/bin/java -enableassertions -Xmx1400m -jar <https://builds.apache.org/job/HBase-0.92/ws/trunk/target/surefire/surefirebooter6139289791423067849.jar> <https://builds.apache.org/job/HBase-0.92/ws/trunk/target/surefire/surefire713689820641198468tmp> <https://builds.apache.org/job/HBase-0.92/ws/trunk/target/surefire/surefire5873363352354833531tmp>
Running org.apache.hadoop.hbase.rest.model.TestColumnSchemaModel
Tests run: 2, Failures: 0, Errors: 0, Skipped: 0, Time elapsed: 0.278 sec
Forking command line: /bin/sh -c cd <https://builds.apache.org/job/HBase-0.92/ws/trunk> && /home/jenkins/tools/java/jdk1.6.0_27-32/jre/bin/java -enableassertions -Xmx1400m -jar <https://builds.apache.org/job/HBase-0.92/ws/trunk/target/surefire/surefirebooter2287495878235102168.jar> <https://builds.apache.org/job/HBase-0.92/ws/trunk/target/surefire/surefire6763185253263751431tmp> <https://builds.apache.org/job/HBase-0.92/ws/trunk/target/surefire/surefire5222569800670489304tmp>
Running org.apache.hadoop.hbase.rest.model.TestTableInfoModel
Tests run: 3, Failures: 0, Errors: 0, Skipped: 0, Time elapsed: 0.413 sec
Forking command line: /bin/sh -c cd <https://builds.apache.org/job/HBase-0.92/ws/trunk> && /home/jenkins/tools/java/jdk1.6.0_27-32/jre/bin/java -enableassertions -Xmx1400m -jar <https://builds.apache.org/job/HBase-0.92/ws/trunk/target/surefire/surefirebooter6928782671210849650.jar> <https://builds.apache.org/job/HBase-0.92/ws/trunk/target/surefire/surefire6960463226118651498tmp> <https://builds.apache.org/job/HBase-0.92/ws/trunk/target/surefire/surefire5963281870525192588tmp>
Running org.apache.hadoop.hbase.rest.model.TestRowModel
Tests run: 2, Failures: 0, Errors: 0, Skipped: 0, Time elapsed: 0.376 sec
Forking command line: /bin/sh -c cd <https://builds.apache.org/job/HBase-0.92/ws/trunk> && /home/jenkins/tools/java/jdk1.6.0_27-32/jre/bin/java -enableassertions -Xmx1400m -jar <https://builds.apache.org/job/HBase-0.92/ws/trunk/target/surefire/surefirebooter5776358492123736289.jar> <https://builds.apache.org/job/HBase-0.92/ws/trunk/target/surefire/surefire992291190694509307tmp> <https://builds.apache.org/job/HBase-0.92/ws/trunk/target/surefire/surefire3403890531266398453tmp>
Running org.apache.hadoop.hbase.rest.model.TestTableSchemaModel
Tests run: 3, Failures: 0, Errors: 0, Skipped: 0, Time elapsed: 0.415 sec
Forking command line: /bin/sh -c cd <https://builds.apache.org/job/HBase-0.92/ws/trunk> && /home/jenkins/tools/java/jdk1.6.0_27-32/jre/bin/java -enableassertions -Xmx1400m -jar <https://builds.apache.org/job/HBase-0.92/ws/trunk/target/surefire/surefirebooter7302227478777236689.jar> <https://builds.apache.org/job/HBase-0.92/ws/trunk/target/surefire/surefire7587074893807089469tmp> <https://builds.apache.org/job/HBase-0.92/ws/trunk/target/surefire/surefire1229051317703082778tmp>
Running org.apache.hadoop.hbase.rest.model.TestStorageClusterVersionModel
Tests run: 2, Failures: 0, Errors: 0, Skipped: 0, Time elapsed: 0.305 sec
Forking command line: /bin/sh -c cd <https://builds.apache.org/job/HBase-0.92/ws/trunk> && /home/jenkins/tools/java/jdk1.6.0_27-32/jre/bin/java -enableassertions -Xmx1400m -jar <https://builds.apache.org/job/HBase-0.92/ws/trunk/target/surefire/surefirebooter3329006046681118778.jar> <https://builds.apache.org/job/HBase-0.92/ws/trunk/target/surefire/surefire4480495811850588095tmp> <https://builds.apache.org/job/HBase-0.92/ws/trunk/target/surefire/surefire6124712988555024730tmp>
Running org.apache.hadoop.hbase.rest.model.TestTableRegionModel
Tests run: 4, Failures: 0, Errors: 0, Skipped: 0, Time elapsed: 0.471 sec
Forking command line: /bin/sh -c cd <https://builds.apache.org/job/HBase-0.92/ws/trunk> && /home/jenkins/tools/java/jdk1.6.0_27-32/jre/bin/java -enableassertions -Xmx1400m -jar <https://builds.apache.org/job/HBase-0.92/ws/trunk/target/surefire/surefirebooter6055018977227103433.jar> <https://builds.apache.org/job/HBase-0.92/ws/trunk/target/surefire/surefire4234026315211011964tmp> <https://builds.apache.org/job/HBase-0.92/ws/trunk/target/surefire/surefire2635655616414423331tmp>
Running org.apache.hadoop.hbase.rest.model.TestStorageClusterStatusModel
Tests run: 3, Failures: 0, Errors: 0, Skipped: 0, Time elapsed: 0.462 sec
Forking command line: /bin/sh -c cd <https://builds.apache.org/job/HBase-0.92/ws/trunk> && /home/jenkins/tools/java/jdk1.6.0_27-32/jre/bin/java -enableassertions -Xmx1400m -jar <https://builds.apache.org/job/HBase-0.92/ws/trunk/target/surefire/surefirebooter6549967479809572005.jar> <https://builds.apache.org/job/HBase-0.92/ws/trunk/target/surefire/surefire8347074226663085923tmp> <https://builds.apache.org/job/HBase-0.92/ws/trunk/target/surefire/surefire6299079259488036009tmp>
Running org.apache.hadoop.hbase.rest.model.TestScannerModel
Tests run: 3, Failures: 0, Errors: 0, Skipped: 0, Time elapsed: 0.411 sec
Forking command line: /bin/sh -c cd <https://builds.apache.org/job/HBase-0.92/ws/trunk> && /home/jenkins/tools/java/jdk1.6.0_27-32/jre/bin/java -enableassertions -Xmx1400m -jar <https://builds.apache.org/job/HBase-0.92/ws/trunk/target/surefire/surefirebooter1997173923277384930.jar> <https://builds.apache.org/job/HBase-0.92/ws/trunk/target/surefire/surefire7392984947616456791tmp> <https://builds.apache.org/job/HBase-0.92/ws/trunk/target/surefire/surefire1132023261288102153tmp>
Running org.apache.hadoop.hbase.rest.client.TestRemoteAdmin
Tests run: 1, Failures: 0, Errors: 0, Skipped: 0, Time elapsed: 17.295 sec
Forking command line: /bin/sh -c cd <https://builds.apache.org/job/HBase-0.92/ws/trunk> && /home/jenkins/tools/java/jdk1.6.0_27-32/jre/bin/java -enableassertions -Xmx1400m -jar <https://builds.apache.org/job/HBase-0.92/ws/trunk/target/surefire/surefirebooter4154660697365683385.jar> <https://builds.apache.org/job/HBase-0.92/ws/trunk/target/surefire/surefire6727074747908743927tmp> <https://builds.apache.org/job/HBase-0.92/ws/trunk/target/surefire/surefire7584727268179404892tmp>
Running org.apache.hadoop.hbase.rest.client.TestRemoteTable
Tests run: 3, Failures: 0, Errors: 0, Skipped: 0, Time elapsed: 17.594 sec
Forking command line: /bin/sh -c cd <https://builds.apache.org/job/HBase-0.92/ws/trunk> && /home/jenkins/tools/java/jdk1.6.0_27-32/jre/bin/java -enableassertions -Xmx1400m -jar <https://builds.apache.org/job/HBase-0.92/ws/trunk/target/surefire/surefirebooter5472707628745627935.jar> <https://builds.apache.org/job/HBase-0.92/ws/trunk/target/surefire/surefire3966379307595165241tmp> <https://builds.apache.org/job/HBase-0.92/ws/trunk/target/surefire/surefire6454335220525893360tmp>
Running org.apache.hadoop.hbase.rest.TestVersionResource
Tests run: 7, Failures: 0, Errors: 0, Skipped: 0, Time elapsed: 14.86 sec
Forking command line: /bin/sh -c cd <https://builds.apache.org/job/HBase-0.92/ws/trunk> && /home/jenkins/tools/java/jdk1.6.0_27-32/jre/bin/java -enableassertions -Xmx1400m -jar <https://builds.apache.org/job/HBase-0.92/ws/trunk/target/surefire/surefirebooter3342529651114271827.jar> <https://builds.apache.org/job/HBase-0.92/ws/trunk/target/surefire/surefire8021644607207351582tmp> <https://builds.apache.org/job/HBase-0.92/ws/trunk/target/surefire/surefire6474479525603315563tmp>
Running org.apache.hadoop.hbase.rest.TestScannerResource
Tests run: 5, Failures: 0, Errors: 0, Skipped: 0, Time elapsed: 30.273 sec
Forking command line: /bin/sh -c cd <https://builds.apache.org/job/HBase-0.92/ws/trunk> && /home/jenkins/tools/java/jdk1.6.0_27-32/jre/bin/java -enableassertions -Xmx1400m -jar <https://builds.apache.org/job/HBase-0.92/ws/trunk/target/surefire/surefirebooter1658846702717755787.jar> <https://builds.apache.org/job/HBase-0.92/ws/trunk/target/surefire/surefire1311627817535564205tmp> <https://builds.apache.org/job/HBase-0.92/ws/trunk/target/surefire/surefire6407677002322279156tmp>
Running org.apache.hadoop.hbase.rest.TestTransform
Tests run: 1, Failures: 0, Errors: 0, Skipped: 0, Time elapsed: 15.907 sec
Forking command line: /bin/sh -c cd <https://builds.apache.org/job/HBase-0.92/ws/trunk> && /home/jenkins/tools/java/jdk1.6.0_27-32/jre/bin/java -enableassertions -Xmx1400m -jar <https://builds.apache.org/job/HBase-0.92/ws/trunk/target/surefire/surefirebooter8997726391450446258.jar> <https://builds.apache.org/job/HBase-0.92/ws/trunk/target/surefire/surefire59293035499876029tmp> <https://builds.apache.org/job/HBase-0.92/ws/trunk/target/surefire/surefire8444666209325080908tmp>
Running org.apache.hadoop.hbase.rest.TestTableResource
Tests run: 8, Failures: 0, Errors: 0, Skipped: 0, Time elapsed: 29.611 sec
Forking command line: /bin/sh -c cd <https://builds.apache.org/job/HBase-0.92/ws/trunk> && /home/jenkins/tools/java/jdk1.6.0_27-32/jre/bin/java -enableassertions -Xmx1400m -jar <https://builds.apache.org/job/HBase-0.92/ws/trunk/target/surefire/surefirebooter3584157623542869274.jar> <https://builds.apache.org/job/HBase-0.92/ws/trunk/target/surefire/surefire85096811463999826tmp> <https://builds.apache.org/job/HBase-0.92/ws/trunk/target/surefire/surefire4221951164174803041tmp>
Running org.apache.hadoop.hbase.rest.TestStatusResource
Tests run: 2, Failures: 0, Errors: 0, Skipped: 0, Time elapsed: 14.93 sec
Forking command line: /bin/sh -c cd <https://builds.apache.org/job/HBase-0.92/ws/trunk> && /home/jenkins/tools/java/jdk1.6.0_27-32/jre/bin/java -enableassertions -Xmx1400m -jar <https://builds.apache.org/job/HBase-0.92/ws/trunk/target/surefire/surefirebooter2266921575285497695.jar> <https://builds.apache.org/job/HBase-0.92/ws/trunk/target/surefire/surefire1156339742082436160tmp> <https://builds.apache.org/job/HBase-0.92/ws/trunk/target/surefire/surefire3516878071567420549tmp>
Running org.apache.hadoop.hbase.rest.TestSchemaResource
Tests run: 2, Failures: 0, Errors: 0, Skipped: 0, Time elapsed: 22.286 sec
Forking command line: /bin/sh -c cd <https://builds.apache.org/job/HBase-0.92/ws/trunk> && /home/jenkins/tools/java/jdk1.6.0_27-32/jre/bin/java -enableassertions -Xmx1400m -jar <https://builds.apache.org/job/HBase-0.92/ws/trunk/target/surefire/surefirebooter3577460275333813723.jar> <https://builds.apache.org/job/HBase-0.92/ws/trunk/target/surefire/surefire4923225978239889744tmp> <https://builds.apache.org/job/HBase-0.92/ws/trunk/target/surefire/surefire3068640709925672114tmp>
Running org.apache.hadoop.hbase.thrift.TestThriftServer
Tests run: 1, Failures: 0, Errors: 0, Skipped: 0, Time elapsed: 21.588 sec
Forking command line: /bin/sh -c cd <https://builds.apache.org/job/HBase-0.92/ws/trunk> && /home/jenkins/tools/java/jdk1.6.0_27-32/jre/bin/java -enableassertions -Xmx1400m -jar <https://builds.apache.org/job/HBase-0.92/ws/trunk/target/surefire/surefirebooter7869012296958626871.jar> <https://builds.apache.org/job/HBase-0.92/ws/trunk/target/surefire/surefire402480098968627176tmp> <https://builds.apache.org/job/HBase-0.92/ws/trunk/target/surefire/surefire4966465955562032285tmp>
Running org.apache.hadoop.hbase.io.TestHeapSize
Tests run: 2, Failures: 0, Errors: 0, Skipped: 0, Time elapsed: 0.156 sec
Forking command line: /bin/sh -c cd <https://builds.apache.org/job/HBase-0.92/ws/trunk> && /home/jenkins/tools/java/jdk1.6.0_27-32/jre/bin/java -enableassertions -Xmx1400m -jar <https://builds.apache.org/job/HBase-0.92/ws/trunk/target/surefire/surefirebooter3642729398329433588.jar> <https://builds.apache.org/job/HBase-0.92/ws/trunk/target/surefire/surefire6560533883322305156tmp> <https://builds.apache.org/job/HBase-0.92/ws/trunk/target/surefire/surefire2201689090889489909tmp>
Running org.apache.hadoop.hbase.io.hfile.TestHFileSeek
Tests run: 1, Failures: 0, Errors: 0, Skipped: 0, Time elapsed: 5.762 sec
Forking command line: /bin/sh -c cd <https://builds.apache.org/job/HBase-0.92/ws/trunk> && /home/jenkins/tools/java/jdk1.6.0_27-32/jre/bin/java -enableassertions -Xmx1400m -jar <https://builds.apache.org/job/HBase-0.92/ws/trunk/target/surefire/surefirebooter6700255319922748757.jar> <https://builds.apache.org/job/HBase-0.92/ws/trunk/target/surefire/surefire8810248362478746342tmp> <https://builds.apache.org/job/HBase-0.92/ws/trunk/target/surefire/surefire4136432869162099218tmp>
Running org.apache.hadoop.hbase.io.hfile.slab.TestSlab
Tests run: 1, Failures: 0, Errors: 0, Skipped: 0, Time elapsed: 0.143 sec
Forking command line: /bin/sh -c cd <https://builds.apache.org/job/HBase-0.92/ws/trunk> && /home/jenkins/tools/java/jdk1.6.0_27-32/jre/bin/java -enableassertions -Xmx1400m -jar <https://builds.apache.org/job/HBase-0.92/ws/trunk/target/surefire/surefirebooter6188477103049042502.jar> <https://builds.apache.org/job/HBase-0.92/ws/trunk/target/surefire/surefire4551215421513152414tmp> <https://builds.apache.org/job/HBase-0.92/ws/trunk/target/surefire/surefire2472717338658157069tmp>
Running org.apache.hadoop.hbase.io.hfile.slab.TestSlabCache
Tests run: 7, Failures: 0, Errors: 0, Skipped: 0, Time elapsed: 18.713 sec
Forking command line: /bin/sh -c cd <https://builds.apache.org/job/HBase-0.92/ws/trunk> && /home/jenkins/tools/java/jdk1.6.0_27-32/jre/bin/java -enableassertions -Xmx1400m -jar <https://builds.apache.org/job/HBase-0.92/ws/trunk/target/surefire/surefirebooter5309219067923988896.jar> <https://builds.apache.org/job/HBase-0.92/ws/trunk/target/surefire/surefire3701974006274995987tmp> <https://builds.apache.org/job/HBase-0.92/ws/trunk/target/surefire/surefire2952674750542822894tmp>
Running org.apache.hadoop.hbase.io.hfile.slab.TestSingleSizeCache
Tests run: 5, Failures: 0, Errors: 0, Skipped: 0, Time elapsed: 24.001 sec
Forking command line: /bin/sh -c cd <https://builds.apache.org/job/HBase-0.92/ws/trunk> && /home/jenkins/tools/java/jdk1.6.0_27-32/jre/bin/java -enableassertions -Xmx1400m -jar <https://builds.apache.org/job/HBase-0.92/ws/trunk/target/surefire/surefirebooter8409361322095482136.jar> <https://builds.apache.org/job/HBase-0.92/ws/trunk/target/surefire/surefire1118712807483905933tmp> <https://builds.apache.org/job/HBase-0.92/ws/trunk/target/surefire/surefire912808068006453293tmp>
Running org.apache.hadoop.hbase.io.hfile.TestCachedBlockQueue
Tests run: 2, Failures: 0, Errors: 0, Skipped: 0, Time elapsed: 0.104 sec
Forking command line: /bin/sh -c cd <https://builds.apache.org/job/HBase-0.92/ws/trunk> && /home/jenkins/tools/java/jdk1.6.0_27-32/jre/bin/java -enableassertions -Xmx1400m -jar <https://builds.apache.org/job/HBase-0.92/ws/trunk/target/surefire/surefirebooter3278794871521231290.jar> <https://builds.apache.org/job/HBase-0.92/ws/trunk/target/surefire/surefire4327093099219870606tmp> <https://builds.apache.org/job/HBase-0.92/ws/trunk/target/surefire/surefire6592435128838514990tmp>
Running org.apache.hadoop.hbase.io.hfile.TestHFileBlockIndex
Tests run: 10, Failures: 0, Errors: 0, Skipped: 0, Time elapsed: 10.073 sec
Forking command line: /bin/sh -c cd <https://builds.apache.org/job/HBase-0.92/ws/trunk> && /home/jenkins/tools/java/jdk1.6.0_27-32/jre/bin/java -enableassertions -Xmx1400m -jar <https://builds.apache.org/job/HBase-0.92/ws/trunk/target/surefire/surefirebooter4301082872884063485.jar> <https://builds.apache.org/job/HBase-0.92/ws/trunk/target/surefire/surefire7570281102242895529tmp> <https://builds.apache.org/job/HBase-0.92/ws/trunk/target/surefire/surefire2735945916480025744tmp>
Running org.apache.hadoop.hbase.io.hfile.TestLruBlockCache
Tests run: 7, Failures: 0, Errors: 0, Skipped: 0, Time elapsed: 0.344 sec
Forking command line: /bin/sh -c cd <https://builds.apache.org/job/HBase-0.92/ws/trunk> && /home/jenkins/tools/java/jdk1.6.0_27-32/jre/bin/java -enableassertions -Xmx1400m -jar <https://builds.apache.org/job/HBase-0.92/ws/trunk/target/surefire/surefirebooter3946265692435358055.jar> <https://builds.apache.org/job/HBase-0.92/ws/trunk/target/surefire/surefire2541453228928755714tmp> <https://builds.apache.org/job/HBase-0.92/ws/trunk/target/surefire/surefire3749852919925249708tmp>
Running org.apache.hadoop.hbase.io.hfile.TestHFilePerformance
Tests run: 1, Failures: 0, Errors: 0, Skipped: 0, Time elapsed: 5.886 sec
Forking command line: /bin/sh -c cd <https://builds.apache.org/job/HBase-0.92/ws/trunk> && /home/jenkins/tools/java/jdk1.6.0_27-32/jre/bin/java -enableassertions -Xmx1400m -jar <https://builds.apache.org/job/HBase-0.92/ws/trunk/target/surefire/surefirebooter1271698565271302138.jar> <https://builds.apache.org/job/HBase-0.92/ws/trunk/target/surefire/surefire4432220434927383239tmp> <https://builds.apache.org/job/HBase-0.92/ws/trunk/target/surefire/surefire4655269251975035576tmp>
Running org.apache.hadoop.hbase.io.hfile.TestFixedFileTrailer
Tests run: 2, Failures: 0, Errors: 0, Skipped: 0, Time elapsed: 0.562 sec
Forking command line: /bin/sh -c cd <https://builds.apache.org/job/HBase-0.92/ws/trunk> && /home/jenkins/tools/java/jdk1.6.0_27-32/jre/bin/java -enableassertions -Xmx1400m -jar <https://builds.apache.org/job/HBase-0.92/ws/trunk/target/surefire/surefirebooter7409342743151206272.jar> <https://builds.apache.org/job/HBase-0.92/ws/trunk/target/surefire/surefire289264440467615313tmp> <https://builds.apache.org/job/HBase-0.92/ws/trunk/target/surefire/surefire7601953780191165616tmp>
Running org.apache.hadoop.hbase.io.hfile.TestHFileWriterV2
Tests run: 1, Failures: 0, Errors: 0, Skipped: 0, Time elapsed: 0.961 sec
Forking command line: /bin/sh -c cd <https://builds.apache.org/job/HBase-0.92/ws/trunk> && /home/jenkins/tools/java/jdk1.6.0_27-32/jre/bin/java -enableassertions -Xmx1400m -jar <https://builds.apache.org/job/HBase-0.92/ws/trunk/target/surefire/surefirebooter1836579149711197389.jar> <https://builds.apache.org/job/HBase-0.92/ws/trunk/target/surefire/surefire4161747200132270739tmp> <https://builds.apache.org/job/HBase-0.92/ws/trunk/target/surefire/surefire1957576476971709715tmp>
Running org.apache.hadoop.hbase.io.hfile.TestBlockCacheColumnFamilySummary
Tests run: 4, Failures: 0, Errors: 0, Skipped: 0, Time elapsed: 0.057 sec
Forking command line: /bin/sh -c cd <https://builds.apache.org/job/HBase-0.92/ws/trunk> && /home/jenkins/tools/java/jdk1.6.0_27-32/jre/bin/java -enableassertions -Xmx1400m -jar <https://builds.apache.org/job/HBase-0.92/ws/trunk/target/surefire/surefirebooter2040840139605763745.jar> <https://builds.apache.org/job/HBase-0.92/ws/trunk/target/surefire/surefire1936607458839844724tmp> <https://builds.apache.org/job/HBase-0.92/ws/trunk/target/surefire/surefire1966171059147090043tmp>
Running org.apache.hadoop.hbase.io.hfile.TestHFileReaderV1
Tests run: 1, Failures: 0, Errors: 0, Skipped: 0, Time elapsed: 0.579 sec
Forking command line: /bin/sh -c cd <https://builds.apache.org/job/HBase-0.92/ws/trunk> && /home/jenkins/tools/java/jdk1.6.0_27-32/jre/bin/java -enableassertions -Xmx1400m -jar <https://builds.apache.org/job/HBase-0.92/ws/trunk/target/surefire/surefirebooter6207154895405682518.jar> <https://builds.apache.org/job/HBase-0.92/ws/trunk/target/surefire/surefire3053240342591866378tmp> <https://builds.apache.org/job/HBase-0.92/ws/trunk/target/surefire/surefire7410948165981120331tmp>
Running org.apache.hadoop.hbase.io.hfile.TestHFile
Tests run: 6, Failures: 0, Errors: 0, Skipped: 0, Time elapsed: 0.852 sec
Forking command line: /bin/sh -c cd <https://builds.apache.org/job/HBase-0.92/ws/trunk> && /home/jenkins/tools/java/jdk1.6.0_27-32/jre/bin/java -enableassertions -Xmx1400m -jar <https://builds.apache.org/job/HBase-0.92/ws/trunk/target/surefire/surefirebooter242835545224168366.jar> <https://builds.apache.org/job/HBase-0.92/ws/trunk/target/surefire/surefire1151211784047652566tmp> <https://builds.apache.org/job/HBase-0.92/ws/trunk/target/surefire/surefire674767347291894218tmp>
Running org.apache.hadoop.hbase.io.hfile.TestReseekTo
Tests run: 1, Failures: 0, Errors: 0, Skipped: 0, Time elapsed: 0.641 sec
Forking command line: /bin/sh -c cd <https://builds.apache.org/job/HBase-0.92/ws/trunk> && /home/jenkins/tools/java/jdk1.6.0_27-32/jre/bin/java -enableassertions -Xmx1400m -jar <https://builds.apache.org/job/HBase-0.92/ws/trunk/target/surefire/surefirebooter7151359158879048056.jar> <https://builds.apache.org/job/HBase-0.92/ws/trunk/target/surefire/surefire5892388092557378676tmp> <https://builds.apache.org/job/HBase-0.92/ws/trunk/target/surefire/surefire6223342677387112615tmp>
Running org.apache.hadoop.hbase.io.hfile.TestHFileBlock
Tests run: 7, Failures: 0, Errors: 0, Skipped: 0, Time elapsed: 25.822 sec
Forking command line: /bin/sh -c cd <https://builds.apache.org/job/HBase-0.92/ws/trunk> && /home/jenkins/tools/java/jdk1.6.0_27-32/jre/bin/java -enableassertions -Xmx1400m -jar <https://builds.apache.org/job/HBase-0.92/ws/trunk/target/surefire/surefirebooter5104304959784639564.jar> <https://builds.apache.org/job/HBase-0.92/ws/trunk/target/surefire/surefire8557935341966782846tmp> <https://builds.apache.org/job/HBase-0.92/ws/trunk/target/surefire/surefire3092484391860784645tmp>
Running org.apache.hadoop.hbase.io.hfile.TestSeekTo
Tests run: 3, Failures: 0, Errors: 0, Skipped: 0, Time elapsed: 0.666 sec
Forking command line: /bin/sh -c cd <https://builds.apache.org/job/HBase-0.92/ws/trunk> && /home/jenkins/tools/java/jdk1.6.0_27-32/jre/bin/java -enableassertions -Xmx1400m -jar <https://builds.apache.org/job/HBase-0.92/ws/trunk/target/surefire/surefirebooter2255784361169873563.jar> <https://builds.apache.org/job/HBase-0.92/ws/trunk/target/surefire/surefire6688354093290470936tmp> <https://builds.apache.org/job/HBase-0.92/ws/trunk/target/surefire/surefire1794076843253439850tmp>
Running org.apache.hadoop.hbase.io.hfile.TestCacheOnWrite
Tests run: 6, Failures: 0, Errors: 0, Skipped: 0, Time elapsed: 7.339 sec
Forking command line: /bin/sh -c cd <https://builds.apache.org/job/HBase-0.92/ws/trunk> && /home/jenkins/tools/java/jdk1.6.0_27-32/jre/bin/java -enableassertions -Xmx1400m -jar <https://builds.apache.org/job/HBase-0.92/ws/trunk/target/surefire/surefirebooter2958806663538148608.jar> <https://builds.apache.org/job/HBase-0.92/ws/trunk/target/surefire/surefire4295245506140378036tmp> <https://builds.apache.org/job/HBase-0.92/ws/trunk/target/surefire/surefire5631291078816384357tmp>
Running org.apache.hadoop.hbase.io.TestHbaseObjectWritable
Tests run: 4, Failures: 0, Errors: 0, Skipped: 0, Time elapsed: 0.503 sec
Forking command line: /bin/sh -c cd <https://builds.apache.org/job/HBase-0.92/ws/trunk> && /home/jenkins/tools/java/jdk1.6.0_27-32/jre/bin/java -enableassertions -Xmx1400m -jar <https://builds.apache.org/job/HBase-0.92/ws/trunk/target/surefire/surefirebooter7559349720489020731.jar> <https://builds.apache.org/job/HBase-0.92/ws/trunk/target/surefire/surefire3116085527998198452tmp> <https://builds.apache.org/job/HBase-0.92/ws/trunk/target/surefire/surefire8330867918554023358tmp>
Running org.apache.hadoop.hbase.io.TestImmutableBytesWritable
Tests run: 3, Failures: 0, Errors: 0, Skipped: 0, Time elapsed: 0.111 sec
Forking command line: /bin/sh -c cd <https://builds.apache.org/job/HBase-0.92/ws/trunk> && /home/jenkins/tools/java/jdk1.6.0_27-32/jre/bin/java -enableassertions -Xmx1400m -jar <https://builds.apache.org/job/HBase-0.92/ws/trunk/target/surefire/surefirebooter1915475870791948660.jar> <https://builds.apache.org/job/HBase-0.92/ws/trunk/target/surefire/surefire4637946470573379516tmp> <https://builds.apache.org/job/HBase-0.92/ws/trunk/target/surefire/surefire7664331063600456928tmp>
Running org.apache.hadoop.hbase.io.TestHalfStoreFileReader
Tests run: 1, Failures: 0, Errors: 0, Skipped: 0, Time elapsed: 0.683 sec
Forking command line: /bin/sh -c cd <https://builds.apache.org/job/HBase-0.92/ws/trunk> && /home/jenkins/tools/java/jdk1.6.0_27-32/jre/bin/java -enableassertions -Xmx1400m -jar <https://builds.apache.org/job/HBase-0.92/ws/trunk/target/surefire/surefirebooter5697734242370857200.jar> <https://builds.apache.org/job/HBase-0.92/ws/trunk/target/surefire/surefire170796608647727485tmp> <https://builds.apache.org/job/HBase-0.92/ws/trunk/target/surefire/surefire2085900243906871102tmp>
Running org.apache.hadoop.hbase.migration.TestMigrationFrom090To092
Tests run: 1, Failures: 0, Errors: 0, Skipped: 0, Time elapsed: 0.269 sec
Forking command line: /bin/sh -c cd <https://builds.apache.org/job/HBase-0.92/ws/trunk> && /home/jenkins/tools/java/jdk1.6.0_27-32/jre/bin/java -enableassertions -Xmx1400m -jar <https://builds.apache.org/job/HBase-0.92/ws/trunk/target/surefire/surefirebooter4111862005518197379.jar> <https://builds.apache.org/job/HBase-0.92/ws/trunk/target/surefire/surefire8769537953007505571tmp> <https://builds.apache.org/job/HBase-0.92/ws/trunk/target/surefire/surefire7443004484663720180tmp>
Running org.apache.hadoop.hbase.TestFSTableDescriptorForceCreation
Tests run: 3, Failures: 0, Errors: 0, Skipped: 0, Time elapsed: 0.556 sec
Forking command line: /bin/sh -c cd <https://builds.apache.org/job/HBase-0.92/ws/trunk> && /home/jenkins/tools/java/jdk1.6.0_27-32/jre/bin/java -enableassertions -Xmx1400m -jar <https://builds.apache.org/job/HBase-0.92/ws/trunk/target/surefire/surefirebooter4833169017659909614.jar> <https://builds.apache.org/job/HBase-0.92/ws/trunk/target/surefire/surefire3571980141898867906tmp> <https://builds.apache.org/job/HBase-0.92/ws/trunk/target/surefire/surefire1023921230463008280tmp>
Running org.apache.hadoop.hbase.avro.TestAvroUtil
Tests run: 1, Failures: 0, Errors: 0, Skipped: 0, Time elapsed: 0.684 sec
Forking command line: /bin/sh -c cd <https://builds.apache.org/job/HBase-0.92/ws/trunk> && /home/jenkins/tools/java/jdk1.6.0_27-32/jre/bin/java -enableassertions -Xmx1400m -jar <https://builds.apache.org/job/HBase-0.92/ws/trunk/target/surefire/surefirebooter5139458602671366194.jar> <https://builds.apache.org/job/HBase-0.92/ws/trunk/target/surefire/surefire7364378339082169806tmp> <https://builds.apache.org/job/HBase-0.92/ws/trunk/target/surefire/surefire670508888847689034tmp>
Running org.apache.hadoop.hbase.avro.TestAvroServer
Tests run: 3, Failures: 0, Errors: 0, Skipped: 0, Time elapsed: 29.145 sec
Forking command line: /bin/sh -c cd <https://builds.apache.org/job/HBase-0.92/ws/trunk> && /home/jenkins/tools/java/jdk1.6.0_27-32/jre/bin/java -enableassertions -Xmx1400m -jar <https://builds.apache.org/job/HBase-0.92/ws/trunk/target/surefire/surefirebooter1591814569682042128.jar> <https://builds.apache.org/job/HBase-0.92/ws/trunk/target/surefire/surefire212440458195493717tmp> <https://builds.apache.org/job/HBase-0.92/ws/trunk/target/surefire/surefire9141915774655739405tmp>
Running org.apache.hadoop.hbase.TestKeyValue
Tests run: 11, Failures: 0, Errors: 0, Skipped: 0, Time elapsed: 0.13 sec
Forking command line: /bin/sh -c cd <https://builds.apache.org/job/HBase-0.92/ws/trunk> && /home/jenkins/tools/java/jdk1.6.0_27-32/jre/bin/java -enableassertions -Xmx1400m -jar <https://builds.apache.org/job/HBase-0.92/ws/trunk/target/surefire/surefirebooter3345846122962667897.jar> <https://builds.apache.org/job/HBase-0.92/ws/trunk/target/surefire/surefire4664195853536627386tmp> <https://builds.apache.org/job/HBase-0.92/ws/trunk/target/surefire/surefire9017257435709724501tmp>
Running org.apache.hadoop.hbase.replication.TestMultiSlaveReplication
Tests run: 1, Failures: 0, Errors: 0, Skipped: 0, Time elapsed: 49.117 sec
Forking command line: /bin/sh -c cd <https://builds.apache.org/job/HBase-0.92/ws/trunk> && /home/jenkins/tools/java/jdk1.6.0_27-32/jre/bin/java -enableassertions -Xmx1400m -jar <https://builds.apache.org/job/HBase-0.92/ws/trunk/target/surefire/surefirebooter6201998092751760881.jar> <https://builds.apache.org/job/HBase-0.92/ws/trunk/target/surefire/surefire3582268134167733457tmp> <https://builds.apache.org/job/HBase-0.92/ws/trunk/target/surefire/surefire3861294893711667804tmp>
Running org.apache.hadoop.hbase.replication.regionserver.TestReplicationSourceManager
Tests run: 1, Failures: 0, Errors: 0, Skipped: 0, Time elapsed: 0.941 sec
Forking command line: /bin/sh -c cd <https://builds.apache.org/job/HBase-0.92/ws/trunk> && /home/jenkins/tools/java/jdk1.6.0_27-32/jre/bin/java -enableassertions -Xmx1400m -jar <https://builds.apache.org/job/HBase-0.92/ws/trunk/target/surefire/surefirebooter1778866128774755459.jar> <https://builds.apache.org/job/HBase-0.92/ws/trunk/target/surefire/surefire5926939970382054757tmp> <https://builds.apache.org/job/HBase-0.92/ws/trunk/target/surefire/surefire8197347048629681810tmp>
Running org.apache.hadoop.hbase.replication.regionserver.TestReplicationSink
Tests run: 5, Failures: 0, Errors: 0, Skipped: 0, Time elapsed: 16.813 sec
Forking command line: /bin/sh -c cd <https://builds.apache.org/job/HBase-0.92/ws/trunk> && /home/jenkins/tools/java/jdk1.6.0_27-32/jre/bin/java -enableassertions -Xmx1400m -jar <https://builds.apache.org/job/HBase-0.92/ws/trunk/target/surefire/surefirebooter9050045576778373457.jar> <https://builds.apache.org/job/HBase-0.92/ws/trunk/target/surefire/surefire3260091413011733911tmp> <https://builds.apache.org/job/HBase-0.92/ws/trunk/target/surefire/surefire7110932106850332437tmp>
Running org.apache.hadoop.hbase.replication.TestMasterReplication
Tests run: 2, Failures: 0, Errors: 0, Skipped: 0, Time elapsed: 76.47 sec
Forking command line: /bin/sh -c cd <https://builds.apache.org/job/HBase-0.92/ws/trunk> && /home/jenkins/tools/java/jdk1.6.0_27-32/jre/bin/java -enableassertions -Xmx1400m -jar <https://builds.apache.org/job/HBase-0.92/ws/trunk/target/surefire/surefirebooter8753158796725566418.jar> <https://builds.apache.org/job/HBase-0.92/ws/trunk/target/surefire/surefire988105144987883617tmp> <https://builds.apache.org/job/HBase-0.92/ws/trunk/target/surefire/surefire6560251006186620094tmp>
Running org.apache.hadoop.hbase.replication.TestReplicationSource
Tests run: 1, Failures: 0, Errors: 0, Skipped: 0, Time elapsed: 4.424 sec
Forking command line: /bin/sh -c cd <https://builds.apache.org/job/HBase-0.92/ws/trunk> && /home/jenkins/tools/java/jdk1.6.0_27-32/jre/bin/java -enableassertions -Xmx1400m -jar <https://builds.apache.org/job/HBase-0.92/ws/trunk/target/surefire/surefirebooter2218683510305615091.jar> <https://builds.apache.org/job/HBase-0.92/ws/trunk/target/surefire/surefire8235418593071970062tmp> <https://builds.apache.org/job/HBase-0.92/ws/trunk/target/surefire/surefire291546880175359917tmp>
Running org.apache.hadoop.hbase.replication.TestReplicationPeer
Tests run: 1, Failures: 0, Errors: 0, Skipped: 0, Time elapsed: 25.524 sec
Forking command line: /bin/sh -c cd <https://builds.apache.org/job/HBase-0.92/ws/trunk> && /home/jenkins/tools/java/jdk1.6.0_27-32/jre/bin/java -enableassertions -Xmx1400m -jar <https://builds.apache.org/job/HBase-0.92/ws/trunk/target/surefire/surefirebooter5445106191034858614.jar> <https://builds.apache.org/job/HBase-0.92/ws/trunk/target/surefire/surefire1270706173392664051tmp> <https://builds.apache.org/job/HBase-0.92/ws/trunk/target/surefire/surefire8758044719980595699tmp>
Running org.apache.hadoop.hbase.replication.TestReplication
Tests run: 7, Failures: 0, Errors: 0, Skipped: 0, Time elapsed: 162.266 sec
Forking command line: /bin/sh -c cd <https://builds.apache.org/job/HBase-0.92/ws/trunk> && /home/jenkins/tools/java/jdk1.6.0_27-32/jre/bin/java -enableassertions -Xmx1400m -jar <https://builds.apache.org/job/HBase-0.92/ws/trunk/target/surefire/surefirebooter6497700181033322876.jar> <https://builds.apache.org/job/HBase-0.92/ws/trunk/target/surefire/surefire5956270841778009771tmp> <https://builds.apache.org/job/HBase-0.92/ws/trunk/target/surefire/surefire2722769363862968720tmp>
Running org.apache.hadoop.hbase.ipc.TestDelayedRpc
Tests run: 4, Failures: 0, Errors: 0, Skipped: 0, Time elapsed: 2.552 sec
Forking command line: /bin/sh -c cd <https://builds.apache.org/job/HBase-0.92/ws/trunk> && /home/jenkins/tools/java/jdk1.6.0_27-32/jre/bin/java -enableassertions -Xmx1400m -jar <https://builds.apache.org/job/HBase-0.92/ws/trunk/target/surefire/surefirebooter8080452688046244801.jar> <https://builds.apache.org/job/HBase-0.92/ws/trunk/target/surefire/surefire2841078794089795811tmp> <https://builds.apache.org/job/HBase-0.92/ws/trunk/target/surefire/surefire3791950501668657738tmp>
Running org.apache.hadoop.hbase.TestCompare
Tests run: 1, Failures: 0, Errors: 0, Skipped: 0, Time elapsed: 0.239 sec
Forking command line: /bin/sh -c cd <https://builds.apache.org/job/HBase-0.92/ws/trunk> && /home/jenkins/tools/java/jdk1.6.0_27-32/jre/bin/java -enableassertions -Xmx1400m -jar <https://builds.apache.org/job/HBase-0.92/ws/trunk/target/surefire/surefirebooter8213884730665701817.jar> <https://builds.apache.org/job/HBase-0.92/ws/trunk/target/surefire/surefire2926262757946951584tmp> <https://builds.apache.org/job/HBase-0.92/ws/trunk/target/surefire/surefire5644997680089030083tmp>
Running org.apache.hadoop.hbase.TestZooKeeper
Tests run: 7, Failures: 0, Errors: 0, Skipped: 0, Time elapsed: 83.073 sec
Forking command line: /bin/sh -c cd <https://builds.apache.org/job/HBase-0.92/ws/trunk> && /home/jenkins/tools/java/jdk1.6.0_27-32/jre/bin/java -enableassertions -Xmx1400m -jar <https://builds.apache.org/job/HBase-0.92/ws/trunk/target/surefire/surefirebooter6784089833786169244.jar> <https://builds.apache.org/job/HBase-0.92/ws/trunk/target/surefire/surefire7479031999113060113tmp> <https://builds.apache.org/job/HBase-0.92/ws/trunk/target/surefire/surefire4362319220098051690tmp>
Running org.apache.hadoop.hbase.TestHBaseTestingUtility
Tests run: 7, Failures: 0, Errors: 0, Skipped: 0, Time elapsed: 74.8 sec
Results :
Failed tests: testWorkerAbort(org.apache.hadoop.hbase.master.TestDistributedLogSplitting): expected:<1> but was:<0>
Tests in error:
testMasterFailoverWithMockedRITOnDeadRS(org.apache.hadoop.hbase.master.TestMasterFailover): test timed out after 180000 milliseconds
Tests run: 1051, Failures: 1, Errors: 1, Skipped: 10
[INFO] ------------------------------------------------------------------------
[INFO] BUILD FAILURE
[INFO] ------------------------------------------------------------------------
[INFO] Total time: 1:41:46.064s
[INFO] Finished at: Sat Nov 05 00:58:36 UTC 2011
[INFO] Final Memory: 47M/713M
[INFO] ------------------------------------------------------------------------
[ERROR] Failed to execute goal org.apache.maven.plugins:maven-surefire-plugin:2.9:test (default-test) on project hbase: There are test failures.
[ERROR]
[ERROR] Please refer to <https://builds.apache.org/job/HBase-0.92/ws/trunk/target/surefire-reports> for the individual test results.
[ERROR] -> [Help 1]
org.apache.maven.lifecycle.LifecycleExecutionException: Failed to execute goal org.apache.maven.plugins:maven-surefire-plugin:2.9:test (default-test) on project hbase: There are test failures.
Please refer to <https://builds.apache.org/job/HBase-0.92/ws/trunk/target/surefire-reports> for the individual test results.
at org.apache.maven.lifecycle.internal.MojoExecutor.execute(MojoExecutor.java:213)
at org.apache.maven.lifecycle.internal.MojoExecutor.execute(MojoExecutor.java:153)
at org.apache.maven.lifecycle.internal.MojoExecutor.execute(MojoExecutor.java:145)
at org.apache.maven.lifecycle.internal.MojoExecutor.executeForkedExecutions(MojoExecutor.java:365)
at org.apache.maven.lifecycle.internal.MojoExecutor.execute(MojoExecutor.java:199)
at org.apache.maven.lifecycle.internal.MojoExecutor.execute(MojoExecutor.java:153)
at org.apache.maven.lifecycle.internal.MojoExecutor.execute(MojoExecutor.java:145)
at org.apache.maven.lifecycle.internal.LifecycleModuleBuilder.buildProject(LifecycleModuleBuilder.java:84)
at org.apache.maven.lifecycle.internal.LifecycleModuleBuilder.buildProject(LifecycleModuleBuilder.java:59)
at org.apache.maven.lifecycle.internal.LifecycleStarter.singleThreadedBuild(LifecycleStarter.java:183)
at org.apache.maven.lifecycle.internal.LifecycleStarter.execute(LifecycleStarter.java:161)
at org.apache.maven.DefaultMaven.doExecute(DefaultMaven.java:319)
at org.apache.maven.DefaultMaven.execute(DefaultMaven.java:156)
at org.apache.maven.cli.MavenCli.execute(MavenCli.java:537)
at org.apache.maven.cli.MavenCli.doMain(MavenCli.java:196)
at org.apache.maven.cli.MavenCli.main(MavenCli.java:141)
at sun.reflect.NativeMethodAccessorImpl.invoke0(Native Method)
at sun.reflect.NativeMethodAccessorImpl.invoke(NativeMethodAccessorImpl.java:39)
at sun.reflect.DelegatingMethodAccessorImpl.invoke(DelegatingMethodAccessorImpl.java:25)
at java.lang.reflect.Method.invoke(Method.java:597)
at org.codehaus.plexus.classworlds.launcher.Launcher.launchEnhanced(Launcher.java:290)
at org.codehaus.plexus.classworlds.launcher.Launcher.launch(Launcher.java:230)
at org.codehaus.plexus.classworlds.launcher.Launcher.mainWithExitCode(Launcher.java:409)
at org.codehaus.plexus.classworlds.launcher.Launcher.main(Launcher.java:352)
Caused by: org.apache.maven.plugin.MojoFailureException: There are test failures.
Please refer to <https://builds.apache.org/job/HBase-0.92/ws/trunk/target/surefire-reports> for the individual test results.
at org.apache.maven.plugin.surefire.SurefireHelper.reportExecution(SurefireHelper.java:87)
at org.apache.maven.plugin.surefire.SurefirePlugin.writeSummary(SurefirePlugin.java:631)
at org.apache.maven.plugin.surefire.SurefirePlugin.handleSummary(SurefirePlugin.java:605)
at org.apache.maven.plugin.surefire.AbstractSurefireMojo.executeAfterPreconditionsChecked(AbstractSurefireMojo.java:136)
at org.apache.maven.plugin.surefire.AbstractSurefireMojo.execute(AbstractSurefireMojo.java:97)
at org.apache.maven.plugin.DefaultBuildPluginManager.executeMojo(DefaultBuildPluginManager.java:101)
at org.apache.maven.lifecycle.internal.MojoExecutor.execute(MojoExecutor.java:209)
... 23 more
[ERROR]
[ERROR]
[ERROR] For more information about the errors and possible solutions, please read the following articles:
[ERROR] [Help 1] http://cwiki.apache.org/confluence/display/MAVEN/MojoFailureException
Build step 'Invoke top-level Maven targets' marked build as failure
[locks-and-latches] Releasing all the locks
[locks-and-latches] All the locks released
Archiving artifacts
Recording test results
Updating HBASE-4725
Updating HBASE-4553
Build failed in Jenkins: HBase-0.92 #108
Posted by Apache Jenkins Server <je...@builds.apache.org>.
See <https://builds.apache.org/job/HBase-0.92/108/>
------------------------------------------
[...truncated 6417 lines...]
Tests run: 21, Failures: 0, Errors: 0, Skipped: 0, Time elapsed: 27.424 sec
Forking command line: /bin/sh -c cd <https://builds.apache.org/job/HBase-0.92/ws/trunk> && /home/jenkins/tools/java/jdk1.6.0_27-32/jre/bin/java -enableassertions -Xmx1400m -jar <https://builds.apache.org/job/HBase-0.92/ws/trunk/target/surefire/surefirebooter4586993770866435049.jar> <https://builds.apache.org/job/HBase-0.92/ws/trunk/target/surefire/surefire1909272840399816537tmp> <https://builds.apache.org/job/HBase-0.92/ws/trunk/target/surefire/surefire1828407550806325293tmp>
Running org.apache.hadoop.hbase.regionserver.TestHRegion
Tests run: 57, Failures: 0, Errors: 0, Skipped: 0, Time elapsed: 29.286 sec
Forking command line: /bin/sh -c cd <https://builds.apache.org/job/HBase-0.92/ws/trunk> && /home/jenkins/tools/java/jdk1.6.0_27-32/jre/bin/java -enableassertions -Xmx1400m -jar <https://builds.apache.org/job/HBase-0.92/ws/trunk/target/surefire/surefirebooter1931075417024027421.jar> <https://builds.apache.org/job/HBase-0.92/ws/trunk/target/surefire/surefire3483170790087289779tmp> <https://builds.apache.org/job/HBase-0.92/ws/trunk/target/surefire/surefire4246454904273116642tmp>
Running org.apache.hadoop.hbase.regionserver.TestMasterAddressManager
Tests run: 1, Failures: 0, Errors: 0, Skipped: 0, Time elapsed: 0.542 sec
Forking command line: /bin/sh -c cd <https://builds.apache.org/job/HBase-0.92/ws/trunk> && /home/jenkins/tools/java/jdk1.6.0_27-32/jre/bin/java -enableassertions -Xmx1400m -jar <https://builds.apache.org/job/HBase-0.92/ws/trunk/target/surefire/surefirebooter825824236649273102.jar> <https://builds.apache.org/job/HBase-0.92/ws/trunk/target/surefire/surefire7532014506285118649tmp> <https://builds.apache.org/job/HBase-0.92/ws/trunk/target/surefire/surefire102428861635904527tmp>
Running org.apache.hadoop.hbase.regionserver.TestCompoundBloomFilter
Tests run: 3, Failures: 0, Errors: 0, Skipped: 0, Time elapsed: 21.953 sec
Forking command line: /bin/sh -c cd <https://builds.apache.org/job/HBase-0.92/ws/trunk> && /home/jenkins/tools/java/jdk1.6.0_27-32/jre/bin/java -enableassertions -Xmx1400m -jar <https://builds.apache.org/job/HBase-0.92/ws/trunk/target/surefire/surefirebooter1565996559878154305.jar> <https://builds.apache.org/job/HBase-0.92/ws/trunk/target/surefire/surefire3000261864516312974tmp> <https://builds.apache.org/job/HBase-0.92/ws/trunk/target/surefire/surefire5706520773014091266tmp>
Running org.apache.hadoop.hbase.regionserver.TestSplitLogWorker
Tests run: 5, Failures: 0, Errors: 0, Skipped: 0, Time elapsed: 2.066 sec
Forking command line: /bin/sh -c cd <https://builds.apache.org/job/HBase-0.92/ws/trunk> && /home/jenkins/tools/java/jdk1.6.0_27-32/jre/bin/java -enableassertions -Xmx1400m -jar <https://builds.apache.org/job/HBase-0.92/ws/trunk/target/surefire/surefirebooter5276954500517094831.jar> <https://builds.apache.org/job/HBase-0.92/ws/trunk/target/surefire/surefire1292142691326183913tmp> <https://builds.apache.org/job/HBase-0.92/ws/trunk/target/surefire/surefire4746468071529183007tmp>
Running org.apache.hadoop.hbase.regionserver.TestServerCustomProtocol
Tests run: 6, Failures: 0, Errors: 0, Skipped: 0, Time elapsed: 18.959 sec
Forking command line: /bin/sh -c cd <https://builds.apache.org/job/HBase-0.92/ws/trunk> && /home/jenkins/tools/java/jdk1.6.0_27-32/jre/bin/java -enableassertions -Xmx1400m -jar <https://builds.apache.org/job/HBase-0.92/ws/trunk/target/surefire/surefirebooter6251014938912608202.jar> <https://builds.apache.org/job/HBase-0.92/ws/trunk/target/surefire/surefire113966298090122894tmp> <https://builds.apache.org/job/HBase-0.92/ws/trunk/target/surefire/surefire7287496227184535410tmp>
Running org.apache.hadoop.hbase.regionserver.TestScanWithBloomError
Tests run: 3, Failures: 0, Errors: 0, Skipped: 0, Time elapsed: 1.025 sec
Forking command line: /bin/sh -c cd <https://builds.apache.org/job/HBase-0.92/ws/trunk> && /home/jenkins/tools/java/jdk1.6.0_27-32/jre/bin/java -enableassertions -Xmx1400m -jar <https://builds.apache.org/job/HBase-0.92/ws/trunk/target/surefire/surefirebooter1509783739339218544.jar> <https://builds.apache.org/job/HBase-0.92/ws/trunk/target/surefire/surefire694746381518954024tmp> <https://builds.apache.org/job/HBase-0.92/ws/trunk/target/surefire/surefire4225528464968423269tmp>
Running org.apache.hadoop.hbase.regionserver.TestStoreFileBlockCacheSummary
Tests run: 1, Failures: 0, Errors: 0, Skipped: 0, Time elapsed: 17.016 sec
Forking command line: /bin/sh -c cd <https://builds.apache.org/job/HBase-0.92/ws/trunk> && /home/jenkins/tools/java/jdk1.6.0_27-32/jre/bin/java -enableassertions -Xmx1400m -jar <https://builds.apache.org/job/HBase-0.92/ws/trunk/target/surefire/surefirebooter571576872214954214.jar> <https://builds.apache.org/job/HBase-0.92/ws/trunk/target/surefire/surefire6424426762371370748tmp> <https://builds.apache.org/job/HBase-0.92/ws/trunk/target/surefire/surefire5239447251979196908tmp>
Running org.apache.hadoop.hbase.regionserver.TestStore
Tests run: 11, Failures: 0, Errors: 0, Skipped: 0, Time elapsed: 1.793 sec
Forking command line: /bin/sh -c cd <https://builds.apache.org/job/HBase-0.92/ws/trunk> && /home/jenkins/tools/java/jdk1.6.0_27-32/jre/bin/java -enableassertions -Xmx1400m -jar <https://builds.apache.org/job/HBase-0.92/ws/trunk/target/surefire/surefirebooter8914968619841391257.jar> <https://builds.apache.org/job/HBase-0.92/ws/trunk/target/surefire/surefire2335403041871437317tmp> <https://builds.apache.org/job/HBase-0.92/ws/trunk/target/surefire/surefire6590372699271712055tmp>
Running org.apache.hadoop.hbase.regionserver.TestBlocksRead
Tests run: 3, Failures: 0, Errors: 0, Skipped: 0, Time elapsed: 0.982 sec
Forking command line: /bin/sh -c cd <https://builds.apache.org/job/HBase-0.92/ws/trunk> && /home/jenkins/tools/java/jdk1.6.0_27-32/jre/bin/java -enableassertions -Xmx1400m -jar <https://builds.apache.org/job/HBase-0.92/ws/trunk/target/surefire/surefirebooter3404689771327652498.jar> <https://builds.apache.org/job/HBase-0.92/ws/trunk/target/surefire/surefire1708366377614223529tmp> <https://builds.apache.org/job/HBase-0.92/ws/trunk/target/surefire/surefire1677714558886343280tmp>
Running org.apache.hadoop.hbase.regionserver.TestFSErrorsExposed
Tests run: 3, Failures: 0, Errors: 0, Skipped: 0, Time elapsed: 33.106 sec
Forking command line: /bin/sh -c cd <https://builds.apache.org/job/HBase-0.92/ws/trunk> && /home/jenkins/tools/java/jdk1.6.0_27-32/jre/bin/java -enableassertions -Xmx1400m -jar <https://builds.apache.org/job/HBase-0.92/ws/trunk/target/surefire/surefirebooter1421976858088489105.jar> <https://builds.apache.org/job/HBase-0.92/ws/trunk/target/surefire/surefire1917615012307071608tmp> <https://builds.apache.org/job/HBase-0.92/ws/trunk/target/surefire/surefire8650383656740285775tmp>
Running org.apache.hadoop.hbase.regionserver.handler.TestCloseRegionHandler
Tests run: 1, Failures: 0, Errors: 0, Skipped: 0, Time elapsed: 0.817 sec
Forking command line: /bin/sh -c cd <https://builds.apache.org/job/HBase-0.92/ws/trunk> && /home/jenkins/tools/java/jdk1.6.0_27-32/jre/bin/java -enableassertions -Xmx1400m -jar <https://builds.apache.org/job/HBase-0.92/ws/trunk/target/surefire/surefirebooter7456729070807407326.jar> <https://builds.apache.org/job/HBase-0.92/ws/trunk/target/surefire/surefire1747622688280708200tmp> <https://builds.apache.org/job/HBase-0.92/ws/trunk/target/surefire/surefire6591841836346192260tmp>
Running org.apache.hadoop.hbase.regionserver.handler.TestOpenRegionHandler
Tests run: 3, Failures: 0, Errors: 0, Skipped: 0, Time elapsed: 0.932 sec
Forking command line: /bin/sh -c cd <https://builds.apache.org/job/HBase-0.92/ws/trunk> && /home/jenkins/tools/java/jdk1.6.0_27-32/jre/bin/java -enableassertions -Xmx1400m -jar <https://builds.apache.org/job/HBase-0.92/ws/trunk/target/surefire/surefirebooter1079686926948682300.jar> <https://builds.apache.org/job/HBase-0.92/ws/trunk/target/surefire/surefire3258964974452214721tmp> <https://builds.apache.org/job/HBase-0.92/ws/trunk/target/surefire/surefire5018965716288671003tmp>
Running org.apache.hadoop.hbase.regionserver.TestScanDeleteTracker
Tests run: 6, Failures: 0, Errors: 0, Skipped: 0, Time elapsed: 0.598 sec
Forking command line: /bin/sh -c cd <https://builds.apache.org/job/HBase-0.92/ws/trunk> && /home/jenkins/tools/java/jdk1.6.0_27-32/jre/bin/java -enableassertions -Xmx1400m -jar <https://builds.apache.org/job/HBase-0.92/ws/trunk/target/surefire/surefirebooter8581446648904789748.jar> <https://builds.apache.org/job/HBase-0.92/ws/trunk/target/surefire/surefire9019181616878545890tmp> <https://builds.apache.org/job/HBase-0.92/ws/trunk/target/surefire/surefire3228322108790400127tmp>
Running org.apache.hadoop.hbase.regionserver.TestSplitTransactionOnCluster
Tests run: 4, Failures: 0, Errors: 0, Skipped: 0, Time elapsed: 46.12 sec
Forking command line: /bin/sh -c cd <https://builds.apache.org/job/HBase-0.92/ws/trunk> && /home/jenkins/tools/java/jdk1.6.0_27-32/jre/bin/java -enableassertions -Xmx1400m -jar <https://builds.apache.org/job/HBase-0.92/ws/trunk/target/surefire/surefirebooter172457402395535388.jar> <https://builds.apache.org/job/HBase-0.92/ws/trunk/target/surefire/surefire7926504618490648208tmp> <https://builds.apache.org/job/HBase-0.92/ws/trunk/target/surefire/surefire8943294006746562316tmp>
Running org.apache.hadoop.hbase.regionserver.TestHRegionServerBulkLoad
Tests run: 1, Failures: 0, Errors: 0, Skipped: 0, Time elapsed: 48.602 sec
Forking command line: /bin/sh -c cd <https://builds.apache.org/job/HBase-0.92/ws/trunk> && /home/jenkins/tools/java/jdk1.6.0_27-32/jre/bin/java -enableassertions -Xmx1400m -jar <https://builds.apache.org/job/HBase-0.92/ws/trunk/target/surefire/surefirebooter6308137315412315440.jar> <https://builds.apache.org/job/HBase-0.92/ws/trunk/target/surefire/surefire2278093102678812875tmp> <https://builds.apache.org/job/HBase-0.92/ws/trunk/target/surefire/surefire766936436410056219tmp>
Running org.apache.hadoop.hbase.regionserver.TestSplitTransaction
Tests run: 6, Failures: 0, Errors: 0, Skipped: 0, Time elapsed: 3.678 sec
Forking command line: /bin/sh -c cd <https://builds.apache.org/job/HBase-0.92/ws/trunk> && /home/jenkins/tools/java/jdk1.6.0_27-32/jre/bin/java -enableassertions -Xmx1400m -jar <https://builds.apache.org/job/HBase-0.92/ws/trunk/target/surefire/surefirebooter451041702512695976.jar> <https://builds.apache.org/job/HBase-0.92/ws/trunk/target/surefire/surefire1268042201459894181tmp> <https://builds.apache.org/job/HBase-0.92/ws/trunk/target/surefire/surefire1070495537767625109tmp>
Running org.apache.hadoop.hbase.regionserver.TestReadWriteConsistencyControl
Tests run: 1, Failures: 0, Errors: 0, Skipped: 0, Time elapsed: 10.127 sec
Forking command line: /bin/sh -c cd <https://builds.apache.org/job/HBase-0.92/ws/trunk> && /home/jenkins/tools/java/jdk1.6.0_27-32/jre/bin/java -enableassertions -Xmx1400m -jar <https://builds.apache.org/job/HBase-0.92/ws/trunk/target/surefire/surefirebooter5611539797386645098.jar> <https://builds.apache.org/job/HBase-0.92/ws/trunk/target/surefire/surefire7408720614507217009tmp> <https://builds.apache.org/job/HBase-0.92/ws/trunk/target/surefire/surefire3043699518621249529tmp>
Running org.apache.hadoop.hbase.regionserver.TestKeyValueHeap
Tests run: 3, Failures: 0, Errors: 0, Skipped: 0, Time elapsed: 0.504 sec
Forking command line: /bin/sh -c cd <https://builds.apache.org/job/HBase-0.92/ws/trunk> && /home/jenkins/tools/java/jdk1.6.0_27-32/jre/bin/java -enableassertions -Xmx1400m -jar <https://builds.apache.org/job/HBase-0.92/ws/trunk/target/surefire/surefirebooter6990929412250591272.jar> <https://builds.apache.org/job/HBase-0.92/ws/trunk/target/surefire/surefire2660309734574001126tmp> <https://builds.apache.org/job/HBase-0.92/ws/trunk/target/surefire/surefire5370007576462941886tmp>
Running org.apache.hadoop.hbase.regionserver.TestCompactSelection
Tests run: 1, Failures: 0, Errors: 0, Skipped: 0, Time elapsed: 0.642 sec
Forking command line: /bin/sh -c cd <https://builds.apache.org/job/HBase-0.92/ws/trunk> && /home/jenkins/tools/java/jdk1.6.0_27-32/jre/bin/java -enableassertions -Xmx1400m -jar <https://builds.apache.org/job/HBase-0.92/ws/trunk/target/surefire/surefirebooter4762319932882866214.jar> <https://builds.apache.org/job/HBase-0.92/ws/trunk/target/surefire/surefire30910599780187485tmp> <https://builds.apache.org/job/HBase-0.92/ws/trunk/target/surefire/surefire7569443982653038656tmp>
Running org.apache.hadoop.hbase.regionserver.TestMinVersions
Tests run: 6, Failures: 0, Errors: 0, Skipped: 0, Time elapsed: 1.209 sec
Forking command line: /bin/sh -c cd <https://builds.apache.org/job/HBase-0.92/ws/trunk> && /home/jenkins/tools/java/jdk1.6.0_27-32/jre/bin/java -enableassertions -Xmx1400m -jar <https://builds.apache.org/job/HBase-0.92/ws/trunk/target/surefire/surefirebooter7601571909322863056.jar> <https://builds.apache.org/job/HBase-0.92/ws/trunk/target/surefire/surefire9145156630852797073tmp> <https://builds.apache.org/job/HBase-0.92/ws/trunk/target/surefire/surefire4839622672973088793tmp>
Running org.apache.hadoop.hbase.regionserver.TestWideScanner
Tests run: 1, Failures: 0, Errors: 0, Skipped: 0, Time elapsed: 1.869 sec
Forking command line: /bin/sh -c cd <https://builds.apache.org/job/HBase-0.92/ws/trunk> && /home/jenkins/tools/java/jdk1.6.0_27-32/jre/bin/java -enableassertions -Xmx1400m -jar <https://builds.apache.org/job/HBase-0.92/ws/trunk/target/surefire/surefirebooter6849224926629318899.jar> <https://builds.apache.org/job/HBase-0.92/ws/trunk/target/surefire/surefire1595392462650579690tmp> <https://builds.apache.org/job/HBase-0.92/ws/trunk/target/surefire/surefire1138935277800068109tmp>
Running org.apache.hadoop.hbase.regionserver.TestColumnSeeking
Tests run: 2, Failures: 0, Errors: 0, Skipped: 0, Time elapsed: 4.662 sec
Forking command line: /bin/sh -c cd <https://builds.apache.org/job/HBase-0.92/ws/trunk> && /home/jenkins/tools/java/jdk1.6.0_27-32/jre/bin/java -enableassertions -Xmx1400m -jar <https://builds.apache.org/job/HBase-0.92/ws/trunk/target/surefire/surefirebooter3061310110438551055.jar> <https://builds.apache.org/job/HBase-0.92/ws/trunk/target/surefire/surefire5149636512212167073tmp> <https://builds.apache.org/job/HBase-0.92/ws/trunk/target/surefire/surefire4711828427937234526tmp>
Running org.apache.hadoop.hbase.regionserver.TestGetClosestAtOrBefore
Tests run: 3, Failures: 0, Errors: 0, Skipped: 0, Time elapsed: 1.155 sec
Forking command line: /bin/sh -c cd <https://builds.apache.org/job/HBase-0.92/ws/trunk> && /home/jenkins/tools/java/jdk1.6.0_27-32/jre/bin/java -enableassertions -Xmx1400m -jar <https://builds.apache.org/job/HBase-0.92/ws/trunk/target/surefire/surefirebooter2850808125269995046.jar> <https://builds.apache.org/job/HBase-0.92/ws/trunk/target/surefire/surefire4957221845002514956tmp> <https://builds.apache.org/job/HBase-0.92/ws/trunk/target/surefire/surefire1267415781691246488tmp>
Running org.apache.hadoop.hbase.regionserver.TestExplicitColumnTracker
Tests run: 4, Failures: 0, Errors: 0, Skipped: 0, Time elapsed: 0.897 sec
Forking command line: /bin/sh -c cd <https://builds.apache.org/job/HBase-0.92/ws/trunk> && /home/jenkins/tools/java/jdk1.6.0_27-32/jre/bin/java -enableassertions -Xmx1400m -jar <https://builds.apache.org/job/HBase-0.92/ws/trunk/target/surefire/surefirebooter3361142673687675959.jar> <https://builds.apache.org/job/HBase-0.92/ws/trunk/target/surefire/surefire8649046459333804732tmp> <https://builds.apache.org/job/HBase-0.92/ws/trunk/target/surefire/surefire3863656519615048790tmp>
Running org.apache.hadoop.hbase.regionserver.TestMemStoreLAB
Tests run: 3, Failures: 0, Errors: 0, Skipped: 0, Time elapsed: 1.355 sec
Forking command line: /bin/sh -c cd <https://builds.apache.org/job/HBase-0.92/ws/trunk> && /home/jenkins/tools/java/jdk1.6.0_27-32/jre/bin/java -enableassertions -Xmx1400m -jar <https://builds.apache.org/job/HBase-0.92/ws/trunk/target/surefire/surefirebooter1395591215355788619.jar> <https://builds.apache.org/job/HBase-0.92/ws/trunk/target/surefire/surefire75914315660124453tmp> <https://builds.apache.org/job/HBase-0.92/ws/trunk/target/surefire/surefire7393168701017930206tmp>
Running org.apache.hadoop.hbase.regionserver.TestKeyValueScanFixture
Tests run: 1, Failures: 0, Errors: 0, Skipped: 0, Time elapsed: 0.114 sec
Forking command line: /bin/sh -c cd <https://builds.apache.org/job/HBase-0.92/ws/trunk> && /home/jenkins/tools/java/jdk1.6.0_27-32/jre/bin/java -enableassertions -Xmx1400m -jar <https://builds.apache.org/job/HBase-0.92/ws/trunk/target/surefire/surefirebooter5864494751980785959.jar> <https://builds.apache.org/job/HBase-0.92/ws/trunk/target/surefire/surefire5850942853087717049tmp> <https://builds.apache.org/job/HBase-0.92/ws/trunk/target/surefire/surefire2727865613902249105tmp>
Running org.apache.hadoop.hbase.regionserver.wal.TestLogRollAbort
Tests run: 1, Failures: 0, Errors: 0, Skipped: 0, Time elapsed: 156.09 sec
Forking command line: /bin/sh -c cd <https://builds.apache.org/job/HBase-0.92/ws/trunk> && /home/jenkins/tools/java/jdk1.6.0_27-32/jre/bin/java -enableassertions -Xmx1400m -jar <https://builds.apache.org/job/HBase-0.92/ws/trunk/target/surefire/surefirebooter7553224568474534418.jar> <https://builds.apache.org/job/HBase-0.92/ws/trunk/target/surefire/surefire8358684634021410389tmp> <https://builds.apache.org/job/HBase-0.92/ws/trunk/target/surefire/surefire4055047239835430162tmp>
Running org.apache.hadoop.hbase.regionserver.wal.TestWALActionsListener
Tests run: 1, Failures: 0, Errors: 0, Skipped: 0, Time elapsed: 0.626 sec
Forking command line: /bin/sh -c cd <https://builds.apache.org/job/HBase-0.92/ws/trunk> && /home/jenkins/tools/java/jdk1.6.0_27-32/jre/bin/java -enableassertions -Xmx1400m -jar <https://builds.apache.org/job/HBase-0.92/ws/trunk/target/surefire/surefirebooter6504755094921730079.jar> <https://builds.apache.org/job/HBase-0.92/ws/trunk/target/surefire/surefire4054056768293829013tmp> <https://builds.apache.org/job/HBase-0.92/ws/trunk/target/surefire/surefire374156691391166565tmp>
Running org.apache.hadoop.hbase.regionserver.wal.TestLogRolling
Tests run: 3, Failures: 0, Errors: 0, Skipped: 0, Time elapsed: 326.587 sec
Forking command line: /bin/sh -c cd <https://builds.apache.org/job/HBase-0.92/ws/trunk> && /home/jenkins/tools/java/jdk1.6.0_27-32/jre/bin/java -enableassertions -Xmx1400m -jar <https://builds.apache.org/job/HBase-0.92/ws/trunk/target/surefire/surefirebooter4590645211823621846.jar> <https://builds.apache.org/job/HBase-0.92/ws/trunk/target/surefire/surefire3623246253115182721tmp> <https://builds.apache.org/job/HBase-0.92/ws/trunk/target/surefire/surefire7303189201628948935tmp>
Running org.apache.hadoop.hbase.regionserver.wal.TestHLog
Tests run: 9, Failures: 0, Errors: 0, Skipped: 0, Time elapsed: 59.639 sec
Forking command line: /bin/sh -c cd <https://builds.apache.org/job/HBase-0.92/ws/trunk> && /home/jenkins/tools/java/jdk1.6.0_27-32/jre/bin/java -enableassertions -Xmx1400m -jar <https://builds.apache.org/job/HBase-0.92/ws/trunk/target/surefire/surefirebooter3605628105603408047.jar> <https://builds.apache.org/job/HBase-0.92/ws/trunk/target/surefire/surefire6428772641653121641tmp> <https://builds.apache.org/job/HBase-0.92/ws/trunk/target/surefire/surefire2715288051943365570tmp>
Running org.apache.hadoop.hbase.regionserver.wal.TestHLogSplit
Tests run: 29, Failures: 0, Errors: 0, Skipped: 1, Time elapsed: 236.181 sec
Forking command line: /bin/sh -c cd <https://builds.apache.org/job/HBase-0.92/ws/trunk> && /home/jenkins/tools/java/jdk1.6.0_27-32/jre/bin/java -enableassertions -Xmx1400m -jar <https://builds.apache.org/job/HBase-0.92/ws/trunk/target/surefire/surefirebooter8823566116225811030.jar> <https://builds.apache.org/job/HBase-0.92/ws/trunk/target/surefire/surefire660933708920122775tmp> <https://builds.apache.org/job/HBase-0.92/ws/trunk/target/surefire/surefire4424923278338185833tmp>
Running org.apache.hadoop.hbase.regionserver.wal.TestWALReplay
Tests run: 5, Failures: 0, Errors: 0, Skipped: 0, Time elapsed: 29.136 sec
Forking command line: /bin/sh -c cd <https://builds.apache.org/job/HBase-0.92/ws/trunk> && /home/jenkins/tools/java/jdk1.6.0_27-32/jre/bin/java -enableassertions -Xmx1400m -jar <https://builds.apache.org/job/HBase-0.92/ws/trunk/target/surefire/surefirebooter1409604228359368253.jar> <https://builds.apache.org/job/HBase-0.92/ws/trunk/target/surefire/surefire1100776092048496196tmp> <https://builds.apache.org/job/HBase-0.92/ws/trunk/target/surefire/surefire635872346879322811tmp>
Running org.apache.hadoop.hbase.regionserver.wal.TestHLogMethods
Tests run: 3, Failures: 0, Errors: 0, Skipped: 0, Time elapsed: 0.825 sec
Forking command line: /bin/sh -c cd <https://builds.apache.org/job/HBase-0.92/ws/trunk> && /home/jenkins/tools/java/jdk1.6.0_27-32/jre/bin/java -enableassertions -Xmx1400m -jar <https://builds.apache.org/job/HBase-0.92/ws/trunk/target/surefire/surefirebooter3050063778404842923.jar> <https://builds.apache.org/job/HBase-0.92/ws/trunk/target/surefire/surefire6165308352224038018tmp> <https://builds.apache.org/job/HBase-0.92/ws/trunk/target/surefire/surefire7049952900952368486tmp>
Running org.apache.hadoop.hbase.regionserver.TestRSStatusServlet
Tests run: 2, Failures: 0, Errors: 0, Skipped: 0, Time elapsed: 0.671 sec
Forking command line: /bin/sh -c cd <https://builds.apache.org/job/HBase-0.92/ws/trunk> && /home/jenkins/tools/java/jdk1.6.0_27-32/jre/bin/java -enableassertions -Xmx1400m -jar <https://builds.apache.org/job/HBase-0.92/ws/trunk/target/surefire/surefirebooter5613069146130236015.jar> <https://builds.apache.org/job/HBase-0.92/ws/trunk/target/surefire/surefire3871150477679594725tmp> <https://builds.apache.org/job/HBase-0.92/ws/trunk/target/surefire/surefire6595052151478913422tmp>
Running org.apache.hadoop.hbase.regionserver.TestStoreScanner
Tests run: 14, Failures: 0, Errors: 0, Skipped: 0, Time elapsed: 0.142 sec
Forking command line: /bin/sh -c cd <https://builds.apache.org/job/HBase-0.92/ws/trunk> && /home/jenkins/tools/java/jdk1.6.0_27-32/jre/bin/java -enableassertions -Xmx1400m -jar <https://builds.apache.org/job/HBase-0.92/ws/trunk/target/surefire/surefirebooter2325255084897495483.jar> <https://builds.apache.org/job/HBase-0.92/ws/trunk/target/surefire/surefire1600529613090040009tmp> <https://builds.apache.org/job/HBase-0.92/ws/trunk/target/surefire/surefire3521995303791874566tmp>
Running org.apache.hadoop.hbase.regionserver.TestResettingCounters
Tests run: 1, Failures: 0, Errors: 0, Skipped: 0, Time elapsed: 0.715 sec
Forking command line: /bin/sh -c cd <https://builds.apache.org/job/HBase-0.92/ws/trunk> && /home/jenkins/tools/java/jdk1.6.0_27-32/jre/bin/java -enableassertions -Xmx1400m -jar <https://builds.apache.org/job/HBase-0.92/ws/trunk/target/surefire/surefirebooter7872420379489785047.jar> <https://builds.apache.org/job/HBase-0.92/ws/trunk/target/surefire/surefire3062397541524457752tmp> <https://builds.apache.org/job/HBase-0.92/ws/trunk/target/surefire/surefire1006405480321537481tmp>
Running org.apache.hadoop.hbase.regionserver.TestStoreFile
Tests run: 8, Failures: 0, Errors: 0, Skipped: 0, Time elapsed: 1.675 sec
Forking command line: /bin/sh -c cd <https://builds.apache.org/job/HBase-0.92/ws/trunk> && /home/jenkins/tools/java/jdk1.6.0_27-32/jre/bin/java -enableassertions -Xmx1400m -jar <https://builds.apache.org/job/HBase-0.92/ws/trunk/target/surefire/surefirebooter5904386728041872679.jar> <https://builds.apache.org/job/HBase-0.92/ws/trunk/target/surefire/surefire3220338836166266074tmp> <https://builds.apache.org/job/HBase-0.92/ws/trunk/target/surefire/surefire6867990223928123812tmp>
Running org.apache.hadoop.hbase.regionserver.TestEndToEndSplitTransaction
Tests run: 1, Failures: 0, Errors: 0, Skipped: 0, Time elapsed: 42.869 sec
Forking command line: /bin/sh -c cd <https://builds.apache.org/job/HBase-0.92/ws/trunk> && /home/jenkins/tools/java/jdk1.6.0_27-32/jre/bin/java -enableassertions -Xmx1400m -jar <https://builds.apache.org/job/HBase-0.92/ws/trunk/target/surefire/surefirebooter1163260515919808295.jar> <https://builds.apache.org/job/HBase-0.92/ws/trunk/target/surefire/surefire6922040903209508561tmp> <https://builds.apache.org/job/HBase-0.92/ws/trunk/target/surefire/surefire4291336248993512592tmp>
Running org.apache.hadoop.hbase.regionserver.TestScanWildcardColumnTracker
Tests run: 2, Failures: 0, Errors: 0, Skipped: 0, Time elapsed: 0.459 sec
Forking command line: /bin/sh -c cd <https://builds.apache.org/job/HBase-0.92/ws/trunk> && /home/jenkins/tools/java/jdk1.6.0_27-32/jre/bin/java -enableassertions -Xmx1400m -jar <https://builds.apache.org/job/HBase-0.92/ws/trunk/target/surefire/surefirebooter3144502902037874930.jar> <https://builds.apache.org/job/HBase-0.92/ws/trunk/target/surefire/surefire3628087066007704557tmp> <https://builds.apache.org/job/HBase-0.92/ws/trunk/target/surefire/surefire6989160395621440983tmp>
Running org.apache.hadoop.hbase.regionserver.TestCompaction
Tests run: 10, Failures: 0, Errors: 0, Skipped: 0, Time elapsed: 12.064 sec
Forking command line: /bin/sh -c cd <https://builds.apache.org/job/HBase-0.92/ws/trunk> && /home/jenkins/tools/java/jdk1.6.0_27-32/jre/bin/java -enableassertions -Xmx1400m -jar <https://builds.apache.org/job/HBase-0.92/ws/trunk/target/surefire/surefirebooter2076037115034734401.jar> <https://builds.apache.org/job/HBase-0.92/ws/trunk/target/surefire/surefire8328395142608797843tmp> <https://builds.apache.org/job/HBase-0.92/ws/trunk/target/surefire/surefire8896475478018102405tmp>
Running org.apache.hadoop.hbase.regionserver.TestQueryMatcher
Tests run: 4, Failures: 0, Errors: 0, Skipped: 0, Time elapsed: 0.544 sec
Forking command line: /bin/sh -c cd <https://builds.apache.org/job/HBase-0.92/ws/trunk> && /home/jenkins/tools/java/jdk1.6.0_27-32/jre/bin/java -enableassertions -Xmx1400m -jar <https://builds.apache.org/job/HBase-0.92/ws/trunk/target/surefire/surefirebooter2326220616266924625.jar> <https://builds.apache.org/job/HBase-0.92/ws/trunk/target/surefire/surefire759986307624467343tmp> <https://builds.apache.org/job/HBase-0.92/ws/trunk/target/surefire/surefire8754736823231451910tmp>
Running org.apache.hadoop.hbase.regionserver.TestRpcMetrics
Tests run: 1, Failures: 0, Errors: 0, Skipped: 0, Time elapsed: 2.027 sec
Forking command line: /bin/sh -c cd <https://builds.apache.org/job/HBase-0.92/ws/trunk> && /home/jenkins/tools/java/jdk1.6.0_27-32/jre/bin/java -enableassertions -Xmx1400m -jar <https://builds.apache.org/job/HBase-0.92/ws/trunk/target/surefire/surefirebooter2530620888295134019.jar> <https://builds.apache.org/job/HBase-0.92/ws/trunk/target/surefire/surefire4423717627539354334tmp> <https://builds.apache.org/job/HBase-0.92/ws/trunk/target/surefire/surefire5028138545802339842tmp>
Running org.apache.hadoop.hbase.regionserver.TestScanner
Tests run: 6, Failures: 0, Errors: 0, Skipped: 0, Time elapsed: 4.641 sec
Forking command line: /bin/sh -c cd <https://builds.apache.org/job/HBase-0.92/ws/trunk> && /home/jenkins/tools/java/jdk1.6.0_27-32/jre/bin/java -enableassertions -Xmx1400m -jar <https://builds.apache.org/job/HBase-0.92/ws/trunk/target/surefire/surefirebooter4067910741267197565.jar> <https://builds.apache.org/job/HBase-0.92/ws/trunk/target/surefire/surefire3490773297604519868tmp> <https://builds.apache.org/job/HBase-0.92/ws/trunk/target/surefire/surefire3242715483085395933tmp>
Running org.apache.hadoop.hbase.regionserver.TestMultiColumnScanner
Tests run: 6, Failures: 0, Errors: 0, Skipped: 0, Time elapsed: 18.361 sec
Forking command line: /bin/sh -c cd <https://builds.apache.org/job/HBase-0.92/ws/trunk> && /home/jenkins/tools/java/jdk1.6.0_27-32/jre/bin/java -enableassertions -Xmx1400m -jar <https://builds.apache.org/job/HBase-0.92/ws/trunk/target/surefire/surefirebooter2034038028091378844.jar> <https://builds.apache.org/job/HBase-0.92/ws/trunk/target/surefire/surefire388383263544790878tmp> <https://builds.apache.org/job/HBase-0.92/ws/trunk/target/surefire/surefire6685353498106347278tmp>
Running org.apache.hadoop.hbase.regionserver.TestRegionSplitPolicy
Tests run: 3, Failures: 0, Errors: 0, Skipped: 0, Time elapsed: 0.697 sec
Forking command line: /bin/sh -c cd <https://builds.apache.org/job/HBase-0.92/ws/trunk> && /home/jenkins/tools/java/jdk1.6.0_27-32/jre/bin/java -enableassertions -Xmx1400m -jar <https://builds.apache.org/job/HBase-0.92/ws/trunk/target/surefire/surefirebooter1912952086448891778.jar> <https://builds.apache.org/job/HBase-0.92/ws/trunk/target/surefire/surefire4337087903225207395tmp> <https://builds.apache.org/job/HBase-0.92/ws/trunk/target/surefire/surefire1634610956767546057tmp>
Running org.apache.hadoop.hbase.regionserver.TestKeyValueSkipListSet
Tests run: 4, Failures: 0, Errors: 0, Skipped: 0, Time elapsed: 0.121 sec
Forking command line: /bin/sh -c cd <https://builds.apache.org/job/HBase-0.92/ws/trunk> && /home/jenkins/tools/java/jdk1.6.0_27-32/jre/bin/java -enableassertions -Xmx1400m -jar <https://builds.apache.org/job/HBase-0.92/ws/trunk/target/surefire/surefirebooter5275692371967282837.jar> <https://builds.apache.org/job/HBase-0.92/ws/trunk/target/surefire/surefire4003871083738707423tmp> <https://builds.apache.org/job/HBase-0.92/ws/trunk/target/surefire/surefire2377286824782243563tmp>
Running org.apache.hadoop.hbase.mapred.TestTableMapReduce
Tests run: 1, Failures: 0, Errors: 0, Skipped: 0, Time elapsed: 64.13 sec
Forking command line: /bin/sh -c cd <https://builds.apache.org/job/HBase-0.92/ws/trunk> && /home/jenkins/tools/java/jdk1.6.0_27-32/jre/bin/java -enableassertions -Xmx1400m -jar <https://builds.apache.org/job/HBase-0.92/ws/trunk/target/surefire/surefirebooter7303451761716435416.jar> <https://builds.apache.org/job/HBase-0.92/ws/trunk/target/surefire/surefire7766911506049776899tmp> <https://builds.apache.org/job/HBase-0.92/ws/trunk/target/surefire/surefire5611009258766419550tmp>
Running org.apache.hadoop.hbase.mapred.TestTableInputFormat
Tests run: 6, Failures: 0, Errors: 0, Skipped: 0, Time elapsed: 28.623 sec
Forking command line: /bin/sh -c cd <https://builds.apache.org/job/HBase-0.92/ws/trunk> && /home/jenkins/tools/java/jdk1.6.0_27-32/jre/bin/java -enableassertions -Xmx1400m -jar <https://builds.apache.org/job/HBase-0.92/ws/trunk/target/surefire/surefirebooter5266822410660926762.jar> <https://builds.apache.org/job/HBase-0.92/ws/trunk/target/surefire/surefire3645917364472534146tmp> <https://builds.apache.org/job/HBase-0.92/ws/trunk/target/surefire/surefire606271000926366677tmp>
Running org.apache.hadoop.hbase.TestDrainingServer
Tests run: 2, Failures: 0, Errors: 0, Skipped: 0, Time elapsed: 20.225 sec
Forking command line: /bin/sh -c cd <https://builds.apache.org/job/HBase-0.92/ws/trunk> && /home/jenkins/tools/java/jdk1.6.0_27-32/jre/bin/java -enableassertions -Xmx1400m -jar <https://builds.apache.org/job/HBase-0.92/ws/trunk/target/surefire/surefirebooter3335830441433737564.jar> <https://builds.apache.org/job/HBase-0.92/ws/trunk/target/surefire/surefire8508314293623776477tmp> <https://builds.apache.org/job/HBase-0.92/ws/trunk/target/surefire/surefire842855422181129424tmp>
Running org.apache.hadoop.hbase.TestFSTableDescriptorForceCreation
Tests run: 3, Failures: 0, Errors: 0, Skipped: 0, Time elapsed: 0.522 sec
Forking command line: /bin/sh -c cd <https://builds.apache.org/job/HBase-0.92/ws/trunk> && /home/jenkins/tools/java/jdk1.6.0_27-32/jre/bin/java -enableassertions -Xmx1400m -jar <https://builds.apache.org/job/HBase-0.92/ws/trunk/target/surefire/surefirebooter8314529199326224515.jar> <https://builds.apache.org/job/HBase-0.92/ws/trunk/target/surefire/surefire5567273262868496167tmp> <https://builds.apache.org/job/HBase-0.92/ws/trunk/target/surefire/surefire7393071275322569029tmp>
Running org.apache.hadoop.hbase.executor.TestExecutorService
Tests run: 1, Failures: 0, Errors: 0, Skipped: 0, Time elapsed: 2.439 sec
Forking command line: /bin/sh -c cd <https://builds.apache.org/job/HBase-0.92/ws/trunk> && /home/jenkins/tools/java/jdk1.6.0_27-32/jre/bin/java -enableassertions -Xmx1400m -jar <https://builds.apache.org/job/HBase-0.92/ws/trunk/target/surefire/surefirebooter5974890960826079603.jar> <https://builds.apache.org/job/HBase-0.92/ws/trunk/target/surefire/surefire4885874719186400922tmp> <https://builds.apache.org/job/HBase-0.92/ws/trunk/target/surefire/surefire2957845800317937009tmp>
Running org.apache.hadoop.hbase.mapreduce.TestTimeRangeMapRed
Tests run: 1, Failures: 0, Errors: 0, Skipped: 0, Time elapsed: 38.662 sec
Forking command line: /bin/sh -c cd <https://builds.apache.org/job/HBase-0.92/ws/trunk> && /home/jenkins/tools/java/jdk1.6.0_27-32/jre/bin/java -enableassertions -Xmx1400m -jar <https://builds.apache.org/job/HBase-0.92/ws/trunk/target/surefire/surefirebooter4237738915250656277.jar> <https://builds.apache.org/job/HBase-0.92/ws/trunk/target/surefire/surefire6227757215795708004tmp> <https://builds.apache.org/job/HBase-0.92/ws/trunk/target/surefire/surefire40641699886640194tmp>
Running org.apache.hadoop.hbase.mapreduce.TestHFileOutputFormat
Tests run: 8, Failures: 0, Errors: 0, Skipped: 0, Time elapsed: 148.38 sec
Forking command line: /bin/sh -c cd <https://builds.apache.org/job/HBase-0.92/ws/trunk> && /home/jenkins/tools/java/jdk1.6.0_27-32/jre/bin/java -enableassertions -Xmx1400m -jar <https://builds.apache.org/job/HBase-0.92/ws/trunk/target/surefire/surefirebooter3515559676348069449.jar> <https://builds.apache.org/job/HBase-0.92/ws/trunk/target/surefire/surefire3425115966402875983tmp> <https://builds.apache.org/job/HBase-0.92/ws/trunk/target/surefire/surefire8740198850765416561tmp>
Running org.apache.hadoop.hbase.mapreduce.TestImportTsv
Tests run: 8, Failures: 0, Errors: 0, Skipped: 0, Time elapsed: 38.546 sec
Forking command line: /bin/sh -c cd <https://builds.apache.org/job/HBase-0.92/ws/trunk> && /home/jenkins/tools/java/jdk1.6.0_27-32/jre/bin/java -enableassertions -Xmx1400m -jar <https://builds.apache.org/job/HBase-0.92/ws/trunk/target/surefire/surefirebooter3046027946072456167.jar> <https://builds.apache.org/job/HBase-0.92/ws/trunk/target/surefire/surefire671509640939383755tmp> <https://builds.apache.org/job/HBase-0.92/ws/trunk/target/surefire/surefire4862183310870306875tmp>
Running org.apache.hadoop.hbase.mapreduce.TestTableInputFormatScan
Tests run: 11, Failures: 0, Errors: 0, Skipped: 0, Time elapsed: 452.848 sec
Forking command line: /bin/sh -c cd <https://builds.apache.org/job/HBase-0.92/ws/trunk> && /home/jenkins/tools/java/jdk1.6.0_27-32/jre/bin/java -enableassertions -Xmx1400m -jar <https://builds.apache.org/job/HBase-0.92/ws/trunk/target/surefire/surefirebooter5904317416689378311.jar> <https://builds.apache.org/job/HBase-0.92/ws/trunk/target/surefire/surefire8705755192774736624tmp> <https://builds.apache.org/job/HBase-0.92/ws/trunk/target/surefire/surefire2017440770033548099tmp>
Running org.apache.hadoop.hbase.mapreduce.TestLoadIncrementalHFilesSplitRecovery
Tests run: 3, Failures: 0, Errors: 0, Skipped: 0, Time elapsed: 76.875 sec
Forking command line: /bin/sh -c cd <https://builds.apache.org/job/HBase-0.92/ws/trunk> && /home/jenkins/tools/java/jdk1.6.0_27-32/jre/bin/java -enableassertions -Xmx1400m -jar <https://builds.apache.org/job/HBase-0.92/ws/trunk/target/surefire/surefirebooter991926484848958282.jar> <https://builds.apache.org/job/HBase-0.92/ws/trunk/target/surefire/surefire4184010615635608802tmp> <https://builds.apache.org/job/HBase-0.92/ws/trunk/target/surefire/surefire5256650500723156243tmp>
Running org.apache.hadoop.hbase.mapreduce.TestTableSplit
Tests run: 1, Failures: 0, Errors: 0, Skipped: 0, Time elapsed: 0.133 sec
Forking command line: /bin/sh -c cd <https://builds.apache.org/job/HBase-0.92/ws/trunk> && /home/jenkins/tools/java/jdk1.6.0_27-32/jre/bin/java -enableassertions -Xmx1400m -jar <https://builds.apache.org/job/HBase-0.92/ws/trunk/target/surefire/surefirebooter1475356721273054816.jar> <https://builds.apache.org/job/HBase-0.92/ws/trunk/target/surefire/surefire8067102743866159069tmp> <https://builds.apache.org/job/HBase-0.92/ws/trunk/target/surefire/surefire7450623492719828370tmp>
Running org.apache.hadoop.hbase.mapreduce.TestSimpleTotalOrderPartitioner
Tests run: 1, Failures: 0, Errors: 0, Skipped: 0, Time elapsed: 0.422 sec
Forking command line: /bin/sh -c cd <https://builds.apache.org/job/HBase-0.92/ws/trunk> && /home/jenkins/tools/java/jdk1.6.0_27-32/jre/bin/java -enableassertions -Xmx1400m -jar <https://builds.apache.org/job/HBase-0.92/ws/trunk/target/surefire/surefirebooter8613004465806665923.jar> <https://builds.apache.org/job/HBase-0.92/ws/trunk/target/surefire/surefire5657988413050088302tmp> <https://builds.apache.org/job/HBase-0.92/ws/trunk/target/surefire/surefire3920745102741021275tmp>
Running org.apache.hadoop.hbase.mapreduce.TestTableMapReduce
Tests run: 1, Failures: 0, Errors: 0, Skipped: 0, Time elapsed: 94.538 sec
Forking command line: /bin/sh -c cd <https://builds.apache.org/job/HBase-0.92/ws/trunk> && /home/jenkins/tools/java/jdk1.6.0_27-32/jre/bin/java -enableassertions -Xmx1400m -jar <https://builds.apache.org/job/HBase-0.92/ws/trunk/target/surefire/surefirebooter2970726167562834320.jar> <https://builds.apache.org/job/HBase-0.92/ws/trunk/target/surefire/surefire6490603500852611405tmp> <https://builds.apache.org/job/HBase-0.92/ws/trunk/target/surefire/surefire8934534645396920992tmp>
Running org.apache.hadoop.hbase.mapreduce.TestLoadIncrementalHFiles
Tests run: 6, Failures: 0, Errors: 0, Skipped: 0, Time elapsed: 32.518 sec
Forking command line: /bin/sh -c cd <https://builds.apache.org/job/HBase-0.92/ws/trunk> && /home/jenkins/tools/java/jdk1.6.0_27-32/jre/bin/java -enableassertions -Xmx1400m -jar <https://builds.apache.org/job/HBase-0.92/ws/trunk/target/surefire/surefirebooter4552240733124034328.jar> <https://builds.apache.org/job/HBase-0.92/ws/trunk/target/surefire/surefire6401603440177735779tmp> <https://builds.apache.org/job/HBase-0.92/ws/trunk/target/surefire/surefire8757963812722299148tmp>
Running org.apache.hadoop.hbase.TestHRegionLocation
Tests run: 3, Failures: 0, Errors: 0, Skipped: 0, Time elapsed: 0.14 sec
Results :
Failed tests: testMasterFailoverWithMockedRITOnDeadRS(org.apache.hadoop.hbase.master.TestMasterFailover): region=enabledTable,bbb,1320413618216.84f786e8ebc7ca70afbe3b948c87f36c.
Tests run: 1046, Failures: 1, Errors: 0, Skipped: 10
[INFO] ------------------------------------------------------------------------
[INFO] BUILD FAILURE
[INFO] ------------------------------------------------------------------------
[INFO] Total time: 1:38:10.131s
[INFO] Finished at: Fri Nov 04 14:37:16 UTC 2011
[INFO] Final Memory: 36M/610M
[INFO] ------------------------------------------------------------------------
[ERROR] Failed to execute goal org.apache.maven.plugins:maven-surefire-plugin:2.9:test (default-test) on project hbase: There are test failures.
[ERROR]
[ERROR] Please refer to <https://builds.apache.org/job/HBase-0.92/ws/trunk/target/surefire-reports> for the individual test results.
[ERROR] -> [Help 1]
org.apache.maven.lifecycle.LifecycleExecutionException: Failed to execute goal org.apache.maven.plugins:maven-surefire-plugin:2.9:test (default-test) on project hbase: There are test failures.
Please refer to <https://builds.apache.org/job/HBase-0.92/ws/trunk/target/surefire-reports> for the individual test results.
at org.apache.maven.lifecycle.internal.MojoExecutor.execute(MojoExecutor.java:213)
at org.apache.maven.lifecycle.internal.MojoExecutor.execute(MojoExecutor.java:153)
at org.apache.maven.lifecycle.internal.MojoExecutor.execute(MojoExecutor.java:145)
at org.apache.maven.lifecycle.internal.MojoExecutor.executeForkedExecutions(MojoExecutor.java:365)
at org.apache.maven.lifecycle.internal.MojoExecutor.execute(MojoExecutor.java:199)
at org.apache.maven.lifecycle.internal.MojoExecutor.execute(MojoExecutor.java:153)
at org.apache.maven.lifecycle.internal.MojoExecutor.execute(MojoExecutor.java:145)
at org.apache.maven.lifecycle.internal.LifecycleModuleBuilder.buildProject(LifecycleModuleBuilder.java:84)
at org.apache.maven.lifecycle.internal.LifecycleModuleBuilder.buildProject(LifecycleModuleBuilder.java:59)
at org.apache.maven.lifecycle.internal.LifecycleStarter.singleThreadedBuild(LifecycleStarter.java:183)
at org.apache.maven.lifecycle.internal.LifecycleStarter.execute(LifecycleStarter.java:161)
at org.apache.maven.DefaultMaven.doExecute(DefaultMaven.java:319)
at org.apache.maven.DefaultMaven.execute(DefaultMaven.java:156)
at org.apache.maven.cli.MavenCli.execute(MavenCli.java:537)
at org.apache.maven.cli.MavenCli.doMain(MavenCli.java:196)
at org.apache.maven.cli.MavenCli.main(MavenCli.java:141)
at sun.reflect.NativeMethodAccessorImpl.invoke0(Native Method)
at sun.reflect.NativeMethodAccessorImpl.invoke(NativeMethodAccessorImpl.java:39)
at sun.reflect.DelegatingMethodAccessorImpl.invoke(DelegatingMethodAccessorImpl.java:25)
at java.lang.reflect.Method.invoke(Method.java:597)
at org.codehaus.plexus.classworlds.launcher.Launcher.launchEnhanced(Launcher.java:290)
at org.codehaus.plexus.classworlds.launcher.Launcher.launch(Launcher.java:230)
at org.codehaus.plexus.classworlds.launcher.Launcher.mainWithExitCode(Launcher.java:409)
at org.codehaus.plexus.classworlds.launcher.Launcher.main(Launcher.java:352)
Caused by: org.apache.maven.plugin.MojoFailureException: There are test failures.
Please refer to <https://builds.apache.org/job/HBase-0.92/ws/trunk/target/surefire-reports> for the individual test results.
at org.apache.maven.plugin.surefire.SurefireHelper.reportExecution(SurefireHelper.java:87)
at org.apache.maven.plugin.surefire.SurefirePlugin.writeSummary(SurefirePlugin.java:631)
at org.apache.maven.plugin.surefire.SurefirePlugin.handleSummary(SurefirePlugin.java:605)
at org.apache.maven.plugin.surefire.AbstractSurefireMojo.executeAfterPreconditionsChecked(AbstractSurefireMojo.java:136)
at org.apache.maven.plugin.surefire.AbstractSurefireMojo.execute(AbstractSurefireMojo.java:97)
at org.apache.maven.plugin.DefaultBuildPluginManager.executeMojo(DefaultBuildPluginManager.java:101)
at org.apache.maven.lifecycle.internal.MojoExecutor.execute(MojoExecutor.java:209)
... 23 more
[ERROR]
[ERROR]
[ERROR] For more information about the errors and possible solutions, please read the following articles:
[ERROR] [Help 1] http://cwiki.apache.org/confluence/display/MAVEN/MojoFailureException
Build step 'Invoke top-level Maven targets' marked build as failure
[locks-and-latches] Releasing all the locks
[locks-and-latches] All the locks released
Archiving artifacts
Recording test results
Build failed in Jenkins: HBase-0.92 #107
Posted by Apache Jenkins Server <je...@builds.apache.org>.
See <https://builds.apache.org/job/HBase-0.92/107/>
------------------------------------------
Started by user tedyu
Building remotely on ubuntu5
hudson.util.IOException2: remote file operation failed: <https://builds.apache.org/job/HBase-0.92/ws/> at hudson.remoting.Channel@55213670:ubuntu5
at hudson.FilePath.act(FilePath.java:754)
at hudson.FilePath.act(FilePath.java:740)
at hudson.scm.SubversionSCM.checkout(SubversionSCM.java:731)
at hudson.scm.SubversionSCM.checkout(SubversionSCM.java:676)
at hudson.model.AbstractProject.checkout(AbstractProject.java:1193)
at hudson.model.AbstractBuild$AbstractRunner.checkout(AbstractBuild.java:566)
at hudson.model.AbstractBuild$AbstractRunner.run(AbstractBuild.java:454)
at hudson.model.Run.run(Run.java:1376)
at hudson.model.FreeStyleBuild.run(FreeStyleBuild.java:46)
at hudson.model.ResourceController.execute(ResourceController.java:88)
at hudson.model.Executor.run(Executor.java:230)
Caused by: java.io.IOException: Remote call on ubuntu5 failed
at hudson.remoting.Channel.call(Channel.java:690)
at hudson.FilePath.act(FilePath.java:747)
... 10 more
Caused by: java.lang.LinkageError: loader (instance of hudson/remoting/RemoteClassLoader): attempted duplicate class definition for name: "hudson/model/Descriptor"
at java.lang.ClassLoader.defineClass1(Native Method)
at java.lang.ClassLoader.defineClass(ClassLoader.java:634)
at java.lang.ClassLoader.defineClass(ClassLoader.java:480)
at hudson.remoting.RemoteClassLoader.loadClassFile(RemoteClassLoader.java:151)
at hudson.remoting.RemoteClassLoader.findClass(RemoteClassLoader.java:131)
at java.lang.ClassLoader.loadClass(ClassLoader.java:321)
at java.lang.ClassLoader.loadClass(ClassLoader.java:266)
at java.lang.Class.getDeclaredFields0(Native Method)
at java.lang.Class.privateGetDeclaredFields(Class.java:2308)
at java.lang.Class.getDeclaredField(Class.java:1897)
at java.io.ObjectStreamClass.getDeclaredSUID(ObjectStreamClass.java:1627)
at java.io.ObjectStreamClass.access$700(ObjectStreamClass.java:69)
at java.io.ObjectStreamClass$2.run(ObjectStreamClass.java:442)
at java.security.AccessController.doPrivileged(Native Method)
at java.io.ObjectStreamClass.<init>(ObjectStreamClass.java:430)
at java.io.ObjectStreamClass.lookup(ObjectStreamClass.java:327)
at java.io.ObjectStreamClass.initNonProxy(ObjectStreamClass.java:564)
at java.io.ObjectInputStream.readNonProxyDesc(ObjectInputStream.java:1600)
at java.io.ObjectInputStream.readClassDesc(ObjectInputStream.java:1513)
at java.io.ObjectInputStream.readNonProxyDesc(ObjectInputStream.java:1600)
at java.io.ObjectInputStream.readClassDesc(ObjectInputStream.java:1513)
at java.io.ObjectInputStream.readOrdinaryObject(ObjectInputStream.java:1749)
at java.io.ObjectInputStream.readObject0(ObjectInputStream.java:1346)
at java.io.ObjectInputStream.defaultReadFields(ObjectInputStream.java:1963)
at java.io.ObjectInputStream.readSerialData(ObjectInputStream.java:1887)
at java.io.ObjectInputStream.readOrdinaryObject(ObjectInputStream.java:1770)
at java.io.ObjectInputStream.readObject0(ObjectInputStream.java:1346)
at java.io.ObjectInputStream.defaultReadFields(ObjectInputStream.java:1963)
at java.io.ObjectInputStream.readSerialData(ObjectInputStream.java:1887)
at java.io.ObjectInputStream.readOrdinaryObject(ObjectInputStream.java:1770)
at java.io.ObjectInputStream.readObject0(ObjectInputStream.java:1346)
at java.io.ObjectInputStream.defaultReadFields(ObjectInputStream.java:1963)
at java.io.ObjectInputStream.readSerialData(ObjectInputStream.java:1887)
at java.io.ObjectInputStream.readOrdinaryObject(ObjectInputStream.java:1770)
at java.io.ObjectInputStream.readObject0(ObjectInputStream.java:1346)
at java.io.ObjectInputStream.readObject(ObjectInputStream.java:368)
at hudson.remoting.UserRequest.deserialize(UserRequest.java:182)
at hudson.remoting.UserRequest.perform(UserRequest.java:98)
at hudson.remoting.UserRequest.perform(UserRequest.java:48)
at hudson.remoting.Request$2.run(Request.java:287)
at java.util.concurrent.Executors$RunnableAdapter.call(Executors.java:471)
at java.util.concurrent.FutureTask$Sync.innerRun(FutureTask.java:334)
at java.util.concurrent.FutureTask.run(FutureTask.java:166)
at java.util.concurrent.ThreadPoolExecutor.runWorker(ThreadPoolExecutor.java:1110)
at java.util.concurrent.ThreadPoolExecutor$Worker.run(ThreadPoolExecutor.java:603)
at java.lang.Thread.run(Thread.java:636)
Archiving artifacts
Recording test results