You are viewing a plain text version of this content. The canonical link for it is here.
Posted to notifications@qpid.apache.org by Apache Jenkins Server <je...@builds.apache.org> on 2014/09/07 01:35:34 UTC
Build failed in Jenkins: Qpid-Java-Artefact-Release #1193
See <https://builds.apache.org/job/Qpid-Java-Artefact-Release/1193/changes>
Changes:
[rgodfrey] QPID-6079 : [Java Broker] Objects created as duplicates should be automatically deleted
[kwall] NO-JIRA: Exclude GeneralTests that required QMF from the Java Python test suite exclusion file
[kwall] QPID-6086: [Python Client] 08..091 Add support for SSL and client cert authentication
[kwall] QPID-6085: [Python client] 08..091 implement sending/receiving of additional property types
[kwall] QPID-6084: [Python Client] Guard use of sys.argv when constructing connection properties
[kwall] QPID-6083: [Python Client] utilise pathname2url when constructing spec file location on older python versions
[kwall] QPID-6082: [Python Client] 08..091 Explicitly set incoming queue to guard method interleaving
[kwall] QPID-6081: [Python Client] 08..091 Ensure that multiframe bodies are received correctly
[rgodfrey] QPID-6078 : [JMS AMQP 1.0 Client] Allow Message and Delivery annotations to be read and modified through the JMS API
[rgodfrey] QPID-6077 : [Java AMQP 1.0] memory leak in receiver where sender settles first
[rgodfrey] QPID-6076 : Sending a message with no routing key to the default exchange in the java broker results in an NPE
[kwall] QPID-6073: [Java Broker] Management UI, move change prompt message fallback position to below, rather than left
[kwall] QPID-6074: [Java Broker] BDB HA VHN implement to use context variables rather than system properties to control timeouts etc
[kwall] NO-JIRA: [Java Broker] HA Downgrade logging of com.sleepycat.je.rep.utilint.BinaryProtocol.ProtocolException
It seems this exception can legitimately occur when a node checks (DbPings) a node that is being brought down
[kwall] QPID-6071: [Java Broker] Cause BDB HA to generate ping transaction if local quorum settings are changed
* If user changes the settings used to judge whether quorum is present (that is designated primary in the two node
case and electable group override in the case of multi node groups), REF now generates a 'ping' transaction allow
the node to promptly detect too few replicas.
------------------------------------------
[...truncated 31018 lines...]
5/228 KB 5/234 KB 30/152 KB
9/228 KB 5/234 KB 30/152 KB
9/228 KB 5/234 KB 34/152 KB
13/228 KB 5/234 KB 34/152 KB
13/228 KB 5/234 KB 38/152 KB
14/228 KB 5/234 KB 38/152 KB
1/228 KB 5/234 KB 23/152 KB
14/228 KB 5/234 KB 42/152 KB
14/228 KB 9/234 KB 42/152 KB
14/228 KB 9/234 KB 45/152 KB
14/228 KB 13/234 KB 45/152 KB
14/228 KB 14/234 KB 45/152 KB
14/228 KB 16/234 KB 45/152 KB
16/228 KB 16/234 KB 45/152 KB
20/228 KB 16/234 KB 45/152 KB
20/228 KB 20/234 KB 45/152 KB
24/228 KB 20/234 KB 45/152 KB
24/228 KB 24/234 KB 45/152 KB
24/228 KB 24/234 KB 49/152 KB
28/228 KB 24/234 KB 49/152 KB
28/228 KB 28/234 KB 49/152 KB
28/228 KB 28/234 KB 53/152 KB
32/228 KB 28/234 KB 53/152 KB
32/228 KB 32/234 KB 53/152 KB
32/228 KB 32/234 KB 57/152 KB
34/228 KB 32/234 KB 57/152 KB
34/228 KB 35/234 KB 57/152 KB
34/228 KB 35/234 KB 61/152 KB
34/228 KB 35/234 KB 65/152 KB
34/228 KB 37/234 KB 69/152 KB
34/228 KB 37/234 KB 73/152 KB
38/228 KB 37/234 KB 77/152 KB
42/228 KB 37/234 KB 77/152 KB
46/228 KB 37/234 KB 77/152 KB
50/228 KB 37/234 KB 77/152 KB
54/228 KB 37/234 KB 77/152 KB
58/228 KB 37/234 KB 77/152 KB
62/228 KB 37/234 KB 77/152 KB
65/228 KB 37/234 KB 77/152 KB
67/228 KB 37/234 KB 77/152 KB
71/228 KB 37/234 KB 77/152 KB
34/228 KB 37/234 KB 69/152 KB
71/228 KB 41/234 KB 77/152 KB
75/228 KB 41/234 KB 77/152 KB
38/228 KB 37/234 KB 77/152 KB
79/228 KB 45/234 KB 77/152 KB
75/228 KB 45/234 KB 77/152 KB
83/228 KB 45/234 KB 81/152 KB
83/228 KB 49/234 KB 81/152 KB
87/228 KB 49/234 KB 81/152 KB
87/228 KB 53/234 KB 81/152 KB
91/228 KB 53/234 KB 81/152 KB
91/228 KB 57/234 KB 81/152 KB
95/228 KB 57/234 KB 81/152 KB
95/228 KB 61/234 KB 81/152 KB
99/228 KB 61/234 KB 81/152 KB
103/228 KB 61/234 KB 81/152 KB
103/228 KB 65/234 KB 81/152 KB
107/228 KB 65/234 KB 81/152 KB
107/228 KB 69/234 KB 81/152 KB
111/228 KB 69/234 KB 81/152 KB
111/228 KB 73/234 KB 81/152 KB
115/228 KB 73/234 KB 81/152 KB
115/228 KB 77/234 KB 81/152 KB
119/228 KB 77/234 KB 81/152 KB
119/228 KB 81/234 KB 81/152 KB
123/228 KB 81/234 KB 81/152 KB
123/228 KB 85/234 KB 81/152 KB
127/228 KB 85/234 KB 81/152 KB
127/228 KB 89/234 KB 81/152 KB
131/228 KB 89/234 KB 81/152 KB
131/228 KB 93/234 KB 81/152 KB
135/228 KB 93/234 KB 81/152 KB
135/228 KB 97/234 KB 81/152 KB
139/228 KB 97/234 KB 81/152 KB
139/228 KB 101/234 KB 81/152 KB
143/228 KB 101/234 KB 81/152 KB
143/228 KB 105/234 KB 81/152 KB
147/228 KB 105/234 KB 81/152 KB
147/228 KB 109/234 KB 81/152 KB
151/228 KB 109/234 KB 81/152 KB
151/228 KB 113/234 KB 81/152 KB
155/228 KB 113/234 KB 81/152 KB
155/228 KB 117/234 KB 81/152 KB
159/228 KB 117/234 KB 81/152 KB
79/228 KB 45/234 KB 81/152 KB
159/228 KB 121/234 KB 81/152 KB
159/228 KB 121/234 KB 85/152 KB
159/228 KB 125/234 KB 85/152 KB
159/228 KB 125/234 KB 89/152 KB
159/228 KB 129/234 KB 89/152 KB
159/228 KB 129/234 KB 93/152 KB
159/228 KB 133/234 KB 93/152 KB
159/228 KB 133/234 KB 97/152 KB
159/228 KB 137/234 KB 97/152 KB
159/228 KB 137/234 KB 101/152 KB
159/228 KB 141/234 KB 105/152 KB
159/228 KB 141/234 KB 109/152 KB
159/228 KB 141/234 KB 113/152 KB
159/228 KB 141/234 KB 117/152 KB
159/228 KB 141/234 KB 117/152 KB
159/228 KB 141/234 KB 121/152 KB
159/228 KB 145/234 KB 125/152 KB
159/228 KB 145/234 KB 125/152 KB
159/228 KB 145/234 KB 129/152 KB
159/228 KB 149/234 KB 129/152 KB
159/228 KB 149/234 KB 133/152 KB
159/228 KB 153/234 KB 133/152 KB
159/228 KB 153/234 KB 137/152 KB
159/228 KB 157/234 KB 137/152 KB
159/228 KB 157/234 KB 141/152 KB
159/228 KB 161/234 KB 141/152 KB
159/228 KB 161/234 KB 145/152 KB
159/228 KB 165/234 KB 145/152 KB
159/228 KB 165/234 KB 149/152 KB
159/228 KB 169/234 KB 149/152 KB
159/228 KB 169/234 KB 152/152 KB
159/228 KB 173/234 KB 152/152 KB
159/228 KB 177/234 KB 152/152 KB
163/228 KB 177/234 KB 152/152 KB
163/228 KB 181/234 KB 152/152 KB
167/228 KB 181/234 KB 152/152 KB
167/228 KB 185/234 KB 152/152 KB
171/228 KB 185/234 KB 152/152 KB
175/228 KB 185/234 KB 152/152 KB
179/228 KB 185/234 KB 152/152 KB
183/228 KB 185/234 KB 152/152 KB
187/228 KB 185/234 KB 152/152 KB
191/228 KB 185/234 KB 152/152 KB
195/228 KB 185/234 KB 152/152 KB
199/228 KB 185/234 KB 152/152 KB
203/228 KB 185/234 KB 152/152 KB
207/228 KB 185/234 KB 152/152 KB
211/228 KB 185/234 KB 152/152 KB
215/228 KB 185/234 KB 152/152 KB
219/228 KB 185/234 KB 152/152 KB
223/228 KB 185/234 KB 152/152 KB
227/228 KB 185/234 KB 152/152 KB
228/228 KB 185/234 KB 152/152 KB
228/228 KB 189/234 KB 152/152 KB
228/228 KB 193/234 KB 152/152 KB
228/228 KB 197/234 KB 152/152 KB
228/228 KB 201/234 KB 152/152 KB
228/228 KB 205/234 KB 152/152 KB
228/228 KB 209/234 KB 152/152 KB
228/228 KB 213/234 KB 152/152 KB
228/228 KB 217/234 KB 152/152 KB
Downloaded: http://repo.maven.apache.org/maven2/org/apache/maven/shared/maven-shared-utils/0.4/maven-shared-utils-0.4.jar (152 KB at 2051.5 KB/sec)
228/228 KB 221/234 KB
228/228 KB 225/234 KB
228/228 KB 229/234 KB
228/228 KB 233/234 KB
228/228 KB 234/234 KB
Downloaded: http://repo.maven.apache.org/maven2/commons-codec/commons-codec/1.6/commons-codec-1.6.jar (228 KB at 2914.3 KB/sec)
Downloaded: http://repo.maven.apache.org/maven2/org/codehaus/plexus/plexus-utils/3.0.15/plexus-utils-3.0.15.jar (234 KB at 2778.0 KB/sec)
[INFO] Installing <https://builds.apache.org/job/Qpid-Java-Artefact-Release/ws/trunk/qpid/java/pom.xml> to /home/jenkins/.m2/repository/org/apache/qpid/qpid-java-build/0.32-SNAPSHOT/qpid-java-build-0.32-SNAPSHOT.pom
[INFO]
[INFO] --- maven-deploy-plugin:2.8.1:deploy (default-deploy) @ qpid-java-build ---
Downloading: https://repository.apache.org/content/repositories/snapshots/org/apache/qpid/qpid-java-build/0.32-SNAPSHOT/maven-metadata.xml
607/607 B
Downloaded: https://repository.apache.org/content/repositories/snapshots/org/apache/qpid/qpid-java-build/0.32-SNAPSHOT/maven-metadata.xml (607 B at 0.7 KB/sec)
Uploading: https://repository.apache.org/content/repositories/snapshots/org/apache/qpid/qpid-java-build/0.32-SNAPSHOT/qpid-java-build-0.32-20140906.233501-26.pom
2/31 KB
4/31 KB
6/31 KB
8/31 KB
10/31 KB
12/31 KB
14/31 KB
16/31 KB
18/31 KB
20/31 KB
22/31 KB
24/31 KB
26/31 KB
28/31 KB
30/31 KB
31/31 KB
[INFO] ------------------------------------------------------------------------
[INFO] Reactor Summary:
[INFO]
[INFO] Qpid Java Build ................................... FAILURE [4.141s]
[INFO] Qpid AMQP 1.0 Common .............................. SKIPPED
[INFO] Qpid AMQP 1.0 Client .............................. SKIPPED
[INFO] Qpid AMQP 1.0 Client JMS .......................... SKIPPED
[INFO] Qpid AMQP 1.0 JMS Client Examples ................. SKIPPED
[INFO] Qpid AMQP 1.0 Client WebSocket .................... SKIPPED
[INFO] Qpid Broker Code Generation ....................... SKIPPED
[INFO] Qpid Test Utilities ............................... SKIPPED
[INFO] Qpid Common ....................................... SKIPPED
[INFO] Qpid Management Common ............................ SKIPPED
[INFO] Qpid Java Broker Core ............................. SKIPPED
[INFO] Qpid Access Control Broker Plug-in ................ SKIPPED
[INFO] Qpid AMQP 0-8 Protocol Broker Plug-in ............. SKIPPED
[INFO] Qpid AMQP 0-10 Protocol Plug-in ................... SKIPPED
[INFO] Qpid AMQP 1-0 Protocol Broker Plug-in ............. SKIPPED
[INFO] Qpid AMQP 0-8 to 0-10 Message Conversion Broker Plug-in SKIPPED
[INFO] Qpid AMQP 0-8 to 1-0 Message Conversion Broker Plug-in SKIPPED
[INFO] Qpid AMQP 0-10 to 1-0 Message Conversion Broker Plug-in SKIPPED
[INFO] Qpid Derby Message Store .......................... SKIPPED
[INFO] Qpid JDBC Message Store Connection Pooling Plug-in SKIPPED
[INFO] Qpid JDBC Message Store Broker Plug-in ............ SKIPPED
[INFO] Qpid HTTP Management Broker Plug-in ............... SKIPPED
[INFO] Qpid JMX Management Broker Plug-in ................ SKIPPED
[INFO] Qpid Memory Message Store Broker Plug-in .......... SKIPPED
[INFO] Qpid WebSocket Broker Plug-in ..................... SKIPPED
[INFO] Qpid AMQP 0-x JMS Client .......................... SKIPPED
[INFO] Qpid BDB Message Store ............................ SKIPPED
[INFO] Qpid BDB Message Store JMX ........................ SKIPPED
[INFO] Qpid Java Broker .................................. SKIPPED
[INFO] Qpid AMQP Management Protocol Broker Plug-in ...... SKIPPED
[INFO] Qpid AMQP 0-x JMS Client Examples ................. SKIPPED
[INFO] Qpid JCA .......................................... SKIPPED
[INFO] Qpid Resource Adaptor ............................. SKIPPED
[INFO] Qpid Tools ........................................ SKIPPED
[INFO] Qpid Management Examples .......................... SKIPPED
[INFO] Qpid Java System Test Parent ...................... SKIPPED
[INFO] Qpid System Tests ................................. SKIPPED
[INFO] Qpid Performance Tests ............................ SKIPPED
[INFO] Qpid Performance Test System Tests ................ SKIPPED
[INFO] Qpid Performance Tests Visualisation JFC .......... SKIPPED
[INFO] Qpid BDB Store System Tests ....................... SKIPPED
[INFO] ------------------------------------------------------------------------
[INFO] BUILD FAILURE
[INFO] ------------------------------------------------------------------------
[INFO] Total time: 5.022s
[INFO] Finished at: Sat Sep 06 23:35:01 UTC 2014
[INFO] Final Memory: 25M/305M
[INFO] ------------------------------------------------------------------------
[ERROR] Failed to execute goal org.apache.maven.plugins:maven-deploy-plugin:2.8.1:deploy (default-deploy) on project qpid-java-build: Failed to deploy artifacts: Could not transfer artifact org.apache.qpid:qpid-java-build:pom:0.32-20140906.233501-26 from/to apache.snapshots.https (https://repository.apache.org/content/repositories/snapshots): Failed to transfer file: https://repository.apache.org/content/repositories/snapshots/org/apache/qpid/qpid-java-build/0.32-SNAPSHOT/qpid-java-build-0.32-20140906.233501-26.pom. Return code is: 401, ReasonPhrase: Unauthorized. -> [Help 1]
[ERROR]
[ERROR] To see the full stack trace of the errors, re-run Maven with the -e switch.
[ERROR] Re-run Maven using the -X switch to enable full debug logging.
[ERROR]
[ERROR] For more information about the errors and possible solutions, please read the following articles:
[ERROR] [Help 1] http://cwiki.apache.org/confluence/display/MAVEN/MojoExecutionException
Build step 'Invoke top-level Maven targets' marked build as failure
Archiving artifacts
Sending artifact delta relative to Qpid-Java-Artefact-Release #1191
Archived 5 artifacts
Archive block size is 32768
Received 0 blocks and 32284288 bytes
Compression is 0.0%
Took 27 sec
Jenkins build is back to normal : Qpid-Java-Artefact-Release #1194
Posted by Apache Jenkins Server <je...@builds.apache.org>.
See <https://builds.apache.org/job/Qpid-Java-Artefact-Release/1194/changes>