You are viewing a plain text version of this content. The canonical link for it is here.
Posted to builds@hbase.apache.org by Apache Jenkins Server <je...@builds.apache.org> on 2016/01/14 04:39:37 UTC

Build failed in Jenkins: HBase-1.3-IT » IntegrationTestBigLinkedList,latest1.7,Hadoop #434

See <https://builds.apache.org/job/HBase-1.3-IT/it.test=IntegrationTestBigLinkedList,jdk=latest1.7,label=Hadoop/434/changes>

Changes:

[tedyu] HBASE-15099 Move RegionStateListener class out of quotas package

------------------------------------------
[...truncated 2258 lines...]
     bool UseAdaptiveSizePolicy                     = true            {product}           
     bool UseAdaptiveSizePolicyFootprintGoal        = true            {product}           
     bool UseAdaptiveSizePolicyWithSystemGC         = false           {product}           
     bool UseAddressNop                             = true            {ARCH product}      
     bool UseAltSigs                                = false           {product}           
     bool UseAutoGCSelectPolicy                     = false           {product}           
     bool UseBiasedLocking                          = true            {product}           
     bool UseBimorphicInlining                      = true            {C2 product}        
     bool UseBoundThreads                           = true            {product}           
     bool UseCMSBestFit                             = true            {product}           
     bool UseCMSCollectionPassing                   = true            {product}           
     bool UseCMSCompactAtFullCollection             = true            {product}           
     bool UseCMSInitiatingOccupancyOnly             = false           {product}           
     bool UseCodeCacheFlushing                      = true            {product}           
     bool UseCompiler                               = true            {product}           
     bool UseCompilerSafepoints                     = true            {product}           
     bool UseCompressedOops                        := true            {lp64_product}      
     bool UseConcMarkSweepGC                        = false           {product}           
     bool UseCondCardMark                           = false           {C2 product}        
     bool UseCountLeadingZerosInstruction           = false           {ARCH product}      
     bool UseCounterDecay                           = true            {product}           
     bool UseDivMod                                 = true            {C2 product}        
     bool UseDynamicNumberOfGCThreads               = false           {product}           
     bool UseFPUForSpilling                         = false           {C2 product}        
     bool UseFastAccessorMethods                    = false           {product}           
     bool UseFastEmptyMethods                       = false           {product}           
     bool UseFastJNIAccessors                       = true            {product}           
     bool UseFastStosb                              = false           {ARCH product}      
     bool UseG1GC                                   = false           {product}           
     bool UseGCLogFileRotation                      = false           {product}           
     bool UseGCOverheadLimit                        = true            {product}           
     bool UseGCTaskAffinity                         = false           {product}           
     bool UseHeavyMonitors                          = false           {product}           
     bool UseHugeTLBFS                              = false           {product}           
     bool UseInlineCaches                           = true            {product}           
     bool UseInterpreter                            = true            {product}           
     bool UseJumpTables                             = true            {C2 product}        
     bool UseLWPSynchronization                     = true            {product}           
     bool UseLargePages                             = false           {pd product}        
     bool UseLargePagesIndividualAllocation         = false           {pd product}        
     bool UseLinuxPosixThreadCPUClocks              = true            {product}           
     bool UseLockedTracing                          = false           {product}           
     bool UseLoopCounter                            = true            {product}           
     bool UseLoopPredicate                          = true            {C2 product}        
     bool UseMaximumCompactionOnSystemGC            = true            {product}           
     bool UseMembar                                 = false           {pd product}        
     bool UseNUMA                                   = false           {product}           
     bool UseNUMAInterleaving                       = false           {product}           
     bool UseNewLongLShift                          = false           {ARCH product}      
     bool UseOSErrorReporting                       = false           {pd product}        
     bool UseOldInlining                            = true            {C2 product}        
     bool UseOnStackReplacement                     = true            {pd product}        
     bool UseOnlyInlinedBimorphic                   = true            {C2 product}        
     bool UseOprofile                               = false           {product}           
     bool UseOptoBiasInlining                       = true            {C2 product}        
     bool UsePPCLWSYNC                              = true            {product}           
     bool UsePSAdaptiveSurvivorSizePolicy           = true            {product}           
     bool UseParNewGC                               = false           {product}           
     bool UseParallelGC                            := true            {product}           
     bool UseParallelOldGC                          = true            {product}           
     bool UsePerfData                               = true            {product}           
     bool UsePopCountInstruction                    = true            {product}           
     bool UseRDPCForConstantTableBase               = false           {C2 product}        
     bool UseSHM                                    = false           {product}           
     intx UseSSE                                    = 4               {product}           
     bool UseSSE42Intrinsics                        = true            {product}           
     bool UseSerialGC                               = false           {product}           
     bool UseSharedSpaces                           = false           {product}           
     bool UseSignalChaining                         = true            {product}           
     bool UseSplitVerifier                          = true            {product}           
     bool UseStoreImmI16                            = false           {ARCH product}      
     bool UseStringCache                            = false           {product}           
     bool UseSuperWord                              = true            {C2 product}        
     bool UseTLAB                                   = true            {pd product}        
     bool UseThreadPriorities                       = true            {pd product}        
     bool UseTransparentHugePages                   = false           {product}           
     bool UseTypeProfile                            = true            {product}           
     bool UseUnalignedLoadStores                    = true            {ARCH product}      
     bool UseVMInterruptibleIO                      = false           {product}           
     bool UseVectoredExceptions                     = false           {pd product}        
     bool UseXMMForArrayCopy                        = true            {product}           
     bool UseXmmI2D                                 = false           {ARCH product}      
     bool UseXmmI2F                                 = false           {ARCH product}      
     bool UseXmmLoadAndClearUpper                   = true            {ARCH product}      
     bool UseXmmRegToRegMoveAll                     = true            {ARCH product}      
     bool VMThreadHintNoPreempt                     = false           {product}           
     intx VMThreadPriority                          = -1              {product}           
     intx VMThreadStackSize                         = 1024            {pd product}        
     intx ValueMapInitialSize                       = 11              {C1 product}        
     intx ValueMapMaxLoopSize                       = 8               {C1 product}        
     intx ValueSearchLimit                          = 1000            {C2 product}        
     bool VerifyMergedCPBytecodes                   = true            {product}           
     intx WorkAroundNPTLTimedWaitHang               = 1               {product}           
    uintx YoungGenerationSizeIncrement              = 20              {product}           
    uintx YoungGenerationSizeSupplement             = 80              {product}           
    uintx YoungGenerationSizeSupplementDecay        = 8               {product}           
    uintx YoungPLABSize                             = 4096            {product}           
     bool ZeroTLAB                                  = false           {product}           
     intx hashCode                                  = 0               {product}           
Running org.apache.hadoop.hbase.test.IntegrationTestBigLinkedList
SUREFIRE-859: [GC 194048K->14305K(740864K), 0.0243090 secs]
SUREFIRE-859: [GC 208353K->70005K(740864K), 0.1243870 secs]
SUREFIRE-859: [GC 264053K->112141K(740864K), 0.0793980 secs]
SUREFIRE-859: [GC 306189K->132724K(934912K), 0.0468220 secs]
SUREFIRE-859: [GC 520820K->166784K(934912K), 0.0952170 secs]
SUREFIRE-859: [GC 554880K->183992K(1374208K), 0.0571860 secs]
SUREFIRE-859: [GC 960184K->260505K(1378304K), 0.1160380 secs]
SUREFIRE-859: [GC 1036697K->386442K(1678336K), 0.1094820 secs]
SUREFIRE-859: [GC 1431434K->582356K(1736704K), 0.2716820 secs]
SUREFIRE-859: [Full GC 582356K->415722K(1985536K), 0.7912920 secs]
SUREFIRE-859: [GC 1460714K->716616K(1705984K), 0.1874430 secs]
SUREFIRE-859: [GC 1482056K->905210K(1847808K), 0.3012510 secs]
SUREFIRE-859: [Full GC 905210K->610982K(2216960K), 0.4879770 secs]
SUREFIRE-859: [GC 1376422K->846730K(2186240K), 0.1404360 secs]
SUREFIRE-859: [GC 1595786K->986619K(2208768K), 0.3006240 secs]
SUREFIRE-859: [GC 1735675K->1151150K(2173952K), 0.5954870 secs]
SUREFIRE-859: [Full GC 1151150K->817129K(2507264K), 0.8671200 secs]
SUREFIRE-859: [GC 1579497K->953723K(2529280K), 0.0690230 secs]
SUREFIRE-859: [GC 1716091K->1117443K(2541568K), 0.1183210 secs]
SUREFIRE-859: [GC 1933563K->1105542K(2558464K), 0.1092820 secs]
SUREFIRE-859: [GC 1921670K->1109106K(2572800K), 0.0232250 secs]
SUREFIRE-859: [GC 1929842K->1110180K(2298880K), 0.0410010 secs]
SUREFIRE-859: [GC 1930916K->1113992K(2579456K), 0.0232910 secs]
SUREFIRE-859: [GC 1935240K->1120845K(2310144K), 0.0288350 secs]
SUREFIRE-859: [GC 1942093K->1134434K(2580480K), 0.0366930 secs]

Results :

Tests run: 0, Failures: 0, Errors: 0, Skipped: 0

[WARNING] File encoding has not been set, using platform encoding ISO-8859-1, i.e. build is platform dependent! The file encoding for reports output files should be provided by the POM property ${project.reporting.outputEncoding}.
[INFO] 
[INFO] --- maven-failsafe-plugin:2.18.1:verify (verify) @ hbase-it ---
[INFO] Failsafe report directory: <https://builds.apache.org/job/HBase-1.3-IT/it.test=IntegrationTestBigLinkedList,jdk=latest1.7,label=Hadoop/ws/hbase-it/target/failsafe-reports>
[WARNING] File encoding has not been set, using platform encoding ISO-8859-1, i.e. build is platform dependent! The file encoding for reports output files should be provided by the POM property ${project.reporting.outputEncoding}.
[INFO] ------------------------------------------------------------------------
[INFO] Reactor Summary:
[INFO] 
[INFO] Apache HBase ...................................... SUCCESS [4.765s]
[INFO] Apache HBase - Checkstyle ......................... SUCCESS [1.009s]
[INFO] Apache HBase - Resource Bundle .................... SUCCESS [0.367s]
[INFO] Apache HBase - Annotations ........................ SUCCESS [1.679s]
[INFO] Apache HBase - Protocol ........................... SUCCESS [15.206s]
[INFO] Apache HBase - Common ............................. SUCCESS [10.857s]
[INFO] Apache HBase - Procedure .......................... SUCCESS [1.738s]
[INFO] Apache HBase - Client ............................. SUCCESS [6.914s]
[INFO] Apache HBase - Hadoop Compatibility ............... SUCCESS [0.431s]
[INFO] Apache HBase - Hadoop Two Compatibility ........... SUCCESS [1.578s]
[INFO] Apache HBase - Prefix Tree ........................ SUCCESS [1.427s]
[INFO] Apache HBase - Server ............................. SUCCESS [34.494s]
[INFO] Apache HBase - Testing Util ....................... SUCCESS [1.721s]
[INFO] Apache HBase - Thrift ............................. SUCCESS [6.532s]
[INFO] Apache HBase - Rest ............................... SUCCESS [3.416s]
[INFO] Apache HBase - Shell .............................. SUCCESS [1.203s]
[INFO] Apache HBase - Integration Tests .................. FAILURE [30:03.281s]
[INFO] Apache HBase - Examples ........................... SKIPPED
[INFO] Apache HBase - External Block Cache ............... SKIPPED
[INFO] Apache HBase - Assembly ........................... SKIPPED
[INFO] Apache HBase - Shaded ............................. SKIPPED
[INFO] Apache HBase - Shaded - Client .................... SKIPPED
[INFO] Apache HBase - Shaded - Server .................... SKIPPED
[INFO] ------------------------------------------------------------------------
[INFO] BUILD FAILURE
[INFO] ------------------------------------------------------------------------
[INFO] Total time: 31:39.019s
[INFO] Finished at: Thu Jan 14 03:39:36 UTC 2016
[INFO] Final Memory: 176M/3429M
[INFO] ------------------------------------------------------------------------
[ERROR] Failed to execute goal org.apache.maven.plugins:maven-failsafe-plugin:2.18.1:verify (verify) on project hbase-it: There was a timeout or other error in the fork -> [Help 1]
[ERROR] 
[ERROR] To see the full stack trace of the errors, re-run Maven with the -e switch.
[ERROR] Re-run Maven using the -X switch to enable full debug logging.
[ERROR] 
[ERROR] For more information about the errors and possible solutions, please read the following articles:
[ERROR] [Help 1] http://cwiki.apache.org/confluence/display/MAVEN/MojoFailureException
[ERROR] 
[ERROR] After correcting the problems, you can resume the build with the command
[ERROR]   mvn <goals> -rf :hbase-it
Build step 'Invoke top-level Maven targets' marked build as failure
Performing Post build task...
Match found for :.* : True
Logical operation result is TRUE
Running script  : # Post-build task script. TODO: Check this in and have all builds reference check-in.
pwd && ls
# NOTE!!!! The below code has been copied and pasted from ./dev-tools/run-test.sh
# Do not change here without syncing there and vice-versa.
ZOMBIE_TESTS_COUNT=`jps -v | grep surefirebooter | grep -e '-Dhbase.test' | wc -l`
if [[ $ZOMBIE_TESTS_COUNT != 0 ]] ; then
 echo "Suspicious java process found - waiting 30s to see if there are just slow to stop"
 sleep 30
 ZOMBIE_TESTS_COUNT=`jps -v | grep surefirebooter | grep -e '-Dhbase.test' | wc -l`
 if [[ $ZOMBIE_TESTS_COUNT != 0 ]] ; then
   echo " {color:red}There appear to be $ZOMBIE_TESTS_COUNT zombie tests{color}, they should have been killed by surefire but survived"
   jps -v | grep surefirebooter | grep -e '-Dhbase.test'
   jps -v | grep surefirebooter | grep -e '-Dhbase.test' | cut -d ' ' -f 1 | xargs -n 1 jstack
   # Exit with error
   exit 1
 else
   echo "We're ok: there is no zombie test, but some tests took some time to stop"
 fi
else
  echo "We're ok: there is no zombie test"
fi
[Hadoop] $ /bin/bash -xe /tmp/hudson4803401738161140026.sh
+ pwd
<https://builds.apache.org/job/HBase-1.3-IT/it.test=IntegrationTestBigLinkedList,jdk=latest1.7,label=Hadoop/ws/>
+ ls
bin
CHANGES.txt
conf
dev-support
hbase-annotations
hbase-assembly
hbase-checkstyle
hbase-client
hbase-common
hbase-examples
hbase-external-blockcache
hbase-hadoop2-compat
hbase-hadoop-compat
hbase-it
hbase-native-client
hbase-prefix-tree
hbase-procedure
hbase-protocol
hbase-resource-bundle
hbase-rest
hbase-server
hbase-shaded
hbase-shell
hbase-testing-util
hbase-thrift
LICENSE.txt
NOTICE.txt
pom.xml
README.txt
src
target
++ jps -v
++ grep surefirebooter
++ grep -e -Dhbase.test
++ wc -l
+ ZOMBIE_TESTS_COUNT=0
+ [[ 0 != 0 ]]
+ echo 'We'\''re ok: there is no zombie test'
We're ok: there is no zombie test
POST BUILD TASK : SUCCESS
END OF POST BUILD TASK : 0
Archiving artifacts

Jenkins build is back to normal : HBase-1.3-IT » IntegrationTestBigLinkedList,latest1.7,Hadoop #435

Posted by Apache Jenkins Server <je...@builds.apache.org>.
See <https://builds.apache.org/job/HBase-1.3-IT/it.test=IntegrationTestBigLinkedList,jdk=latest1.7,label=Hadoop/435/>