You are viewing a plain text version of this content. The canonical link for it is here.
Posted to builds@lucene.apache.org by Apache Jenkins Server <je...@builds.apache.org> on 2019/10/19 03:24:49 UTC

[JENKINS] Lucene-Solr-BadApples-NightlyTests-master - Build # 84 - Unstable

Build: https://builds.apache.org/job/Lucene-Solr-BadApples-NightlyTests-master/84/

1 tests failed.
FAILED:  org.apache.solr.cloud.MoveReplicaHDFSTest.test

Error Message:
Error from server at https://127.0.0.1:40885/solr: org.apache.solr.common.SolrException  at org.apache.solr.client.solrj.SolrResponse.getException(SolrResponse.java:60)  at org.apache.solr.handler.admin.CollectionsHandler.invokeAction(CollectionsHandler.java:281)  at org.apache.solr.handler.admin.CollectionsHandler.handleRequestBody(CollectionsHandler.java:253)  at org.apache.solr.handler.RequestHandlerBase.handleRequest(RequestHandlerBase.java:198)  at org.apache.solr.servlet.HttpSolrCall.handleAdmin(HttpSolrCall.java:843)  at org.apache.solr.servlet.HttpSolrCall.handleAdminRequest(HttpSolrCall.java:809)  at org.apache.solr.servlet.HttpSolrCall.call(HttpSolrCall.java:562)  at org.apache.solr.servlet.SolrDispatchFilter.doFilter(SolrDispatchFilter.java:424)  at org.apache.solr.servlet.SolrDispatchFilter.doFilter(SolrDispatchFilter.java:351)  at org.eclipse.jetty.servlet.ServletHandler$CachedChain.doFilter(ServletHandler.java:1610)  at org.apache.solr.client.solrj.embedded.JettySolrRunner$DebugFilter.doFilter(JettySolrRunner.java:167)  at org.eclipse.jetty.servlet.ServletHandler$CachedChain.doFilter(ServletHandler.java:1610)  at org.eclipse.jetty.servlet.ServletHandler.doHandle(ServletHandler.java:540)  at org.eclipse.jetty.server.handler.ScopedHandler.nextHandle(ScopedHandler.java:255)  at org.eclipse.jetty.server.session.SessionHandler.doHandle(SessionHandler.java:1711)  at org.eclipse.jetty.server.handler.ScopedHandler.nextHandle(ScopedHandler.java:255)  at org.eclipse.jetty.server.handler.ContextHandler.doHandle(ContextHandler.java:1347)  at org.eclipse.jetty.server.handler.ScopedHandler.nextScope(ScopedHandler.java:203)  at org.eclipse.jetty.servlet.ServletHandler.doScope(ServletHandler.java:480)  at org.eclipse.jetty.server.session.SessionHandler.doScope(SessionHandler.java:1678)  at org.eclipse.jetty.server.handler.ScopedHandler.nextScope(ScopedHandler.java:201)  at org.eclipse.jetty.server.handler.ContextHandler.doScope(ContextHandler.java:1249)  at org.eclipse.jetty.server.handler.ScopedHandler.handle(ScopedHandler.java:144)  at org.eclipse.jetty.server.handler.HandlerWrapper.handle(HandlerWrapper.java:132)  at org.eclipse.jetty.rewrite.handler.RewriteHandler.handle(RewriteHandler.java:335)  at org.eclipse.jetty.server.handler.gzip.GzipHandler.handle(GzipHandler.java:753)  at org.eclipse.jetty.server.handler.HandlerWrapper.handle(HandlerWrapper.java:132)  at org.eclipse.jetty.server.Server.handle(Server.java:505)  at org.eclipse.jetty.server.HttpChannel.handle(HttpChannel.java:370)  at org.eclipse.jetty.server.HttpConnection.onFillable(HttpConnection.java:267)  at org.eclipse.jetty.io.AbstractConnection$ReadCallback.succeeded(AbstractConnection.java:305)  at org.eclipse.jetty.io.FillInterest.fillable(FillInterest.java:103)  at org.eclipse.jetty.io.ssl.SslConnection$DecryptedEndPoint.onFillable(SslConnection.java:427)  at org.eclipse.jetty.io.ssl.SslConnection.onFillable(SslConnection.java:321)  at org.eclipse.jetty.io.ssl.SslConnection$2.succeeded(SslConnection.java:159)  at org.eclipse.jetty.io.FillInterest.fillable(FillInterest.java:103)  at org.eclipse.jetty.io.ChannelEndPoint$2.run(ChannelEndPoint.java:117)  at org.eclipse.jetty.util.thread.QueuedThreadPool.runJob(QueuedThreadPool.java:781)  at org.eclipse.jetty.util.thread.QueuedThreadPool$Runner.run(QueuedThreadPool.java:917)  at java.base/java.lang.Thread.run(Thread.java:834) 

Stack Trace:
org.apache.solr.client.solrj.impl.HttpSolrClient$RemoteSolrException: Error from server at https://127.0.0.1:40885/solr: org.apache.solr.common.SolrException
	at org.apache.solr.client.solrj.SolrResponse.getException(SolrResponse.java:60)
	at org.apache.solr.handler.admin.CollectionsHandler.invokeAction(CollectionsHandler.java:281)
	at org.apache.solr.handler.admin.CollectionsHandler.handleRequestBody(CollectionsHandler.java:253)
	at org.apache.solr.handler.RequestHandlerBase.handleRequest(RequestHandlerBase.java:198)
	at org.apache.solr.servlet.HttpSolrCall.handleAdmin(HttpSolrCall.java:843)
	at org.apache.solr.servlet.HttpSolrCall.handleAdminRequest(HttpSolrCall.java:809)
	at org.apache.solr.servlet.HttpSolrCall.call(HttpSolrCall.java:562)
	at org.apache.solr.servlet.SolrDispatchFilter.doFilter(SolrDispatchFilter.java:424)
	at org.apache.solr.servlet.SolrDispatchFilter.doFilter(SolrDispatchFilter.java:351)
	at org.eclipse.jetty.servlet.ServletHandler$CachedChain.doFilter(ServletHandler.java:1610)
	at org.apache.solr.client.solrj.embedded.JettySolrRunner$DebugFilter.doFilter(JettySolrRunner.java:167)
	at org.eclipse.jetty.servlet.ServletHandler$CachedChain.doFilter(ServletHandler.java:1610)
	at org.eclipse.jetty.servlet.ServletHandler.doHandle(ServletHandler.java:540)
	at org.eclipse.jetty.server.handler.ScopedHandler.nextHandle(ScopedHandler.java:255)
	at org.eclipse.jetty.server.session.SessionHandler.doHandle(SessionHandler.java:1711)
	at org.eclipse.jetty.server.handler.ScopedHandler.nextHandle(ScopedHandler.java:255)
	at org.eclipse.jetty.server.handler.ContextHandler.doHandle(ContextHandler.java:1347)
	at org.eclipse.jetty.server.handler.ScopedHandler.nextScope(ScopedHandler.java:203)
	at org.eclipse.jetty.servlet.ServletHandler.doScope(ServletHandler.java:480)
	at org.eclipse.jetty.server.session.SessionHandler.doScope(SessionHandler.java:1678)
	at org.eclipse.jetty.server.handler.ScopedHandler.nextScope(ScopedHandler.java:201)
	at org.eclipse.jetty.server.handler.ContextHandler.doScope(ContextHandler.java:1249)
	at org.eclipse.jetty.server.handler.ScopedHandler.handle(ScopedHandler.java:144)
	at org.eclipse.jetty.server.handler.HandlerWrapper.handle(HandlerWrapper.java:132)
	at org.eclipse.jetty.rewrite.handler.RewriteHandler.handle(RewriteHandler.java:335)
	at org.eclipse.jetty.server.handler.gzip.GzipHandler.handle(GzipHandler.java:753)
	at org.eclipse.jetty.server.handler.HandlerWrapper.handle(HandlerWrapper.java:132)
	at org.eclipse.jetty.server.Server.handle(Server.java:505)
	at org.eclipse.jetty.server.HttpChannel.handle(HttpChannel.java:370)
	at org.eclipse.jetty.server.HttpConnection.onFillable(HttpConnection.java:267)
	at org.eclipse.jetty.io.AbstractConnection$ReadCallback.succeeded(AbstractConnection.java:305)
	at org.eclipse.jetty.io.FillInterest.fillable(FillInterest.java:103)
	at org.eclipse.jetty.io.ssl.SslConnection$DecryptedEndPoint.onFillable(SslConnection.java:427)
	at org.eclipse.jetty.io.ssl.SslConnection.onFillable(SslConnection.java:321)
	at org.eclipse.jetty.io.ssl.SslConnection$2.succeeded(SslConnection.java:159)
	at org.eclipse.jetty.io.FillInterest.fillable(FillInterest.java:103)
	at org.eclipse.jetty.io.ChannelEndPoint$2.run(ChannelEndPoint.java:117)
	at org.eclipse.jetty.util.thread.QueuedThreadPool.runJob(QueuedThreadPool.java:781)
	at org.eclipse.jetty.util.thread.QueuedThreadPool$Runner.run(QueuedThreadPool.java:917)
	at java.base/java.lang.Thread.run(Thread.java:834)

	at __randomizedtesting.SeedInfo.seed([CDA8CFAF8B59E171:45FCF07525A58C89]:0)
	at org.apache.solr.client.solrj.impl.HttpSolrClient.executeMethod(HttpSolrClient.java:665)
	at org.apache.solr.client.solrj.impl.HttpSolrClient.request(HttpSolrClient.java:265)
	at org.apache.solr.client.solrj.impl.HttpSolrClient.request(HttpSolrClient.java:248)
	at org.apache.solr.client.solrj.impl.LBSolrClient.doRequest(LBSolrClient.java:368)
	at org.apache.solr.client.solrj.impl.LBSolrClient.request(LBSolrClient.java:296)
	at org.apache.solr.client.solrj.impl.BaseCloudSolrClient.sendRequest(BaseCloudSolrClient.java:1127)
	at org.apache.solr.client.solrj.impl.BaseCloudSolrClient.requestWithRetryOnStaleState(BaseCloudSolrClient.java:896)
	at org.apache.solr.client.solrj.impl.BaseCloudSolrClient.request(BaseCloudSolrClient.java:828)
	at org.apache.solr.client.solrj.SolrRequest.process(SolrRequest.java:207)
	at org.apache.solr.client.solrj.SolrRequest.process(SolrRequest.java:224)
	at org.apache.solr.cloud.MoveReplicaTest.test(MoveReplicaTest.java:195)
	at java.base/jdk.internal.reflect.NativeMethodAccessorImpl.invoke0(Native Method)
	at java.base/jdk.internal.reflect.NativeMethodAccessorImpl.invoke(NativeMethodAccessorImpl.java:62)
	at java.base/jdk.internal.reflect.DelegatingMethodAccessorImpl.invoke(DelegatingMethodAccessorImpl.java:43)
	at java.base/java.lang.reflect.Method.invoke(Method.java:566)
	at com.carrotsearch.randomizedtesting.RandomizedRunner.invoke(RandomizedRunner.java:1750)
	at com.carrotsearch.randomizedtesting.RandomizedRunner$8.evaluate(RandomizedRunner.java:938)
	at com.carrotsearch.randomizedtesting.RandomizedRunner$9.evaluate(RandomizedRunner.java:974)
	at com.carrotsearch.randomizedtesting.RandomizedRunner$10.evaluate(RandomizedRunner.java:988)
	at com.carrotsearch.randomizedtesting.rules.SystemPropertiesRestoreRule$1.evaluate(SystemPropertiesRestoreRule.java:57)
	at org.apache.lucene.util.TestRuleSetupTeardownChained$1.evaluate(TestRuleSetupTeardownChained.java:49)
	at org.apache.lucene.util.AbstractBeforeAfterRule$1.evaluate(AbstractBeforeAfterRule.java:45)
	at org.apache.lucene.util.TestRuleThreadAndTestName$1.evaluate(TestRuleThreadAndTestName.java:48)
	at org.apache.lucene.util.TestRuleIgnoreAfterMaxFailures$1.evaluate(TestRuleIgnoreAfterMaxFailures.java:64)
	at org.apache.lucene.util.TestRuleMarkFailure$1.evaluate(TestRuleMarkFailure.java:47)
	at com.carrotsearch.randomizedtesting.rules.StatementAdapter.evaluate(StatementAdapter.java:36)
	at com.carrotsearch.randomizedtesting.ThreadLeakControl$StatementRunner.run(ThreadLeakControl.java:368)
	at com.carrotsearch.randomizedtesting.ThreadLeakControl.forkTimeoutingTask(ThreadLeakControl.java:817)
	at com.carrotsearch.randomizedtesting.ThreadLeakControl$3.evaluate(ThreadLeakControl.java:468)
	at com.carrotsearch.randomizedtesting.RandomizedRunner.runSingleTest(RandomizedRunner.java:947)
	at com.carrotsearch.randomizedtesting.RandomizedRunner$5.evaluate(RandomizedRunner.java:832)
	at com.carrotsearch.randomizedtesting.RandomizedRunner$6.evaluate(RandomizedRunner.java:883)
	at com.carrotsearch.randomizedtesting.RandomizedRunner$7.evaluate(RandomizedRunner.java:894)
	at com.carrotsearch.randomizedtesting.rules.StatementAdapter.evaluate(StatementAdapter.java:36)
	at com.carrotsearch.randomizedtesting.rules.SystemPropertiesRestoreRule$1.evaluate(SystemPropertiesRestoreRule.java:57)
	at org.apache.lucene.util.AbstractBeforeAfterRule$1.evaluate(AbstractBeforeAfterRule.java:45)
	at com.carrotsearch.randomizedtesting.rules.StatementAdapter.evaluate(StatementAdapter.java:36)
	at org.apache.lucene.util.TestRuleStoreClassName$1.evaluate(TestRuleStoreClassName.java:41)
	at com.carrotsearch.randomizedtesting.rules.NoShadowingOrOverridesOnMethodsRule$1.evaluate(NoShadowingOrOverridesOnMethodsRule.java:40)
	at com.carrotsearch.randomizedtesting.rules.NoShadowingOrOverridesOnMethodsRule$1.evaluate(NoShadowingOrOverridesOnMethodsRule.java:40)
	at com.carrotsearch.randomizedtesting.rules.StatementAdapter.evaluate(StatementAdapter.java:36)
	at com.carrotsearch.randomizedtesting.rules.StatementAdapter.evaluate(StatementAdapter.java:36)
	at org.apache.lucene.util.TestRuleAssertionsRequired$1.evaluate(TestRuleAssertionsRequired.java:53)
	at org.apache.lucene.util.TestRuleMarkFailure$1.evaluate(TestRuleMarkFailure.java:47)
	at org.apache.lucene.util.TestRuleIgnoreAfterMaxFailures$1.evaluate(TestRuleIgnoreAfterMaxFailures.java:64)
	at org.apache.lucene.util.TestRuleIgnoreTestSuites$1.evaluate(TestRuleIgnoreTestSuites.java:54)
	at com.carrotsearch.randomizedtesting.rules.StatementAdapter.evaluate(StatementAdapter.java:36)
	at com.carrotsearch.randomizedtesting.ThreadLeakControl$StatementRunner.run(ThreadLeakControl.java:368)
	at java.base/java.lang.Thread.run(Thread.java:834)




Build Log:
[...truncated 14860 lines...]
   [junit4] Suite: org.apache.solr.cloud.MoveReplicaHDFSTest
   [junit4]   2> 2987172 INFO  (SUITE-MoveReplicaHDFSTest-seed#[CDA8CFAF8B59E171]-worker) [     ] o.a.s.SolrTestCaseJ4 Created dataDir: /home/jenkins/jenkins-slave/workspace/Lucene-Solr-BadApples-NightlyTests-master/checkout/solr/build/solr-core/test/J2/temp/solr.cloud.MoveReplicaHDFSTest_CDA8CFAF8B59E171-001/data-dir-190-001
   [junit4]   2> 2987172 INFO  (SUITE-MoveReplicaHDFSTest-seed#[CDA8CFAF8B59E171]-worker) [     ] o.a.s.SolrTestCaseJ4 Using PointFields (NUMERIC_POINTS_SYSPROP=true) w/NUMERIC_DOCVALUES_SYSPROP=true
   [junit4]   2> 2987173 INFO  (SUITE-MoveReplicaHDFSTest-seed#[CDA8CFAF8B59E171]-worker) [     ] o.a.s.SolrTestCaseJ4 Randomized ssl (true) and clientAuth (false) via: @org.apache.solr.util.RandomizeSSL(reason="", ssl=0.0/0.0, value=0.0/0.0, clientAuth=0.0/0.0)
   [junit4]   2> 2987177 INFO  (SUITE-MoveReplicaHDFSTest-seed#[CDA8CFAF8B59E171]-worker) [     ] o.a.s.SolrTestCaseJ4 SecureRandom sanity checks: test.solr.allowed.securerandom=null & java.security.egd=file:/dev/./urandom
   [junit4]   1> Formatting using clusterid: testClusterID
   [junit4]   2> 2987235 WARN  (SUITE-MoveReplicaHDFSTest-seed#[CDA8CFAF8B59E171]-worker) [     ] o.a.h.m.i.MetricsConfig Cannot locate configuration: tried hadoop-metrics2-namenode.properties,hadoop-metrics2.properties
   [junit4]   2> 2987241 WARN  (SUITE-MoveReplicaHDFSTest-seed#[CDA8CFAF8B59E171]-worker) [     ] o.a.h.h.HttpRequestLog Jetty request log can only be enabled using Log4j
   [junit4]   2> 2987243 INFO  (SUITE-MoveReplicaHDFSTest-seed#[CDA8CFAF8B59E171]-worker) [     ] o.e.j.s.Server jetty-9.4.19.v20190610; built: 2019-06-10T16:30:51.723Z; git: afcf563148970e98786327af5e07c261fda175d3; jvm 11.0.4+10-LTS
   [junit4]   2> 2987243 INFO  (SUITE-MoveReplicaHDFSTest-seed#[CDA8CFAF8B59E171]-worker) [     ] o.e.j.s.session DefaultSessionIdManager workerName=node0
   [junit4]   2> 2987243 INFO  (SUITE-MoveReplicaHDFSTest-seed#[CDA8CFAF8B59E171]-worker) [     ] o.e.j.s.session No SessionScavenger set, using defaults
   [junit4]   2> 2987243 INFO  (SUITE-MoveReplicaHDFSTest-seed#[CDA8CFAF8B59E171]-worker) [     ] o.e.j.s.session node0 Scavenging every 600000ms
   [junit4]   2> 2987244 INFO  (SUITE-MoveReplicaHDFSTest-seed#[CDA8CFAF8B59E171]-worker) [     ] o.e.j.s.h.ContextHandler Started o.e.j.s.ServletContextHandler@5b281e8d{static,/static,jar:file:/home/jenkins/.ivy2/cache/org.apache.hadoop/hadoop-hdfs/tests/hadoop-hdfs-3.2.0-tests.jar!/webapps/static,AVAILABLE}
   [junit4]   2> 2987353 INFO  (SUITE-MoveReplicaHDFSTest-seed#[CDA8CFAF8B59E171]-worker) [     ] o.e.j.s.h.ContextHandler Started o.e.j.w.WebAppContext@7c36eec{hdfs,/,file:///home/jenkins/jenkins-slave/workspace/Lucene-Solr-BadApples-NightlyTests-master/checkout/solr/build/solr-core/test/J2/temp/jetty-localhost.localdomain-33661-hdfs-_-any-12818126054072459290.dir/webapp/,AVAILABLE}{/hdfs}
   [junit4]   2> 2987353 INFO  (SUITE-MoveReplicaHDFSTest-seed#[CDA8CFAF8B59E171]-worker) [     ] o.e.j.s.AbstractConnector Started ServerConnector@8c97d45{HTTP/1.1,[http/1.1]}{localhost.localdomain:33661}
   [junit4]   2> 2987353 INFO  (SUITE-MoveReplicaHDFSTest-seed#[CDA8CFAF8B59E171]-worker) [     ] o.e.j.s.Server Started @2987402ms
   [junit4]   2> 2987447 WARN  (SUITE-MoveReplicaHDFSTest-seed#[CDA8CFAF8B59E171]-worker) [     ] o.a.h.h.HttpRequestLog Jetty request log can only be enabled using Log4j
   [junit4]   2> 2987448 INFO  (SUITE-MoveReplicaHDFSTest-seed#[CDA8CFAF8B59E171]-worker) [     ] o.e.j.s.Server jetty-9.4.19.v20190610; built: 2019-06-10T16:30:51.723Z; git: afcf563148970e98786327af5e07c261fda175d3; jvm 11.0.4+10-LTS
   [junit4]   2> 2987449 INFO  (SUITE-MoveReplicaHDFSTest-seed#[CDA8CFAF8B59E171]-worker) [     ] o.e.j.s.session DefaultSessionIdManager workerName=node0
   [junit4]   2> 2987449 INFO  (SUITE-MoveReplicaHDFSTest-seed#[CDA8CFAF8B59E171]-worker) [     ] o.e.j.s.session No SessionScavenger set, using defaults
   [junit4]   2> 2987449 INFO  (SUITE-MoveReplicaHDFSTest-seed#[CDA8CFAF8B59E171]-worker) [     ] o.e.j.s.session node0 Scavenging every 600000ms
   [junit4]   2> 2987449 INFO  (SUITE-MoveReplicaHDFSTest-seed#[CDA8CFAF8B59E171]-worker) [     ] o.e.j.s.h.ContextHandler Started o.e.j.s.ServletContextHandler@159302e4{static,/static,jar:file:/home/jenkins/.ivy2/cache/org.apache.hadoop/hadoop-hdfs/tests/hadoop-hdfs-3.2.0-tests.jar!/webapps/static,AVAILABLE}
   [junit4]   2> 2987554 INFO  (SUITE-MoveReplicaHDFSTest-seed#[CDA8CFAF8B59E171]-worker) [     ] o.e.j.s.h.ContextHandler Started o.e.j.w.WebAppContext@470d2f4b{datanode,/,file:///home/jenkins/jenkins-slave/workspace/Lucene-Solr-BadApples-NightlyTests-master/checkout/solr/build/solr-core/test/J2/temp/jetty-localhost-45949-datanode-_-any-7112806261982435117.dir/webapp/,AVAILABLE}{/datanode}
   [junit4]   2> 2987554 INFO  (SUITE-MoveReplicaHDFSTest-seed#[CDA8CFAF8B59E171]-worker) [     ] o.e.j.s.AbstractConnector Started ServerConnector@5073214f{HTTP/1.1,[http/1.1]}{localhost:45949}
   [junit4]   2> 2987554 INFO  (SUITE-MoveReplicaHDFSTest-seed#[CDA8CFAF8B59E171]-worker) [     ] o.e.j.s.Server Started @2987603ms
   [junit4]   2> 2987696 INFO  (Block report processor) [     ] BlockStateChange BLOCK* processReport 0xfb51331645cd07b: Processing first storage report for DS-3aebf946-5cd6-4dfb-b9ed-f783645621f2 from datanode 8e03b05c-bfc0-4d01-b5fa-4a11a779dd7c
   [junit4]   2> 2987696 INFO  (Block report processor) [     ] BlockStateChange BLOCK* processReport 0xfb51331645cd07b: from storage DS-3aebf946-5cd6-4dfb-b9ed-f783645621f2 node DatanodeRegistration(127.0.0.1:37291, datanodeUuid=8e03b05c-bfc0-4d01-b5fa-4a11a779dd7c, infoPort=39041, infoSecurePort=0, ipcPort=42333, storageInfo=lv=-57;cid=testClusterID;nsid=1071143481;c=1571451051256), blocks: 0, hasStaleStorage: true, processing time: 1 msecs, invalidatedBlocks: 0
   [junit4]   2> 2987696 INFO  (Block report processor) [     ] BlockStateChange BLOCK* processReport 0xfb51331645cd07b: Processing first storage report for DS-ad798de2-3bf2-4766-9e07-a74ec726963f from datanode 8e03b05c-bfc0-4d01-b5fa-4a11a779dd7c
   [junit4]   2> 2987696 INFO  (Block report processor) [     ] BlockStateChange BLOCK* processReport 0xfb51331645cd07b: from storage DS-ad798de2-3bf2-4766-9e07-a74ec726963f node DatanodeRegistration(127.0.0.1:37291, datanodeUuid=8e03b05c-bfc0-4d01-b5fa-4a11a779dd7c, infoPort=39041, infoSecurePort=0, ipcPort=42333, storageInfo=lv=-57;cid=testClusterID;nsid=1071143481;c=1571451051256), blocks: 0, hasStaleStorage: false, processing time: 0 msecs, invalidatedBlocks: 0
   [junit4] IGNOR/A 0.00s J2 | MoveReplicaHDFSTest.testFailedMove
   [junit4]    > Assumption #1: 'awaitsfix' test group is disabled (@AwaitsFix(bugUrl="https://issues.apache.org/jira/browse/SOLR-12080"))
   [junit4]   2> 2987787 INFO  (TEST-MoveReplicaHDFSTest.test-seed#[CDA8CFAF8B59E171]) [     ] o.a.s.SolrTestCaseJ4 ###Starting test
   [junit4]   2> 2987787 INFO  (TEST-MoveReplicaHDFSTest.test-seed#[CDA8CFAF8B59E171]) [     ] o.a.s.c.MiniSolrCloudCluster Starting cluster of 4 servers in /home/jenkins/jenkins-slave/workspace/Lucene-Solr-BadApples-NightlyTests-master/checkout/solr/build/solr-core/test/J2/temp/solr.cloud.MoveReplicaHDFSTest_CDA8CFAF8B59E171-001/tempDir-002
   [junit4]   2> 2987788 INFO  (TEST-MoveReplicaHDFSTest.test-seed#[CDA8CFAF8B59E171]) [     ] o.a.s.c.ZkTestServer STARTING ZK TEST SERVER
   [junit4]   2> 2987788 INFO  (ZkTestServer Run Thread) [     ] o.a.s.c.ZkTestServer client port:0.0.0.0/0.0.0.0:0
   [junit4]   2> 2987788 INFO  (ZkTestServer Run Thread) [     ] o.a.s.c.ZkTestServer Starting server
   [junit4]   2> 2987888 INFO  (TEST-MoveReplicaHDFSTest.test-seed#[CDA8CFAF8B59E171]) [     ] o.a.s.c.ZkTestServer start zk server on port:39105
   [junit4]   2> 2987888 INFO  (TEST-MoveReplicaHDFSTest.test-seed#[CDA8CFAF8B59E171]) [     ] o.a.s.c.ZkTestServer waitForServerUp: 127.0.0.1:39105
   [junit4]   2> 2987888 INFO  (TEST-MoveReplicaHDFSTest.test-seed#[CDA8CFAF8B59E171]) [     ] o.a.s.c.ZkTestServer parse host and port list: 127.0.0.1:39105
   [junit4]   2> 2987888 INFO  (TEST-MoveReplicaHDFSTest.test-seed#[CDA8CFAF8B59E171]) [     ] o.a.s.c.ZkTestServer connecting to 127.0.0.1 39105
   [junit4]   2> 2987890 INFO  (TEST-MoveReplicaHDFSTest.test-seed#[CDA8CFAF8B59E171]) [     ] o.a.s.c.c.ConnectionManager Waiting for client to connect to ZooKeeper
   [junit4]   2> 2987892 INFO  (zkConnectionManagerCallback-12368-thread-1) [     ] o.a.s.c.c.ConnectionManager zkClient has connected
   [junit4]   2> 2987892 INFO  (TEST-MoveReplicaHDFSTest.test-seed#[CDA8CFAF8B59E171]) [     ] o.a.s.c.c.ConnectionManager Client is connected to ZooKeeper
   [junit4]   2> 2987896 INFO  (TEST-MoveReplicaHDFSTest.test-seed#[CDA8CFAF8B59E171]) [     ] o.a.s.c.c.ConnectionManager Waiting for client to connect to ZooKeeper
   [junit4]   2> 2987897 INFO  (zkConnectionManagerCallback-12370-thread-1) [     ] o.a.s.c.c.ConnectionManager zkClient has connected
   [junit4]   2> 2987897 INFO  (TEST-MoveReplicaHDFSTest.test-seed#[CDA8CFAF8B59E171]) [     ] o.a.s.c.c.ConnectionManager Client is connected to ZooKeeper
   [junit4]   2> 2987897 INFO  (TEST-MoveReplicaHDFSTest.test-seed#[CDA8CFAF8B59E171]) [     ] o.a.s.c.c.ConnectionManager Waiting for client to connect to ZooKeeper
   [junit4]   2> 2987898 INFO  (zkConnectionManagerCallback-12372-thread-1) [     ] o.a.s.c.c.ConnectionManager zkClient has connected
   [junit4]   2> 2987898 INFO  (TEST-MoveReplicaHDFSTest.test-seed#[CDA8CFAF8B59E171]) [     ] o.a.s.c.c.ConnectionManager Client is connected to ZooKeeper
   [junit4]   2> 2988002 WARN  (jetty-launcher-12373-thread-2) [     ] o.e.j.s.AbstractConnector Ignoring deprecated socket close linger time
   [junit4]   2> 2988002 WARN  (jetty-launcher-12373-thread-3) [     ] o.e.j.s.AbstractConnector Ignoring deprecated socket close linger time
   [junit4]   2> 2988002 INFO  (jetty-launcher-12373-thread-3) [     ] o.a.s.c.s.e.JettySolrRunner Start Jetty (configured port=0, binding port=0)
   [junit4]   2> 2988002 INFO  (jetty-launcher-12373-thread-2) [     ] o.a.s.c.s.e.JettySolrRunner Start Jetty (configured port=0, binding port=0)
   [junit4]   2> 2988002 INFO  (jetty-launcher-12373-thread-2) [     ] o.a.s.c.s.e.JettySolrRunner Trying to start Jetty on port 0 try number 1 ...
   [junit4]   2> 2988002 INFO  (jetty-launcher-12373-thread-3) [     ] o.a.s.c.s.e.JettySolrRunner Trying to start Jetty on port 0 try number 1 ...
   [junit4]   2> 2988002 INFO  (jetty-launcher-12373-thread-2) [     ] o.e.j.s.Server jetty-9.4.19.v20190610; built: 2019-06-10T16:30:51.723Z; git: afcf563148970e98786327af5e07c261fda175d3; jvm 11.0.4+10-LTS
   [junit4]   2> 2988002 INFO  (jetty-launcher-12373-thread-3) [     ] o.e.j.s.Server jetty-9.4.19.v20190610; built: 2019-06-10T16:30:51.723Z; git: afcf563148970e98786327af5e07c261fda175d3; jvm 11.0.4+10-LTS
   [junit4]   2> 2988002 WARN  (jetty-launcher-12373-thread-1) [     ] o.e.j.s.AbstractConnector Ignoring deprecated socket close linger time
   [junit4]   2> 2988003 INFO  (jetty-launcher-12373-thread-1) [     ] o.a.s.c.s.e.JettySolrRunner Start Jetty (configured port=0, binding port=0)
   [junit4]   2> 2988003 INFO  (jetty-launcher-12373-thread-1) [     ] o.a.s.c.s.e.JettySolrRunner Trying to start Jetty on port 0 try number 1 ...
   [junit4]   2> 2988003 INFO  (jetty-launcher-12373-thread-1) [     ] o.e.j.s.Server jetty-9.4.19.v20190610; built: 2019-06-10T16:30:51.723Z; git: afcf563148970e98786327af5e07c261fda175d3; jvm 11.0.4+10-LTS
   [junit4]   2> 2988003 WARN  (jetty-launcher-12373-thread-4) [     ] o.e.j.s.AbstractConnector Ignoring deprecated socket close linger time
   [junit4]   2> 2988003 INFO  (jetty-launcher-12373-thread-4) [     ] o.a.s.c.s.e.JettySolrRunner Start Jetty (configured port=0, binding port=0)
   [junit4]   2> 2988003 INFO  (jetty-launcher-12373-thread-4) [     ] o.a.s.c.s.e.JettySolrRunner Trying to start Jetty on port 0 try number 1 ...
   [junit4]   2> 2988003 INFO  (jetty-launcher-12373-thread-4) [     ] o.e.j.s.Server jetty-9.4.19.v20190610; built: 2019-06-10T16:30:51.723Z; git: afcf563148970e98786327af5e07c261fda175d3; jvm 11.0.4+10-LTS
   [junit4]   2> 2988007 INFO  (jetty-launcher-12373-thread-1) [     ] o.e.j.s.session DefaultSessionIdManager workerName=node0
   [junit4]   2> 2988007 INFO  (jetty-launcher-12373-thread-1) [     ] o.e.j.s.session No SessionScavenger set, using defaults
   [junit4]   2> 2988008 INFO  (jetty-launcher-12373-thread-4) [     ] o.e.j.s.session DefaultSessionIdManager workerName=node0
   [junit4]   2> 2988008 INFO  (jetty-launcher-12373-thread-4) [     ] o.e.j.s.session No SessionScavenger set, using defaults
   [junit4]   2> 2988008 INFO  (jetty-launcher-12373-thread-4) [     ] o.e.j.s.session node0 Scavenging every 660000ms
   [junit4]   2> 2988008 INFO  (jetty-launcher-12373-thread-1) [     ] o.e.j.s.session node0 Scavenging every 660000ms
   [junit4]   2> 2988008 INFO  (jetty-launcher-12373-thread-4) [     ] o.e.j.s.h.ContextHandler Started o.e.j.s.ServletContextHandler@24d6e3b4{/solr,null,AVAILABLE}
   [junit4]   2> 2988008 INFO  (jetty-launcher-12373-thread-1) [     ] o.e.j.s.h.ContextHandler Started o.e.j.s.ServletContextHandler@3353c871{/solr,null,AVAILABLE}
   [junit4]   2> 2988009 INFO  (jetty-launcher-12373-thread-4) [     ] o.e.j.s.AbstractConnector Started ServerConnector@25970888{ssl,[ssl, alpn, http/1.1, h2]}{127.0.0.1:42925}
   [junit4]   2> 2988009 INFO  (jetty-launcher-12373-thread-4) [     ] o.e.j.s.Server Started @2988058ms
   [junit4]   2> 2988009 INFO  (jetty-launcher-12373-thread-4) [     ] o.a.s.c.s.e.JettySolrRunner Jetty properties: {hostContext=/solr, hostPort=42925}
   [junit4]   2> 2988009 ERROR (jetty-launcher-12373-thread-4) [     ] o.a.s.u.StartupLoggingUtils Missing Java Option solr.log.dir. Logging may be missing or incomplete.
   [junit4]   2> 2988009 INFO  (jetty-launcher-12373-thread-4) [     ] o.a.s.s.SolrDispatchFilter Using logger factory org.apache.logging.slf4j.Log4jLoggerFactory
   [junit4]   2> 2988009 INFO  (jetty-launcher-12373-thread-4) [     ] o.a.s.s.SolrDispatchFilter  ___      _       Welcome to Apache Solr™ version 9.0.0
   [junit4]   2> 2988009 INFO  (jetty-launcher-12373-thread-4) [     ] o.a.s.s.SolrDispatchFilter / __| ___| |_ _   Starting in cloud mode on port null
   [junit4]   2> 2988009 INFO  (jetty-launcher-12373-thread-4) [     ] o.a.s.s.SolrDispatchFilter \__ \/ _ \ | '_|  Install dir: null
   [junit4]   2> 2988009 INFO  (jetty-launcher-12373-thread-4) [     ] o.a.s.s.SolrDispatchFilter |___/\___/_|_|    Start time: 2019-10-19T02:10:52.075375Z
   [junit4]   2> 2988010 INFO  (jetty-launcher-12373-thread-3) [     ] o.e.j.s.session DefaultSessionIdManager workerName=node0
   [junit4]   2> 2988010 INFO  (jetty-launcher-12373-thread-3) [     ] o.e.j.s.session No SessionScavenger set, using defaults
   [junit4]   2> 2988010 INFO  (jetty-launcher-12373-thread-3) [     ] o.e.j.s.session node0 Scavenging every 660000ms
   [junit4]   2> 2988010 INFO  (jetty-launcher-12373-thread-1) [     ] o.e.j.s.AbstractConnector Started ServerConnector@6192880a{ssl,[ssl, alpn, http/1.1, h2]}{127.0.0.1:40885}
   [junit4]   2> 2988010 INFO  (jetty-launcher-12373-thread-1) [     ] o.e.j.s.Server Started @2988059ms
   [junit4]   2> 2988010 INFO  (jetty-launcher-12373-thread-1) [     ] o.a.s.c.s.e.JettySolrRunner Jetty properties: {hostContext=/solr, hostPort=40885}
   [junit4]   2> 2988010 ERROR (jetty-launcher-12373-thread-1) [     ] o.a.s.u.StartupLoggingUtils Missing Java Option solr.log.dir. Logging may be missing or incomplete.
   [junit4]   2> 2988010 INFO  (jetty-launcher-12373-thread-1) [     ] o.a.s.s.SolrDispatchFilter Using logger factory org.apache.logging.slf4j.Log4jLoggerFactory
   [junit4]   2> 2988010 INFO  (jetty-launcher-12373-thread-1) [     ] o.a.s.s.SolrDispatchFilter  ___      _       Welcome to Apache Solr™ version 9.0.0
   [junit4]   2> 2988010 INFO  (jetty-launcher-12373-thread-1) [     ] o.a.s.s.SolrDispatchFilter / __| ___| |_ _   Starting in cloud mode on port null
   [junit4]   2> 2988010 INFO  (jetty-launcher-12373-thread-1) [     ] o.a.s.s.SolrDispatchFilter \__ \/ _ \ | '_|  Install dir: null
   [junit4]   2> 2988010 INFO  (jetty-launcher-12373-thread-1) [     ] o.a.s.s.SolrDispatchFilter |___/\___/_|_|    Start time: 2019-10-19T02:10:52.076626Z
   [junit4]   2> 2988011 INFO  (jetty-launcher-12373-thread-3) [     ] o.e.j.s.h.ContextHandler Started o.e.j.s.ServletContextHandler@48e6a59c{/solr,null,AVAILABLE}
   [junit4]   2> 2988011 INFO  (jetty-launcher-12373-thread-3) [     ] o.e.j.s.AbstractConnector Started ServerConnector@2c90380d{ssl,[ssl, alpn, http/1.1, h2]}{127.0.0.1:42529}
   [junit4]   2> 2988011 INFO  (jetty-launcher-12373-thread-3) [     ] o.e.j.s.Server Started @2988061ms
   [junit4]   2> 2988011 INFO  (jetty-launcher-12373-thread-3) [     ] o.a.s.c.s.e.JettySolrRunner Jetty properties: {hostContext=/solr, hostPort=42529}
   [junit4]   2> 2988012 ERROR (jetty-launcher-12373-thread-3) [     ] o.a.s.u.StartupLoggingUtils Missing Java Option solr.log.dir. Logging may be missing or incomplete.
   [junit4]   2> 2988012 INFO  (jetty-launcher-12373-thread-3) [     ] o.a.s.s.SolrDispatchFilter Using logger factory org.apache.logging.slf4j.Log4jLoggerFactory
   [junit4]   2> 2988012 INFO  (jetty-launcher-12373-thread-3) [     ] o.a.s.s.SolrDispatchFilter  ___      _       Welcome to Apache Solr™ version 9.0.0
   [junit4]   2> 2988012 INFO  (jetty-launcher-12373-thread-3) [     ] o.a.s.s.SolrDispatchFilter / __| ___| |_ _   Starting in cloud mode on port null
   [junit4]   2> 2988012 INFO  (jetty-launcher-12373-thread-3) [     ] o.a.s.s.SolrDispatchFilter \__ \/ _ \ | '_|  Install dir: null
   [junit4]   2> 2988012 INFO  (jetty-launcher-12373-thread-3) [     ] o.a.s.s.SolrDispatchFilter |___/\___/_|_|    Start time: 2019-10-19T02:10:52.078177Z
   [junit4]   2> 2988012 INFO  (jetty-launcher-12373-thread-4) [     ] o.a.s.c.c.ConnectionManager Waiting for client to connect to ZooKeeper
   [junit4]   2> 2988012 INFO  (zkConnectionManagerCallback-12375-thread-1) [     ] o.a.s.c.c.ConnectionManager zkClient has connected
   [junit4]   2> 2988012 INFO  (jetty-launcher-12373-thread-4) [     ] o.a.s.c.c.ConnectionManager Client is connected to ZooKeeper
   [junit4]   2> 2988013 INFO  (jetty-launcher-12373-thread-4) [     ] o.a.s.s.SolrDispatchFilter solr.xml found in ZooKeeper. Loading...
   [junit4]   2> 2988013 INFO  (jetty-launcher-12373-thread-3) [     ] o.a.s.c.c.ConnectionManager Waiting for client to connect to ZooKeeper
   [junit4]   2> 2988015 INFO  (jetty-launcher-12373-thread-4) [     ] o.a.s.c.SolrXmlConfig Configuration parameter autoReplicaFailoverWorkLoopDelay is ignored
   [junit4]   2> 2988015 INFO  (jetty-launcher-12373-thread-4) [     ] o.a.s.c.SolrXmlConfig Configuration parameter autoReplicaFailoverBadNodeExpiration is ignored
   [junit4]   2> 2988017 INFO  (jetty-launcher-12373-thread-4) [     ] o.a.s.c.SolrXmlConfig MBean server found: com.sun.jmx.mbeanserver.JmxMBeanServer@32024b33, but no JMX reporters were configured - adding default JMX reporter.
   [junit4]   2> 2988017 INFO  (jetty-launcher-12373-thread-1) [     ] o.a.s.c.c.ConnectionManager Waiting for client to connect to ZooKeeper
   [junit4]   2> 2988017 INFO  (jetty-launcher-12373-thread-2) [     ] o.e.j.s.session DefaultSessionIdManager workerName=node0
   [junit4]   2> 2988017 INFO  (jetty-launcher-12373-thread-2) [     ] o.e.j.s.session No SessionScavenger set, using defaults
   [junit4]   2> 2988017 INFO  (jetty-launcher-12373-thread-2) [     ] o.e.j.s.session node0 Scavenging every 600000ms
   [junit4]   2> 2988017 INFO  (zkConnectionManagerCallback-12377-thread-1) [     ] o.a.s.c.c.ConnectionManager zkClient has connected
   [junit4]   2> 2988017 INFO  (jetty-launcher-12373-thread-1) [     ] o.a.s.c.c.ConnectionManager Client is connected to ZooKeeper
   [junit4]   2> 2988018 INFO  (zkConnectionManagerCallback-12379-thread-1) [     ] o.a.s.c.c.ConnectionManager zkClient has connected
   [junit4]   2> 2988018 INFO  (jetty-launcher-12373-thread-3) [     ] o.a.s.c.c.ConnectionManager Client is connected to ZooKeeper
   [junit4]   2> 2988018 INFO  (jetty-launcher-12373-thread-2) [     ] o.e.j.s.h.ContextHandler Started o.e.j.s.ServletContextHandler@26c68b9b{/solr,null,AVAILABLE}
   [junit4]   2> 2988018 INFO  (jetty-launcher-12373-thread-1) [     ] o.a.s.s.SolrDispatchFilter solr.xml found in ZooKeeper. Loading...
   [junit4]   2> 2988018 INFO  (jetty-launcher-12373-thread-3) [     ] o.a.s.s.SolrDispatchFilter solr.xml found in ZooKeeper. Loading...
   [junit4]   2> 2988018 INFO  (jetty-launcher-12373-thread-2) [     ] o.e.j.s.AbstractConnector Started ServerConnector@4583ea6f{ssl,[ssl, alpn, http/1.1, h2]}{127.0.0.1:40201}
   [junit4]   2> 2988018 INFO  (jetty-launcher-12373-thread-2) [     ] o.e.j.s.Server Started @2988067ms
   [junit4]   2> 2988018 INFO  (jetty-launcher-12373-thread-2) [     ] o.a.s.c.s.e.JettySolrRunner Jetty properties: {hostContext=/solr, hostPort=40201}
   [junit4]   2> 2988019 ERROR (jetty-launcher-12373-thread-2) [     ] o.a.s.u.StartupLoggingUtils Missing Java Option solr.log.dir. Logging may be missing or incomplete.
   [junit4]   2> 2988019 INFO  (jetty-launcher-12373-thread-2) [     ] o.a.s.s.SolrDispatchFilter Using logger factory org.apache.logging.slf4j.Log4jLoggerFactory
   [junit4]   2> 2988019 INFO  (jetty-launcher-12373-thread-2) [     ] o.a.s.s.SolrDispatchFilter  ___      _       Welcome to Apache Solr™ version 9.0.0
   [junit4]   2> 2988019 INFO  (jetty-launcher-12373-thread-2) [     ] o.a.s.s.SolrDispatchFilter / __| ___| |_ _   Starting in cloud mode on port null
   [junit4]   2> 2988019 INFO  (jetty-launcher-12373-thread-2) [     ] o.a.s.s.SolrDispatchFilter \__ \/ _ \ | '_|  Install dir: null
   [junit4]   2> 2988019 INFO  (jetty-launcher-12373-thread-2) [     ] o.a.s.s.SolrDispatchFilter |___/\___/_|_|    Start time: 2019-10-19T02:10:52.085137Z
   [junit4]   2> 2988019 INFO  (jetty-launcher-12373-thread-2) [     ] o.a.s.c.c.ConnectionManager Waiting for client to connect to ZooKeeper
   [junit4]   2> 2988020 INFO  (jetty-launcher-12373-thread-1) [     ] o.a.s.c.SolrXmlConfig Configuration parameter autoReplicaFailoverWorkLoopDelay is ignored
   [junit4]   2> 2988020 INFO  (jetty-launcher-12373-thread-1) [     ] o.a.s.c.SolrXmlConfig Configuration parameter autoReplicaFailoverBadNodeExpiration is ignored
   [junit4]   2> 2988020 INFO  (jetty-launcher-12373-thread-3) [     ] o.a.s.c.SolrXmlConfig Configuration parameter autoReplicaFailoverWorkLoopDelay is ignored
   [junit4]   2> 2988020 INFO  (jetty-launcher-12373-thread-3) [     ] o.a.s.c.SolrXmlConfig Configuration parameter autoReplicaFailoverBadNodeExpiration is ignored
   [junit4]   2> 2988021 INFO  (zkConnectionManagerCallback-12381-thread-1) [     ] o.a.s.c.c.ConnectionManager zkClient has connected
   [junit4]   2> 2988021 INFO  (jetty-launcher-12373-thread-2) [     ] o.a.s.c.c.ConnectionManager Client is connected to ZooKeeper
   [junit4]   2> 2988021 INFO  (jetty-launcher-12373-thread-3) [     ] o.a.s.c.SolrXmlConfig MBean server found: com.sun.jmx.mbeanserver.JmxMBeanServer@32024b33, but no JMX reporters were configured - adding default JMX reporter.
   [junit4]   2> 2988022 INFO  (jetty-launcher-12373-thread-1) [     ] o.a.s.c.SolrXmlConfig MBean server found: com.sun.jmx.mbeanserver.JmxMBeanServer@32024b33, but no JMX reporters were configured - adding default JMX reporter.
   [junit4]   2> 2988022 INFO  (jetty-launcher-12373-thread-2) [     ] o.a.s.s.SolrDispatchFilter solr.xml found in ZooKeeper. Loading...
   [junit4]   2> 2988023 INFO  (jetty-launcher-12373-thread-2) [     ] o.a.s.c.SolrXmlConfig Configuration parameter autoReplicaFailoverWorkLoopDelay is ignored
   [junit4]   2> 2988023 INFO  (jetty-launcher-12373-thread-2) [     ] o.a.s.c.SolrXmlConfig Configuration parameter autoReplicaFailoverBadNodeExpiration is ignored
   [junit4]   2> 2988025 INFO  (jetty-launcher-12373-thread-2) [     ] o.a.s.c.SolrXmlConfig MBean server found: com.sun.jmx.mbeanserver.JmxMBeanServer@32024b33, but no JMX reporters were configured - adding default JMX reporter.
   [junit4]   2> 2988280 INFO  (jetty-launcher-12373-thread-2) [     ] o.a.s.h.c.HttpShardHandlerFactory Host whitelist initialized: WhitelistHostChecker [whitelistHosts=null, whitelistHostCheckingEnabled=true]
   [junit4]   2> 2988281 WARN  (jetty-launcher-12373-thread-2) [     ] o.e.j.u.s.S.config Trusting all certificates configured for Client@5aad67c9[provider=null,keyStore=null,trustStore=null]
   [junit4]   2> 2988281 WARN  (jetty-launcher-12373-thread-2) [     ] o.e.j.u.s.S.config No Client EndPointIdentificationAlgorithm configured for Client@5aad67c9[provider=null,keyStore=null,trustStore=null]
   [junit4]   2> 2988283 WARN  (jetty-launcher-12373-thread-2) [     ] o.e.j.u.s.S.config Trusting all certificates configured for Client@4e13af45[provider=null,keyStore=null,trustStore=null]
   [junit4]   2> 2988283 WARN  (jetty-launcher-12373-thread-2) [     ] o.e.j.u.s.S.config No Client EndPointIdentificationAlgorithm configured for Client@4e13af45[provider=null,keyStore=null,trustStore=null]
   [junit4]   2> 2988284 INFO  (jetty-launcher-12373-thread-2) [     ] o.a.s.c.ZkContainer Zookeeper client=127.0.0.1:39105/solr
   [junit4]   2> 2988285 INFO  (jetty-launcher-12373-thread-2) [     ] o.a.s.c.c.ConnectionManager Waiting for client to connect to ZooKeeper
   [junit4]   2> 2988286 INFO  (zkConnectionManagerCallback-12389-thread-1) [     ] o.a.s.c.c.ConnectionManager zkClient has connected
   [junit4]   2> 2988286 INFO  (jetty-launcher-12373-thread-2) [     ] o.a.s.c.c.ConnectionManager Client is connected to ZooKeeper
   [junit4]   2> 2988353 INFO  (jetty-launcher-12373-thread-4) [     ] o.a.s.h.c.HttpShardHandlerFactory Host whitelist initialized: WhitelistHostChecker [whitelistHosts=null, whitelistHostCheckingEnabled=true]
   [junit4]   2> 2988354 WARN  (jetty-launcher-12373-thread-4) [     ] o.e.j.u.s.S.config Trusting all certificates configured for Client@235d173d[provider=null,keyStore=null,trustStore=null]
   [junit4]   2> 2988354 WARN  (jetty-launcher-12373-thread-4) [     ] o.e.j.u.s.S.config No Client EndPointIdentificationAlgorithm configured for Client@235d173d[provider=null,keyStore=null,trustStore=null]
   [junit4]   2> 2988356 WARN  (jetty-launcher-12373-thread-4) [     ] o.e.j.u.s.S.config Trusting all certificates configured for Client@4df68256[provider=null,keyStore=null,trustStore=null]
   [junit4]   2> 2988356 WARN  (jetty-launcher-12373-thread-4) [     ] o.e.j.u.s.S.config No Client EndPointIdentificationAlgorithm configured for Client@4df68256[provider=null,keyStore=null,trustStore=null]
   [junit4]   2> 2988358 INFO  (jetty-launcher-12373-thread-4) [     ] o.a.s.c.ZkContainer Zookeeper client=127.0.0.1:39105/solr
   [junit4]   2> 2988361 INFO  (jetty-launcher-12373-thread-4) [     ] o.a.s.c.c.ConnectionManager Waiting for client to connect to ZooKeeper
   [junit4]   2> 2988361 INFO  (zkConnectionManagerCallback-12396-thread-1) [     ] o.a.s.c.c.ConnectionManager zkClient has connected
   [junit4]   2> 2988361 INFO  (jetty-launcher-12373-thread-4) [     ] o.a.s.c.c.ConnectionManager Client is connected to ZooKeeper
   [junit4]   2> 2988410 INFO  (jetty-launcher-12373-thread-3) [     ] o.a.s.h.c.HttpShardHandlerFactory Host whitelist initialized: WhitelistHostChecker [whitelistHosts=null, whitelistHostCheckingEnabled=true]
   [junit4]   2> 2988411 WARN  (jetty-launcher-12373-thread-3) [     ] o.e.j.u.s.S.config Trusting all certificates configured for Client@27c4403b[provider=null,keyStore=null,trustStore=null]
   [junit4]   2> 2988411 WARN  (jetty-launcher-12373-thread-3) [     ] o.e.j.u.s.S.config No Client EndPointIdentificationAlgorithm configured for Client@27c4403b[provider=null,keyStore=null,trustStore=null]
   [junit4]   2> 2988414 WARN  (jetty-launcher-12373-thread-3) [     ] o.e.j.u.s.S.config Trusting all certificates configured for Client@2ba75d89[provider=null,keyStore=null,trustStore=null]
   [junit4]   2> 2988414 WARN  (jetty-launcher-12373-thread-3) [     ] o.e.j.u.s.S.config No Client EndPointIdentificationAlgorithm configured for Client@2ba75d89[provider=null,keyStore=null,trustStore=null]
   [junit4]   2> 2988415 INFO  (jetty-launcher-12373-thread-3) [     ] o.a.s.c.ZkContainer Zookeeper client=127.0.0.1:39105/solr
   [junit4]   2> 2988416 INFO  (jetty-launcher-12373-thread-3) [     ] o.a.s.c.c.ConnectionManager Waiting for client to connect to ZooKeeper
   [junit4]   2> 2988417 INFO  (zkConnectionManagerCallback-12402-thread-1) [     ] o.a.s.c.c.ConnectionManager zkClient has connected
   [junit4]   2> 2988417 INFO  (jetty-launcher-12373-thread-3) [     ] o.a.s.c.c.ConnectionManager Client is connected to ZooKeeper
   [junit4]   2> 2988519 INFO  (jetty-launcher-12373-thread-3) [n:127.0.0.1:42529_solr     ] o.a.s.c.c.ConnectionManager Waiting for client to connect to ZooKeeper
   [junit4]   2> 2988520 INFO  (zkConnectionManagerCallback-12405-thread-1) [     ] o.a.s.c.c.ConnectionManager zkClient has connected
   [junit4]   2> 2988520 INFO  (jetty-launcher-12373-thread-3) [n:127.0.0.1:42529_solr     ] o.a.s.c.c.ConnectionManager Client is connected to ZooKeeper
   [junit4]   2> 2988559 INFO  (jetty-launcher-12373-thread-1) [     ] o.a.s.h.c.HttpShardHandlerFactory Host whitelist initialized: WhitelistHostChecker [whitelistHosts=null, whitelistHostCheckingEnabled=true]
   [junit4]   2> 2988560 WARN  (jetty-launcher-12373-thread-1) [     ] o.e.j.u.s.S.config Trusting all certificates configured for Client@d3faeef[provider=null,keyStore=null,trustStore=null]
   [junit4]   2> 2988560 WARN  (jetty-launcher-12373-thread-1) [     ] o.e.j.u.s.S.config No Client EndPointIdentificationAlgorithm configured for Client@d3faeef[provider=null,keyStore=null,trustStore=null]
   [junit4]   2> 2988563 WARN  (jetty-launcher-12373-thread-1) [     ] o.e.j.u.s.S.config Trusting all certificates configured for Client@3d1370a2[provider=null,keyStore=null,trustStore=null]
   [junit4]   2> 2988563 WARN  (jetty-launcher-12373-thread-1) [     ] o.e.j.u.s.S.config No Client EndPointIdentificationAlgorithm configured for Client@3d1370a2[provider=null,keyStore=null,trustStore=null]
   [junit4]   2> 2988564 INFO  (jetty-launcher-12373-thread-1) [     ] o.a.s.c.ZkContainer Zookeeper client=127.0.0.1:39105/solr
   [junit4]   2> 2988564 INFO  (jetty-launcher-12373-thread-1) [     ] o.a.s.c.c.ConnectionManager Waiting for client to connect to ZooKeeper
   [junit4]   2> 2988566 INFO  (zkConnectionManagerCallback-12413-thread-1) [     ] o.a.s.c.c.ConnectionManager zkClient has connected
   [junit4]   2> 2988566 INFO  (jetty-launcher-12373-thread-1) [     ] o.a.s.c.c.ConnectionManager Client is connected to ZooKeeper
   [junit4]   2> 2988577 INFO  (jetty-launcher-12373-thread-3) [n:127.0.0.1:42529_solr     ] o.a.s.c.OverseerElectionContext I am going to be the leader 127.0.0.1:42529_solr
   [junit4]   2> 2988578 INFO  (jetty-launcher-12373-thread-3) [n:127.0.0.1:42529_solr     ] o.a.s.c.Overseer Overseer (id=72573535707725834-127.0.0.1:42529_solr-n_0000000000) starting
   [junit4]   2> 2988581 INFO  (OverseerStateUpdate-72573535707725834-127.0.0.1:42529_solr-n_0000000000) [n:127.0.0.1:42529_solr     ] o.a.s.c.Overseer Starting to work on the main queue : 127.0.0.1:42529_solr
   [junit4]   2> 2988582 INFO  (jetty-launcher-12373-thread-3) [n:127.0.0.1:42529_solr     ] o.a.s.c.ZkController Register node as live in ZooKeeper:/live_nodes/127.0.0.1:42529_solr
   [junit4]   2> 2988583 INFO  (OverseerStateUpdate-72573535707725834-127.0.0.1:42529_solr-n_0000000000) [n:127.0.0.1:42529_solr     ] o.a.s.c.c.ZkStateReader Updated live nodes from ZooKeeper... (0) -> (1)
   [junit4]   2> 2988596 INFO  (jetty-launcher-12373-thread-3) [n:127.0.0.1:42529_solr     ] o.a.s.h.a.MetricsHistoryHandler No .system collection, keeping metrics history in memory.
   [junit4]   2> 2988606 INFO  (jetty-launcher-12373-thread-3) [n:127.0.0.1:42529_solr     ] o.a.s.m.r.SolrJmxReporter JMX monitoring for 'solr.node' (registry 'solr.node') enabled at server: com.sun.jmx.mbeanserver.JmxMBeanServer@32024b33
   [junit4]   2> 2988612 INFO  (jetty-launcher-12373-thread-3) [n:127.0.0.1:42529_solr     ] o.a.s.m.r.SolrJmxReporter JMX monitoring for 'solr.jvm' (registry 'solr.jvm') enabled at server: com.sun.jmx.mbeanserver.JmxMBeanServer@32024b33
   [junit4]   2> 2988612 INFO  (jetty-launcher-12373-thread-3) [n:127.0.0.1:42529_solr     ] o.a.s.m.r.SolrJmxReporter JMX monitoring for 'solr.jetty' (registry 'solr.jetty') enabled at server: com.sun.jmx.mbeanserver.JmxMBeanServer@32024b33
   [junit4]   2> 2988613 INFO  (jetty-launcher-12373-thread-3) [n:127.0.0.1:42529_solr     ] o.a.s.c.CorePropertiesLocator Found 0 core definitions underneath /home/jenkins/jenkins-slave/workspace/Lucene-Solr-BadApples-NightlyTests-master/checkout/solr/build/solr-core/test/J2/temp/solr.cloud.MoveReplicaHDFSTest_CDA8CFAF8B59E171-001/tempDir-002/node3/.
   [junit4]   2> 2988619 INFO  (jetty-launcher-12373-thread-4) [n:127.0.0.1:42925_solr     ] o.a.s.c.c.ConnectionManager Waiting for client to connect to ZooKeeper
   [junit4]   2> 2988620 INFO  (zkConnectionManagerCallback-12417-thread-1) [     ] o.a.s.c.c.ConnectionManager zkClient has connected
   [junit4]   2> 2988620 INFO  (jetty-launcher-12373-thread-4) [n:127.0.0.1:42925_solr     ] o.a.s.c.c.ConnectionManager Client is connected to ZooKeeper
   [junit4]   2> 2988623 INFO  (jetty-launcher-12373-thread-4) [n:127.0.0.1:42925_solr     ] o.a.s.c.c.ZkStateReader Updated live nodes from ZooKeeper... (0) -> (1)
   [junit4]   2> 2988626 INFO  (jetty-launcher-12373-thread-4) [n:127.0.0.1:42925_solr     ] o.a.s.c.ZkController Publish node=127.0.0.1:42925_solr as DOWN
   [junit4]   2> 2988626 INFO  (jetty-launcher-12373-thread-4) [n:127.0.0.1:42925_solr     ] o.a.s.c.TransientSolrCoreCacheDefault Allocating transient cache for 4 transient cores
   [junit4]   2> 2988626 INFO  (jetty-launcher-12373-thread-4) [n:127.0.0.1:42925_solr     ] o.a.s.c.ZkController Register node as live in ZooKeeper:/live_nodes/127.0.0.1:42925_solr
   [junit4]   2> 2988627 INFO  (zkCallback-12404-thread-1) [     ] o.a.s.c.c.ZkStateReader Updated live nodes from ZooKeeper... (1) -> (2)
   [junit4]   2> 2988627 INFO  (zkCallback-12416-thread-1) [     ] o.a.s.c.c.ZkStateReader Updated live nodes from ZooKeeper... (1) -> (2)
   [junit4]   2> 2988638 INFO  (jetty-launcher-12373-thread-4) [n:127.0.0.1:42925_solr     ] o.a.s.h.a.MetricsHistoryHandler No .system collection, keeping metrics history in memory.
   [junit4]   2> 2988651 INFO  (jetty-launcher-12373-thread-4) [n:127.0.0.1:42925_solr     ] o.a.s.m.r.SolrJmxReporter JMX monitoring for 'solr.node' (registry 'solr.node') enabled at server: com.sun.jmx.mbeanserver.JmxMBeanServer@32024b33
   [junit4]   2> 2988658 INFO  (jetty-launcher-12373-thread-4) [n:127.0.0.1:42925_solr     ] o.a.s.m.r.SolrJmxReporter JMX monitoring for 'solr.jvm' (registry 'solr.jvm') enabled at server: com.sun.jmx.mbeanserver.JmxMBeanServer@32024b33
   [junit4]   2> 2988658 INFO  (jetty-launcher-12373-thread-4) [n:127.0.0.1:42925_solr     ] o.a.s.m.r.SolrJmxReporter JMX monitoring for 'solr.jetty' (registry 'solr.jetty') enabled at server: com.sun.jmx.mbeanserver.JmxMBeanServer@32024b33
   [junit4]   2> 2988659 INFO  (jetty-launcher-12373-thread-4) [n:127.0.0.1:42925_solr     ] o.a.s.c.CorePropertiesLocator Found 0 core definitions underneath /home/jenkins/jenkins-slave/workspace/Lucene-Solr-BadApples-NightlyTests-master/checkout/solr/build/solr-core/test/J2/temp/solr.cloud.MoveReplicaHDFSTest_CDA8CFAF8B59E171-001/tempDir-002/node4/.
   [junit4]   2> 2988720 INFO  (jetty-launcher-12373-thread-2) [n:127.0.0.1:40201_solr     ] o.a.s.c.c.ConnectionManager Waiting for client to connect to ZooKeeper
   [junit4]   2> 2988722 INFO  (zkConnectionManagerCallback-12423-thread-1) [     ] o.a.s.c.c.ConnectionManager zkClient has connected
   [junit4]   2> 2988722 INFO  (jetty-launcher-12373-thread-2) [n:127.0.0.1:40201_solr     ] o.a.s.c.c.ConnectionManager Client is connected to ZooKeeper
   [junit4]   2> 2988733 INFO  (jetty-launcher-12373-thread-2) [n:127.0.0.1:40201_solr     ] o.a.s.c.c.ZkStateReader Updated live nodes from ZooKeeper... (0) -> (2)
   [junit4]   2> 2988735 INFO  (jetty-launcher-12373-thread-2) [n:127.0.0.1:40201_solr     ] o.a.s.c.ZkController Publish node=127.0.0.1:40201_solr as DOWN
   [junit4]   2> 2988736 INFO  (jetty-launcher-12373-thread-2) [n:127.0.0.1:40201_solr     ] o.a.s.c.TransientSolrCoreCacheDefault Allocating transient cache for 4 transient cores
   [junit4]   2> 2988736 INFO  (jetty-launcher-12373-thread-2) [n:127.0.0.1:40201_solr     ] o.a.s.c.ZkController Register node as live in ZooKeeper:/live_nodes/127.0.0.1:40201_solr
   [junit4]   2> 2988737 INFO  (zkCallback-12404-thread-1) [     ] o.a.s.c.c.ZkStateReader Updated live nodes from ZooKeeper... (2) -> (3)
   [junit4]   2> 2988737 INFO  (zkCallback-12416-thread-1) [     ] o.a.s.c.c.ZkStateReader Updated live nodes from ZooKeeper... (2) -> (3)
   [junit4]   2> 2988745 INFO  (zkCallback-12422-thread-1) [     ] o.a.s.c.c.ZkStateReader Updated live nodes from ZooKeeper... (2) -> (3)
   [junit4]   2> 2988751 INFO  (jetty-launcher-12373-thread-2) [n:127.0.0.1:40201_solr     ] o.a.s.h.a.MetricsHistoryHandler No .system collection, keeping metrics history in memory.
   [junit4]   2> 2988764 INFO  (jetty-launcher-12373-thread-2) [n:127.0.0.1:40201_solr     ] o.a.s.m.r.SolrJmxReporter JMX monitoring for 'solr.node' (registry 'solr.node') enabled at server: com.sun.jmx.mbeanserver.JmxMBeanServer@32024b33
   [junit4]   2> 2988771 INFO  (jetty-launcher-12373-thread-2) [n:127.0.0.1:40201_solr     ] o.a.s.m.r.SolrJmxReporter JMX monitoring for 'solr.jvm' (registry 'solr.jvm') enabled at server: com.sun.jmx.mbeanserver.JmxMBeanServer@32024b33
   [junit4]   2> 2988771 INFO  (jetty-launcher-12373-thread-2) [n:127.0.0.1:40201_solr     ] o.a.s.m.r.SolrJmxReporter JMX monitoring for 'solr.jetty' (registry 'solr.jetty') enabled at server: com.sun.jmx.mbeanserver.JmxMBeanServer@32024b33
   [junit4]   2> 2988772 INFO  (jetty-launcher-12373-thread-2) [n:127.0.0.1:40201_solr     ] o.a.s.c.CorePropertiesLocator Found 0 core definitions underneath /home/jenkins/jenkins-slave/workspace/Lucene-Solr-BadApples-NightlyTests-master/checkout/solr/build/solr-core/test/J2/temp/solr.cloud.MoveReplicaHDFSTest_CDA8CFAF8B59E171-001/tempDir-002/node2/.
   [junit4]   2> 2988820 INFO  (jetty-launcher-12373-thread-1) [n:127.0.0.1:40885_solr     ] o.a.s.c.c.ConnectionManager Waiting for client to connect to ZooKeeper
   [junit4]   2> 2988821 INFO  (zkConnectionManagerCallback-12429-thread-1) [     ] o.a.s.c.c.ConnectionManager zkClient has connected
   [junit4]   2> 2988821 INFO  (jetty-launcher-12373-thread-1) [n:127.0.0.1:40885_solr     ] o.a.s.c.c.ConnectionManager Client is connected to ZooKeeper
   [junit4]   2> 2988826 INFO  (jetty-launcher-12373-thread-1) [n:127.0.0.1:40885_solr     ] o.a.s.c.c.ZkStateReader Updated live nodes from ZooKeeper... (0) -> (3)
   [junit4]   2> 2988829 INFO  (jetty-launcher-12373-thread-1) [n:127.0.0.1:40885_solr     ] o.a.s.c.ZkController Publish node=127.0.0.1:40885_solr as DOWN
   [junit4]   2> 2988830 INFO  (jetty-launcher-12373-thread-1) [n:127.0.0.1:40885_solr     ] o.a.s.c.TransientSolrCoreCacheDefault Allocating transient cache for 4 transient cores
   [junit4]   2> 2988830 INFO  (jetty-launcher-12373-thread-1) [n:127.0.0.1:40885_solr     ] o.a.s.c.ZkController Register node as live in ZooKeeper:/live_nodes/127.0.0.1:40885_solr
   [junit4]   2> 2988831 INFO  (zkCallback-12422-thread-1) [     ] o.a.s.c.c.ZkStateReader Updated live nodes from ZooKeeper... (3) -> (4)
   [junit4]   2> 2988831 INFO  (zkCallback-12404-thread-1) [     ] o.a.s.c.c.ZkStateReader Updated live nodes from ZooKeeper... (3) -> (4)
   [junit4]   2> 2988831 INFO  (zkCallback-12416-thread-1) [     ] o.a.s.c.c.ZkStateReader Updated live nodes from ZooKeeper... (3) -> (4)
   [junit4]   2> 2988831 INFO  (zkCallback-12428-thread-1) [     ] o.a.s.c.c.ZkStateReader Updated live nodes from ZooKeeper... (3) -> (4)
   [junit4]   2> 2988846 INFO  (jetty-launcher-12373-thread-1) [n:127.0.0.1:40885_solr     ] o.a.s.h.a.MetricsHistoryHandler No .system collection, keeping metrics history in memory.
   [junit4]   2> 2988859 INFO  (jetty-launcher-12373-thread-1) [n:127.0.0.1:40885_solr     ] o.a.s.m.r.SolrJmxReporter JMX monitoring for 'solr.node' (registry 'solr.node') enabled at server: com.sun.jmx.mbeanserver.JmxMBeanServer@32024b33
   [junit4]   2> 2988866 INFO  (jetty-launcher-12373-thread-1) [n:127.0.0.1:40885_solr     ] o.a.s.m.r.SolrJmxReporter JMX monitoring for 'solr.jvm' (registry 'solr.jvm') enabled at server: com.sun.jmx.mbeanserver.JmxMBeanServer@32024b33
   [junit4]   2> 2988866 INFO  (jetty-launcher-12373-thread-1) [n:127.0.0.1:40885_solr     ] o.a.s.m.r.SolrJmxReporter JMX monitoring for 'solr.jetty' (registry 'solr.jetty') enabled at server: com.sun.jmx.mbeanserver.JmxMBeanServer@32024b33
   [junit4]   2> 2988867 INFO  (jetty-launcher-12373-thread-1) [n:127.0.0.1:40885_solr     ] o.a.s.c.CorePropertiesLocator Found 0 core definitions underneath /home/jenkins/jenkins-slave/workspace/Lucene-Solr-BadApples-NightlyTests-master/checkout/solr/build/solr-core/test/J2/temp/solr.cloud.MoveReplicaHDFSTest_CDA8CFAF8B59E171-001/tempDir-002/node1/.
   [junit4]   2> 2988897 INFO  (TEST-MoveReplicaHDFSTest.test-seed#[CDA8CFAF8B59E171]) [     ] o.a.s.c.MiniSolrCloudCluster waitForAllNodes: numServers=4
   [junit4]   2> 2988898 INFO  (TEST-MoveReplicaHDFSTest.test-seed#[CDA8CFAF8B59E171]) [     ] o.a.s.c.c.ConnectionManager Waiting for client to connect to ZooKeeper
   [junit4]   2> 2988899 INFO  (zkConnectionManagerCallback-12438-thread-1) [     ] o.a.s.c.c.ConnectionManager zkClient has connected
   [junit4]   2> 2988899 INFO  (TEST-MoveReplicaHDFSTest.test-seed#[CDA8CFAF8B59E171]) [     ] o.a.s.c.c.ConnectionManager Client is connected to ZooKeeper
   [junit4]   2> 2988900 INFO  (TEST-MoveReplicaHDFSTest.test-seed#[CDA8CFAF8B59E171]) [     ] o.a.s.c.c.ZkStateReader Updated live nodes from ZooKeeper... (0) -> (4)
   [junit4]   2> 2988901 INFO  (TEST-MoveReplicaHDFSTest.test-seed#[CDA8CFAF8B59E171]) [     ] o.a.s.c.s.i.ZkClientClusterStateProvider Cluster at 127.0.0.1:39105/solr ready
   [junit4]   2> 2988917 INFO  (qtp1802167162-47518) [n:127.0.0.1:40885_solr     ] o.a.s.h.a.CollectionsHandler Invoked Collection Action :overseerstatus with params action=OVERSEERSTATUS&wt=javabin&version=2 and sendToOCPQueue=true
   [junit4]   2> 2988922 INFO  (qtp1802167162-47518) [n:127.0.0.1:40885_solr     ] o.a.s.s.HttpSolrCall [admin] webapp=null path=/admin/collections params={action=OVERSEERSTATUS&wt=javabin&version=2} status=0 QTime=4
   [junit4]   2> 2988923 INFO  (TEST-MoveReplicaHDFSTest.test-seed#[CDA8CFAF8B59E171]) [     ] o.a.s.c.MoveReplicaTest total_jettys: 4
   [junit4]   2> 2988923 INFO  (qtp1802167162-47510) [n:127.0.0.1:40885_solr     ] o.a.s.h.a.CollectionsHandler Invoked Collection Action :create with params pullReplicas=1&collection.configName=conf1&maxShardsPerNode=2&autoAddReplicas=false&name=MoveReplicaHDFSTest_coll_true&nrtReplicas=1&action=CREATE&numShards=2&tlogReplicas=0&wt=javabin&version=2 and sendToOCPQueue=true
   [junit4]   2> 2988925 INFO  (OverseerThreadFactory-11467-thread-2-processing-n:127.0.0.1:42529_solr) [n:127.0.0.1:42529_solr     ] o.a.s.c.a.c.CreateCollectionCmd Create collection MoveReplicaHDFSTest_coll_true
   [junit4]   2> 2988925 INFO  (OverseerCollectionConfigSetProcessor-72573535707725834-127.0.0.1:42529_solr-n_0000000000) [n:127.0.0.1:42529_solr     ] o.a.s.c.OverseerTaskQueue Response ZK path: /overseer/collection-queue-work/qnr-0000000000 doesn't exist.  Requestor may have disconnected from ZooKeeper
   [junit4]   2> 2989031 INFO  (OverseerStateUpdate-72573535707725834-127.0.0.1:42529_solr-n_0000000000) [n:127.0.0.1:42529_solr     ] o.a.s.c.o.SliceMutator createReplica() {
   [junit4]   2>   "operation":"ADDREPLICA",
   [junit4]   2>   "collection":"MoveReplicaHDFSTest_coll_true",
   [junit4]   2>   "shard":"shard1",
   [junit4]   2>   "core":"MoveReplicaHDFSTest_coll_true_shard1_replica_n1",
   [junit4]   2>   "state":"down",
   [junit4]   2>   "base_url":"https://127.0.0.1:40201/solr",
   [junit4]   2>   "type":"NRT",
   [junit4]   2>   "waitForFinalState":"false"} 
   [junit4]   2> 2989033 INFO  (OverseerStateUpdate-72573535707725834-127.0.0.1:42529_solr-n_0000000000) [n:127.0.0.1:42529_solr     ] o.a.s.c.o.SliceMutator createReplica() {
   [junit4]   2>   "operation":"ADDREPLICA",
   [junit4]   2>   "collection":"MoveReplicaHDFSTest_coll_true",
   [junit4]   2>   "shard":"shard1",
   [junit4]   2>   "core":"MoveReplicaHDFSTest_coll_true_shard1_replica_p2",
   [junit4]   2>   "state":"down",
   [junit4]   2>   "base_url":"https://127.0.0.1:42925/solr",
   [junit4]   2>   "type":"PULL",
   [junit4]   2>   "waitForFinalState":"false"} 
   [junit4]   2> 2989034 INFO  (OverseerStateUpdate-72573535707725834-127.0.0.1:42529_solr-n_0000000000) [n:127.0.0.1:42529_solr     ] o.a.s.c.o.SliceMutator createReplica() {
   [junit4]   2>   "operation":"ADDREPLICA",
   [junit4]   2>   "collection":"MoveReplicaHDFSTest_coll_true",
   [junit4]   2>   "shard":"shard2",
   [junit4]   2>   "core":"MoveReplicaHDFSTest_coll_true_shard2_replica_n4",
   [junit4]   2>   "state":"down",
   [junit4]   2>   "base_url":"https://127.0.0.1:42529/solr",
   [junit4]   2>   "type":"NRT",
   [junit4]   2>   "waitForFinalState":"false"} 
   [junit4]   2> 2989036 INFO  (OverseerStateUpdate-72573535707725834-127.0.0.1:42529_solr-n_0000000000) [n:127.0.0.1:42529_solr     ] o.a.s.c.o.SliceMutator createReplica() {
   [junit4]   2>   "operation":"ADDREPLICA",
   [junit4]   2>   "collection":"MoveReplicaHDFSTest_coll_true",
   [junit4]   2>   "shard":"shard2",
   [junit4]   2>   "core":"MoveReplicaHDFSTest_coll_true_shard2_replica_p6",
   [junit4]   2>   "state":"down",
   [junit4]   2>   "base_url":"https://127.0.0.1:40885/solr",
   [junit4]   2>   "type":"PULL",
   [junit4]   2>   "waitForFinalState":"false"} 
   [junit4]   2> 2989250 INFO  (qtp644371325-47532) [n:127.0.0.1:42529_solr    x:MoveReplicaHDFSTest_coll_true_shard2_replica_n4 ] o.a.s.h.a.CoreAdminOperation core create command qt=/admin/cores&coreNodeName=core_node7&collection.configName=conf1&newCollection=true&name=MoveReplicaHDFSTest_coll_true_shard2_replica_n4&action=CREATE&numShards=2&collection=MoveReplicaHDFSTest_coll_true&shard=shard2&wt=javabin&version=2&replicaType=NRT
   [junit4]   2> 2989250 INFO  (qtp644371325-47532) [n:127.0.0.1:42529_solr    x:MoveReplicaHDFSTest_coll_true_shard2_replica_n4 ] o.a.s.c.TransientSolrCoreCacheDefault Allocating transient cache for 4 transient cores
   [junit4]   2> 2989250 INFO  (qtp1802167162-47518) [n:127.0.0.1:40885_solr    x:MoveReplicaHDFSTest_coll_true_shard2_replica_p6 ] o.a.s.h.a.CoreAdminOperation core create command qt=/admin/cores&coreNodeName=core_node8&collection.configName=conf1&newCollection=true&name=MoveReplicaHDFSTest_coll_true_shard2_replica_p6&action=CREATE&numShards=2&collection=MoveReplicaHDFSTest_coll_true&shard=shard2&wt=javabin&version=2&replicaType=PULL
   [junit4]   2> 2989251 INFO  (qtp1333494047-47528) [n:127.0.0.1:40201_solr    x:MoveReplicaHDFSTest_coll_true_shard1_replica_n1 ] o.a.s.h.a.CoreAdminOperation core create command qt=/admin/cores&coreNodeName=core_node3&collection.configName=conf1&newCollection=true&name=MoveReplicaHDFSTest_coll_true_shard1_replica_n1&action=CREATE&numShards=2&collection=MoveReplicaHDFSTest_coll_true&shard=shard1&wt=javabin&version=2&replicaType=NRT
   [junit4]   2> 2989256 INFO  (qtp795829240-47521) [n:127.0.0.1:42925_solr    x:MoveReplicaHDFSTest_coll_true_shard1_replica_p2 ] o.a.s.h.a.CoreAdminOperation core create command qt=/admin/cores&coreNodeName=core_node5&collection.configName=conf1&newCollection=true&name=MoveReplicaHDFSTest_coll_true_shard1_replica_p2&action=CREATE&numShards=2&collection=MoveReplicaHDFSTest_coll_true&shard=shard1&wt=javabin&version=2&replicaType=PULL
   [junit4]   2> 2990262 INFO  (qtp644371325-47532) [n:127.0.0.1:42529_solr c:MoveReplicaHDFSTest_coll_true s:shard2 r:core_node7 x:MoveReplicaHDFSTest_coll_true_shard2_replica_n4 ] o.a.s.c.SolrConfig Using Lucene MatchVersion: 9.0.0
   [junit4]   2> 2990263 INFO  (qtp1802167162-47518) [n:127.0.0.1:40885_solr c:MoveReplicaHDFSTest_coll_true s:shard2 r:core_node8 x:MoveReplicaHDFSTest_coll_true_shard2_replica_p6 ] o.a.s.c.SolrConfig Using Lucene MatchVersion: 9.0.0
   [junit4]   2> 2990265 INFO  (qtp1333494047-47528) [n:127.0.0.1:40201_solr c:MoveReplicaHDFSTest_coll_true s:shard1 r:core_node3 x:MoveReplicaHDFSTest_coll_true_shard1_replica_n1 ] o.a.s.c.SolrConfig Using Lucene MatchVersion: 9.0.0
   [junit4]   2> 2990271 INFO  (qtp795829240-47521) [n:127.0.0.1:42925_solr c:MoveReplicaHDFSTest_coll_true s:shard1 r:core_node5 x:MoveReplicaHDFSTest_coll_true_shard1_replica_p2 ] o.a.s.c.SolrConfig Using Lucene MatchVersion: 9.0.0
   [junit4]   2> 2990272 INFO  (qtp1802167162-47518) [n:127.0.0.1:40885_solr c:MoveReplicaHDFSTest_coll_true s:shard2 r:core_node8 x:MoveReplicaHDFSTest_coll_true_shard2_replica_p6 ] o.a.s.s.IndexSchema [MoveReplicaHDFSTest_coll_true_shard2_replica_p6] Schema name=minimal
   [junit4]   2> 2990274 INFO  (qtp1802167162-47518) [n:127.0.0.1:40885_solr c:MoveReplicaHDFSTest_coll_true s:shard2 r:core_node8 x:MoveReplicaHDFSTest_coll_true_shard2_replica_p6 ] o.a.s.s.IndexSchema Loaded schema minimal/1.1 with uniqueid field id
   [junit4]   2> 2990274 INFO  (qtp1802167162-47518) [n:127.0.0.1:40885_solr c:MoveReplicaHDFSTest_coll_true s:shard2 r:core_node8 x:MoveReplicaHDFSTest_coll_true_shard2_replica_p6 ] o.a.s.c.CoreContainer Creating SolrCore 'MoveReplicaHDFSTest_coll_true_shard2_replica_p6' using configuration from collection MoveReplicaHDFSTest_coll_true, trusted=true
   [junit4]   2> 2990274 INFO  (qtp1802167162-47518) [n:127.0.0.1:40885_solr c:MoveReplicaHDFSTest_coll_true s:shard2 r:core_node8 x:MoveReplicaHDFSTest_coll_true_shard2_replica_p6 ] o.a.s.m.r.SolrJmxReporter JMX monitoring for 'solr.core.MoveReplicaHDFSTest_coll_true.shard2.replica_p6' (registry 'solr.core.MoveReplicaHDFSTest_coll_true.shard2.replica_p6') enabled at server: com.sun.jmx.mbeanserver.JmxMBeanServer@32024b33
   [junit4]   2> 2990274 INFO  (qtp1802167162-47518) [n:127.0.0.1:40885_solr c:MoveReplicaHDFSTest_coll_true s:shard2 r:core_node8 x:MoveReplicaHDFSTest_coll_true_shard2_replica_p6 ] o.a.s.c.HdfsDirectoryFactory solr.hdfs.home=hdfs://localhost.localdomain:34985/solr_hdfs_home
   [junit4]   2> 2990274 INFO  (qtp1802167162-47518) [n:127.0.0.1:40885_solr c:MoveReplicaHDFSTest_coll_true s:shard2 r:core_node8 x:MoveReplicaHDFSTest_coll_true_shard2_replica_p6 ] o.a.s.c.HdfsDirectoryFactory Solr Kerberos Authentication disabled
   [junit4]   2> 2990274 INFO  (qtp1802167162-47518) [n:127.0.0.1:40885_solr c:MoveReplicaHDFSTest_coll_true s:shard2 r:core_node8 x:MoveReplicaHDFSTest_coll_true_shard2_replica_p6 ] o.a.s.c.SolrCore [[MoveReplicaHDFSTest_coll_true_shard2_replica_p6] ] Opening new SolrCore at [/home/jenkins/jenkins-slave/workspace/Lucene-Solr-BadApples-NightlyTests-master/checkout/solr/build/solr-core/test/J2/temp/solr.cloud.MoveReplicaHDFSTest_CDA8CFAF8B59E171-001/tempDir-002/node1/MoveReplicaHDFSTest_coll_true_shard2_replica_p6], dataDir=[hdfs://localhost.localdomain:34985/solr_hdfs_home/MoveReplicaHDFSTest_coll_true/core_node8/data/]
   [junit4]   2> 2990275 INFO  (qtp1802167162-47518) [n:127.0.0.1:40885_solr c:MoveReplicaHDFSTest_coll_true s:shard2 r:core_node8 x:MoveReplicaHDFSTest_coll_true_shard2_replica_p6 ] o.a.s.c.HdfsDirectoryFactory creating directory factory for path hdfs://localhost.localdomain:34985/solr_hdfs_home/MoveReplicaHDFSTest_coll_true/core_node8/data/snapshot_metadata
   [junit4]   2> 2990279 INFO  (qtp1333494047-47528) [n:127.0.0.1:40201_solr c:MoveReplicaHDFSTest_coll_true s:shard1 r:core_node3 x:MoveReplicaHDFSTest_coll_true_shard1_replica_n1 ] o.a.s.s.IndexSchema [MoveReplicaHDFSTest_coll_true_shard1_replica_n1] Schema name=minimal
   [junit4]   2> 2990280 INFO  (qtp644371325-47532) [n:127.0.0.1:42529_solr c:MoveReplicaHDFSTest_coll_true s:shard2 r:core_node7 x:MoveReplicaHDFSTest_coll_true_shard2_replica_n4 ] o.a.s.s.IndexSchema [MoveReplicaHDFSTest_coll_true_shard2_replica_n4] Schema name=minimal
   [junit4]   2> 2990281 INFO  (qtp1333494047-47528) [n:127.0.0.1:40201_solr c:MoveReplicaHDFSTest_coll_true s:shard1 r:core_node3 x:MoveReplicaHDFSTest_coll_true_shard1_replica_n1 ] o.a.s.s.IndexSchema Loaded schema minimal/1.1 with uniqueid field id
   [junit4]   2> 2990281 INFO  (qtp1333494047-47528) [n:127.0.0.1:40201_solr c:MoveReplicaHDFSTest_coll_true s:shard1 r:core_node3 x:MoveReplicaHDFSTest_coll_true_shard1_replica_n1 ] o.a.s.c.CoreContainer Creating SolrCore 'MoveReplicaHDFSTest_coll_true_shard1_replica_n1' using configuration from collection MoveReplicaHDFSTest_coll_true, trusted=true
   [junit4]   2> 2990281 INFO  (qtp1333494047-47528) [n:127.0.0.1:40201_solr c:MoveReplicaHDFSTest_coll_true s:shard1 r:core_node3 x:MoveReplicaHDFSTest_coll_true_shard1_replica_n1 ] o.a.s.m.r.SolrJmxReporter JMX monitoring for 'solr.core.MoveReplicaHDFSTest_coll_true.shard1.replica_n1' (registry 'solr.core.MoveReplicaHDFSTest_coll_true.shard1.replica_n1') enabled at server: com.sun.jmx.mbeanserver.JmxMBeanServer@32024b33
   [junit4]   2> 2990282 INFO  (qtp644371325-47532) [n:127.0.0.1:42529_solr c:MoveReplicaHDFSTest_coll_true s:shard2 r:core_node7 x:MoveReplicaHDFSTest_coll_true_shard2_replica_n4 ] o.a.s.s.IndexSchema Loaded schema minimal/1.1 with uniqueid field id
   [junit4]   2> 2990282 INFO  (qtp644371325-47532) [n:127.0.0.1:42529_solr c:MoveReplicaHDFSTest_coll_true s:shard2 r:core_node7 x:MoveReplicaHDFSTest_coll_true_shard2_replica_n4 ] o.a.s.c.CoreContainer Creating SolrCore 'MoveReplicaHDFSTest_coll_true_shard2_replica_n4' using configuration from collection MoveReplicaHDFSTest_coll_true, trusted=true
   [junit4]   2> 2990282 INFO  (qtp1333494047-47528) [n:127.0.0.1:40201_solr c:MoveReplicaHDFSTest_coll_true s:shard1 r:core_node3 x:MoveReplicaHDFSTest_coll_true_shard1_replica_n1 ] o.a.s.c.HdfsDirectoryFactory solr.hdfs.home=hdfs://localhost.localdomain:34985/solr_hdfs_home
   [junit4]   2> 2990282 INFO  (qtp1333494047-47528) [n:127.0.0.1:40201_solr c:MoveReplicaHDFSTest_coll_true s:shard1 r:core_node3 x:MoveReplicaHDFSTest_coll_true_shard1_replica_n1 ] o.a.s.c.HdfsDirectoryFactory Solr Kerberos Authentication disabled
   [junit4]   2> 2990282 INFO  (qtp1333494047-47528) [n:127.0.0.1:40201_solr c:MoveReplicaHDFSTest_coll_true s:shard1 r:core_node3 x:MoveReplicaHDFSTest_coll_true_shard1_replica_n1 ] o.a.s.c.SolrCore [[MoveReplicaHDFSTest_coll_true_shard1_replica_n1] ] Opening new SolrCore at [/home/jenkins/jenkins-slave/workspace/Lucene-Solr-BadApples-NightlyTests-master/checkout/solr/build/solr-core/test/J2/temp/solr.cloud.MoveReplicaHDFSTest_CDA8CFAF8B59E171-001/tempDir-002/node2/MoveReplicaHDFSTest_coll_true_shard1_replica_n1], dataDir=[hdfs://localhost.localdomain:34985/solr_hdfs_home/MoveReplicaHDFSTest_coll_true/core_node3/data/]
   [junit4]   2> 2990282 INFO  (qtp644371325-47532) [n:127.0.0.1:42529_solr c:MoveReplicaHDFSTest_coll_true s:shard2 r:core_node7 x:MoveReplicaHDFSTest_coll_true_shard2_replica_n4 ] o.a.s.m.r.SolrJmxReporter JMX monitoring for 'solr.core.MoveReplicaHDFSTest_coll_true.shard2.replica_n4' (registry 'solr.core.MoveReplicaHDFSTest_coll_true.shard2.replica_n4') enabled at server: com.sun.jmx.mbeanserver.JmxMBeanServer@32024b33
   [junit4]   2> 2990282 INFO  (qtp644371325-47532) [n:127.0.0.1:42529_solr c:MoveReplicaHDFSTest_coll_true s:shard2 r:core_node7 x:MoveReplicaHDFSTest_coll_true_shard2_replica_n4 ] o.a.s.c.HdfsDirectoryFactory solr.hdfs.home=hdfs://localhost.localdomain:34985/solr_hdfs_home
   [junit4]   2> 2990282 INFO  (qtp644371325-47532) [n:127.0.0.1:42529_solr c:MoveReplicaHDFSTest_coll_true s:shard2 r:core_node7 x:MoveReplicaHDFSTest_coll_true_shard2_replica_n4 ] o.a.s.c.HdfsDirectoryFactory Solr Kerberos Authentication disabled
   [junit4]   2> 2990282 INFO  (qtp644371325-47532) [n:127.0.0.1:42529_solr c:MoveReplicaHDFSTest_coll_true s:shard2 r:core_node7 x:MoveReplicaHDFSTest_coll_true_shard2_replica_n4 ] o.a.s.c.SolrCore [[MoveReplicaHDFSTest_coll_true_shard2_replica_n4] ] Opening new SolrCore at [/home/jenkins/jenkins-slave/workspace/Lucene-Solr-BadApples-NightlyTests-master/checkout/solr/build/solr-core/test/J2/temp/solr.cloud.MoveReplicaHDFSTest_CDA8CFAF8B59E171-001/tempDir-002/node3/MoveReplicaHDFSTest_coll_true_shard2_replica_n4], dataDir=[hdfs://localhost.localdomain:34985/solr_hdfs_home/MoveReplicaHDFSTest_coll_true/core_node7/data/]
   [junit4]   2> 2990282 INFO  (qtp1333494047-47528) [n:127.0.0.1:40201_solr c:MoveReplicaHDFSTest_coll_true s:shard1 r:core_node3 x:MoveReplicaHDFSTest_coll_true_shard1_replica_n1 ] o.a.s.c.HdfsDirectoryFactory creating directory factory for path hdfs://localhost.localdomain:34985/solr_hdfs_home/MoveReplicaHDFSTest_coll_true/core_node3/data/snapshot_metadata
   [junit4]   2> 2990284 INFO  (qtp795829240-47521) [n:127.0.0.1:42925_solr c:MoveReplicaHDFSTest_coll_true s:shard1 r:core_node5 x:MoveReplicaHDFSTest_coll_true_shard1_replica_p2 ] o.a.s.s.IndexSchema [MoveReplicaHDFSTest_coll_true_shard1_replica_p2] Schema name=minimal
   [junit4]   2> 2990284 INFO  (qtp1802167162-47518) [n:127.0.0.1:40885_solr c:MoveReplicaHDFSTest_coll_true s:shard2 r:core_node8 x:MoveReplicaHDFSTest_coll_true_shard2_replica_p6 ] o.a.s.c.HdfsDirectoryFactory Number of slabs of block cache [1] with direct memory allocation set to [true]
   [junit4]   2> 2990284 INFO  (qtp1802167162-47518) [n:127.0.0.1:40885_solr c:MoveReplicaHDFSTest_coll_true s:shard2 r:core_node8 x:MoveReplicaHDFSTest_coll_true_shard2_replica_p6 ] o.a.s.c.HdfsDirectoryFactory Block cache target memory usage, slab size of [4194304] will allocate [1] slabs and use ~[4194304] bytes
   [junit4]   2> 2990284 INFO  (qtp1802167162-47518) [n:127.0.0.1:40885_solr c:MoveReplicaHDFSTest_coll_true s:shard2 r:core_node8 x:MoveReplicaHDFSTest_coll_true_shard2_replica_p6 ] o.a.s.c.HdfsDirectoryFactory Creating new single instance HDFS BlockCache
   [junit4]   2> 2990285 INFO  (qtp795829240-47521) [n:127.0.0.1:42925_solr c:MoveReplicaHDFSTest_coll_true s:shard1 r:core_node5 x:MoveReplicaHDFSTest_coll_true_shard1_replica_p2 ] o.a.s.s.IndexSchema Loaded schema minimal/1.1 with uniqueid field id
   [junit4]   2> 2990285 INFO  (qtp795829240-47521) [n:127.0.0.1:42925_solr c:MoveReplicaHDFSTest_coll_true s:shard1 r:core_node5 x:MoveReplicaHDFSTest_coll_true_shard1_replica_p2 ] o.a.s.c.CoreContainer Creating SolrCore 'MoveReplicaHDFSTest_coll_true_shard1_replica_p2' using configuration from collection MoveReplicaHDFSTest_coll_true, trusted=true
   [junit4]   2> 2990286 INFO  (qtp795829240-47521) [n:127.0.0.1:42925_solr c:MoveReplicaHDFSTest_coll_true s:shard1 r:core_node5 x:MoveReplicaHDFSTest_coll_true_shard1_replica_p2 ] o.a.s.m.r.SolrJmxReporter JMX monitoring for 'solr.core.MoveReplicaHDFSTest_coll_true.shard1.replica_p2' (registry 'solr.core.MoveReplicaHDFSTest_coll_true.shard1.replica_p2') enabled at server: com.sun.jmx.mbeanserver.JmxMBeanServer@32024b33
   [junit4]   2> 2990286 INFO  (qtp795829240-47521) [n:127.0.0.1:42925_solr c:MoveReplicaHDFSTest_coll_true s:shard1 r:core_node5 x:MoveReplicaHDFSTest_coll_true_shard1_replica_p2 ] o.a.s.c.HdfsDirectoryFactory solr.hdfs.home=hdfs://localhost.localdomain:34985/solr_hdfs_home
   [junit4]   2> 2990286 INFO  (qtp795829240-47521) [n:127.0.0.1:42925_solr c:MoveReplicaHDFSTest_coll_true s:shard1 r:core_node5 x:MoveReplicaHDFSTest_coll_true_shard1_replica_p2 ] o.a.s.c.HdfsDirectoryFactory Solr Kerberos Authentication disabled
   [junit4]   2> 2990286 INFO  (qtp795829240-47521) [n:127.0.0.1:42925_solr c:MoveReplicaHDFSTest_coll_true s:shard1 r:core_node5 x:MoveReplicaHDFSTest_coll_true_shard1_replica_p2 ] o.a.s.c.SolrCore [[MoveReplicaHDFSTest_coll_true_shard1_replica_p2] ] Opening new SolrCore at [/home/jenkins/jenkins-slave/workspace/Lucene-Solr-BadApples-NightlyTests-master/checkout/solr/build/solr-core/test/J2/temp/solr.cloud.MoveReplicaHDFSTest_CDA8CFAF8B59E171-001/tempDir-002/node4/MoveReplicaHDFSTest_coll_true_shard1_replica_p2], dataDir=[hdfs://localhost.localdomain:34985/solr_hdfs_home/MoveReplicaHDFSTest_coll_true/core_node5/data/]
   [junit4]   2> 2990286 WARN  (qtp1802167162-47518) [n:127.0.0.1:40885_solr c:MoveReplicaHDFSTest_coll_true s:shard2 r:core_node8 x:MoveReplicaHDFSTest_coll_true_shard2_replica_p6 ] o.a.s.s.h.HdfsDirectory The NameNode is in SafeMode - Solr will wait 5 seconds and try again.
   [junit4]   2> 2990287 INFO  (qtp795829240-47521) [n:127.0.0.1:42925_solr c:MoveReplicaHDFSTest_coll_true s:shard1 r:core_node5 x:MoveReplicaHDFSTest_coll_true_shard1_replica_p2 ] o.a.s.c.HdfsDirectoryFactory creating directory factory for path hdfs://localhost.localdomain:34985/solr_hdfs_home/MoveReplicaHDFSTest_coll_true/core_node5/data/snapshot_metadata
   [junit4]   2> 2990289 INFO  (qtp1333494047-47528) [n:127.0.0.1:40201_solr c:MoveReplicaHDFSTest_coll_true s:shard1 r:core_node3 x:MoveReplicaHDFSTest_coll_true_shard1_replica_n1 ] o.a.s.c.HdfsDirectoryFactory Number of slabs of block cache [1] with direct memory allocation set to [true]
   [junit4]   2> 2990289 INFO  (qtp1333494047-47528) [n:127.0.0.1:40201_solr c:MoveReplicaHDFSTest_coll_true s:shard1 r:core_node3 x:MoveReplicaHDFSTest_coll_true_shard1_replica_n1 ] o.a.s.c.HdfsDirectoryFactory Block cache target memory usage, slab size of [4194304] will allocate [1] slabs and use ~[4194304] bytes
   [junit4]   2> 2990289 INFO  (qtp1333494047-47528) [n:127.0.0.1:40201_solr c:MoveReplicaHDFSTest_coll_true s:shard1 r:core_node3 x:MoveReplicaHDFSTest_coll_true_shard1_replica_n1 ] o.a.s.c.HdfsDirectoryFactory Creating new single instance HDFS BlockCache
   [junit4]   2> 2990289 INFO  (qtp644371325-47532) [n:127.0.0.1:42529_solr c:MoveReplicaHDFSTest_coll_true s:shard2 r:core_node7 x:MoveReplicaHDFSTest_coll_true_shard2_replica_n4 ] o.a.s.c.HdfsDirectoryFactory creating directory factory for path hdfs://localhost.localdomain:34985/solr_hdfs_home/MoveReplicaHDFSTest_coll_true/core_node7/data/snapshot_metadata
   [junit4]   2> 2990292 INFO  (qtp795829240-47521) [n:127.0.0.1:42925_solr c:MoveReplicaHDFSTest_coll_true s:shard1 r:core_node5 x:MoveReplicaHDFSTest_coll_true_shard1_replica_p2 ] o.a.s.c.HdfsDirectoryFactory Number of slabs of block cache [1] with direct memory allocation set to [true]
   [junit4]   2> 2990292 INFO  (qtp795829240-47521) [n:127.0.0.1:42925_solr c:MoveReplicaHDFSTest_coll_true s:shard1 r:core_node5 x:MoveReplicaHDFSTest_coll_true_shard1_replica_p2 ] o.a.s.c.HdfsDirectoryFactory Block cache target memory usage, slab size of [4194304] will allocate [1] slabs and use ~[4194304] bytes
   [junit4]   2> 2990292 INFO  (qtp795829240-47521) [n:127.0.0.1:42925_solr c:MoveReplicaHDFSTest_coll_true s:shard1 r:core_node5 x:MoveReplicaHDFSTest_coll_true_shard1_replica_p2 ] o.a.s.c.HdfsDirectoryFactory Creating new single instance HDFS BlockCache
   [junit4]   2> 2990292 WARN  (qtp1333494047-47528) [n:127.0.0.1:40201_solr c:MoveReplicaHDFSTest_coll_true s:shard1 r:core_node3 x:MoveReplicaHDFSTest_coll_true_shard1_replica_n1 ] o.a.s.s.h.HdfsDirectory The NameNode is in SafeMode - Solr will wait 5 seconds and try again.
   [junit4]   2> 2990294 WARN  (qtp795829240-47521) [n:127.0.0.1:42925_solr c:MoveReplicaHDFSTest_coll_true s:shard1 r:core_node5 x:MoveReplicaHDFSTest_coll_true_shard1_replica_p2 ] o.a.s.s.h.HdfsDirectory The NameNode is in SafeMode - Solr will wait 5 seconds and try again.
   [junit4]   2> 2990294 INFO  (qtp644371325-47532) [n:127.0.0.1:42529_solr c:MoveReplicaHDFSTest_coll_true s:shard2 r:core_node7 x:MoveReplicaHDFSTest_coll_true_shard2_replica_n4 ] o.a.s.c.HdfsDirectoryFactory Number of slabs of block cache [1] with direct memory allocation set to [true]
   [junit4]   2> 2990294 INFO  (qtp644371325-47532) [n:127.0.0.1:42529_solr c:MoveReplicaHDFSTest_coll_true s:shard2 r:core_node7 x:MoveReplicaHDFSTest_coll_true_shard2_replica_n4 ] o.a.s.c.HdfsDirectoryFactory Block cache target memory usage, slab size of [4194304] will allocate [1] slabs and use ~[4194304] bytes
   [junit4]   2> 2990294 INFO  (qtp644371325-47532) [n:127.0.0.1:42529_solr c:MoveReplicaHDFSTest_coll_true s:shard2 r:core_node7 x:MoveReplicaHDFSTest_coll_true_shard2_replica_n4 ] o.a.s.c.HdfsDirectoryFactory Creating new single instance HDFS BlockCache
   [junit4]   2> 2990296 WARN  (qtp644371325-47532) [n:127.0.0.1:42529_solr c:MoveReplicaHDFSTest_coll_true s:shard2 r:core_node7 x:MoveReplicaHDFSTest_coll_true_shard2_replica_n4 ] o.a.s.s.h.HdfsDirectory The NameNode is in SafeMode - Solr will wait 5 seconds and try again.
   [junit4]   2> 2995287 WARN  (qtp1802167162-47518) [n:127.0.0.1:40885_solr c:MoveReplicaHDFSTest_coll_true s:shard2 r:core_node8 x:MoveReplicaHDFSTest_coll_true_shard2_replica_p6 ] o.a.s.s.h.HdfsDirectory The NameNode is in SafeMode - Solr will wait 5 seconds and try again.
   [junit4]   2> 2995293 WARN  (qtp1333494047-47528) [n:127.0.0.1:40201_solr c:MoveReplicaHDFSTest_coll_true s:shard1 r:core_node3 x:MoveReplicaHDFSTest_coll_true_shard1_replica_n1 ] o.a.s.s.h.HdfsDirectory The NameNode is in SafeMode - Solr will wait 5 seconds and try again.
   [junit4]   2> 2995294 WARN  (qtp795829240-47521) [n:127.0.0.1:42925_solr c:MoveReplicaHDFSTest_coll_true s:shard1 r:core_node5 x:MoveReplicaHDFSTest_coll_true_shard1_replica_p2 ] o.a.s.s.h.HdfsDirectory The NameNode is in SafeMode - Solr will wait 5 seconds and try again.
   [junit4]   2> 2995296 WARN  (qtp644371325-47532) [n:127.0.0.1:42529_solr c:MoveReplicaHDFSTest_coll_true s:shard2 r:core_node7 x:MoveReplicaHDFSTest_coll_true_shard2_replica_n4 ] o.a.s.s.h.HdfsDirectory The NameNode is in SafeMode - Solr will wait 5 seconds and try again.
   [junit4]   2> 3000296 INFO  (qtp1333494047-47528) [n:127.0.0.1:40201_solr c:MoveReplicaHDFSTest_coll_true s:shard1 r:core_node3 x:MoveReplicaHDFSTest_coll_true_shard1_replica_n1 ] o.a.s.s.b.BlockDirectory Block cache on write is disabled
   [junit4]   2> 3000296 INFO  (qtp1802167162-47518) [n:127.0.0.1:40885_solr c:MoveReplicaHDFSTest_coll_true s:shard2 r:core_node8 x:MoveReplicaHDFSTest_coll_true_shard2_replica_p6 ] o.a.s.s.b.BlockDirectory Block cache on write is disabled
   [junit4]   2> 3000297 INFO  (qtp795829240-47521) [n:127.0.0.1:42925_solr c:MoveReplicaHDFSTest_coll_true s:shard1 r:core_node5 x:MoveReplicaHDFSTest_coll_true_shard1_replica_p2 ] o.a.s.s.b.BlockDirectory Block cache on write is disabled
   [junit4]   2> 3000297 INFO  (qtp1802167162-47518) [n:127.0.0.1:40885_solr c:MoveReplicaHDFSTest_coll_true s:shard2 r:core_node8 x:MoveReplicaHDFSTest_coll_true_shard2_replica_p6 ] o.a.s.c.HdfsDirectoryFactory creating directory factory for path hdfs://localhost.localdomain:34985/solr_hdfs_home/MoveReplicaHDFSTest_coll_true/core_node8/data
   [junit4]   2> 3000301 INFO  (qtp1333494047-47528) [n:127.0.0.1:40201_solr c:MoveReplicaHDFSTest_coll_true s:shard1 r:core_node3 x:MoveReplicaHDFSTest_coll_true_shard1_replica_n1 ] o.a.s.c.HdfsDirectoryFactory creating directory factory for path hdfs://localhost.localdomain:34985/solr_hdfs_home/MoveReplicaHDFSTest_coll_true/core_node3/data
   [junit4]   2> 3000301 INFO  (qtp795829240-47521) [n:127.0.0.1:42925_solr c:MoveReplicaHDFSTest_coll_true s:shard1 r:core_node5 x:MoveReplicaHDFSTest_coll_true_shard1_replica_p2 ] o.a.s.c.HdfsDirectoryFactory creating directory factory for path hdfs://localhost.localdomain:34985/solr_hdfs_home/MoveReplicaHDFSTest_coll_true/core_node5/data
   [junit4]   2> 3000304 INFO  (qtp644371325-47532) [n:127.0.0.1:42529_solr c:MoveReplicaHDFSTest_coll_true s:shard2 r:core_node7 x:MoveReplicaHDFSTest_coll_true_shard2_replica_n4 ] o.a.s.s.b.BlockDirectory Block cache on write is disabled
   [junit4]   2> 3000307 INFO  (qtp644371325-47532) [n:127.0.0.1:42529_solr c:MoveReplicaHDFSTest_coll_true s:shard2 r:core_node7 x:MoveReplicaHDFSTest_coll_true_shard2_replica_n4 ] o.a.s.c.HdfsDirectoryFactory creating directory factory for path hdfs://localhost.localdomain:34985/solr_hdfs_home/MoveReplicaHDFSTest_coll_true/core_node7/data
   [junit4]   2> 3000324 INFO  (qtp795829240-47521) [n:127.0.0.1:42925_solr c:MoveReplicaHDFSTest_coll_true s:shard1 r:core_node5 x:MoveReplicaHDFSTest_coll_true_shard1_replica_p2 ] o.a.s.c.HdfsDirectoryFactory creating directory factory for path hdfs://localhost.localdomain:34985/solr_hdfs_home/MoveReplicaHDFSTest_coll_true/core_node5/data/index
   [junit4]   2> 3000325 INFO  (qtp644371325-47532) [n:127.0.0.1:42529_solr c:MoveReplicaHDFSTest_coll_true s:shard2 r:core_node7 x:MoveReplicaHDFSTest_coll_true_shard2_replica_n4 ] o.a.s.c.HdfsDirectoryFactory creating directory factory for path hdfs://localhost.localdomain:34985/solr_hdfs_home/MoveReplicaHDFSTest_coll_true/core_node7/data/index
   [junit4]   2> 3000326 INFO  (qtp1802167162-47518) [n:127.0.0.1:40885_solr c:MoveReplicaHDFSTest_coll_true s:shard2 r:core_node8 x:MoveReplicaHDFSTest_coll_true_shard2_replica_p6 ] o.a.s.c.HdfsDirectoryFactory creating directory factory for path hdfs://localhost.localdomain:34985/solr_hdfs_home/MoveReplicaHDFSTest_coll_true/core_node8/data/index
   [junit4]   2> 3000330 INFO  (qtp644371325-47532) [n:127.0.0.1:42529_solr c:MoveReplicaHDFSTest_coll_true s:shard2 r:core_node7 x:MoveReplicaHDFSTest_coll_true_shard2_replica_n4 ] o.a.s.c.HdfsDirectoryFactory Number of slabs of block cache [1] with direct memory allocation set to [true]
   [junit4]   2> 3000330 INFO  (qtp644371325-47532) [n:127.0.0.1:42529_solr c:MoveReplicaHDFSTest_coll_true s:shard2 r:core_node7 x:MoveReplicaHDFSTest_coll_true_shard2_replica_n4 ] o.a.s.c.HdfsDirectoryFactory Block cache target memory usage, slab size of [4194304] will allocate [1] slabs and use ~[4194304] bytes
   [junit4]   2> 3000330 INFO  (qtp644371325-47532) [n:127.0.0.1:42529_solr c:MoveReplicaHDFSTest_coll_true s:shard2 r:core_node7 x:MoveReplicaHDFSTest_coll_true_shard2_replica_n4 ] o.a.s.c.HdfsDirectoryFactory Creating new single instance HDFS BlockCache
   [junit4]   2> 3000332 INFO  (qtp795829240-47521) [n:127.0.0.1:42925_solr c:MoveReplicaHDFSTest_coll_true s:shard1 r:core_node5 x:MoveReplicaHDFSTest_coll_true_shard1_replica_p2 ] o.a.s.c.HdfsDirectoryFactory Number of slabs of block cache [1] with direct memory allocation set to [true]
   [junit4]   2> 3000332 INFO  (qtp795829240-47521) [n:127.0.0.1:42925_solr c:MoveReplicaHDFSTest_coll_true s:shard1 r:core_node5 x:MoveReplicaHDFSTest_coll_true_shard1_replica_p2 ] o.a.s.c.HdfsDirectoryFactory Block cache target memory usage, slab size of [4194304] will allocate [1] slabs and use ~[4194304] bytes
   [junit4]   2> 3000332 INFO  (qtp795829240-47521) [n:127.0.0.1:42925_solr c:MoveReplicaHDFSTest_coll_true s:shard1 r:core_node5 x:MoveReplicaHDFSTest_coll_true_shard1_replica_p2 ] o.a.s.c.HdfsDirectoryFactory Creating new single instance HDFS BlockCache
   [junit4]   2> 3000333 INFO  (qtp1333494047-47528) [n:127.0.0.1:40201_solr c:MoveReplicaHDFSTest_coll_true s:shard1 r:core_node3 x:MoveReplicaHDFSTest_coll_true_shard1_replica_n1 ] o.a.s.c.HdfsDirectoryFactory creating directory factory for path hdfs://localhost.localdomain:34985/solr_hdfs_home/MoveReplicaHDFSTest_coll_true/core_node3/data/index
   [junit4]   2> 3000336 INFO  (qtp1802167162-47518) [n:127.0.0.1:40885_solr c:MoveReplicaHDFSTest_coll_true s:shard2 r:core_node8 x:MoveReplicaHDFSTest_coll_true_shard2_replica_p6 ] o.a.s.c.HdfsDirectoryFactory Number of slabs of block cache [1] with direct memory allocation set to [true]
   [junit4]   2> 3000336 INFO  (qtp1802167162-47518) [n:127.0.0.1:40885_solr c:MoveReplicaHDFSTest_coll_true s:shard2 r:core_node8 x:MoveReplicaHDFSTest_coll_true_shard2_replica_p6 ] o.a.s.c.HdfsDirectoryFactory Block cache target memory usage, slab size of [4194304] will allocate [1] slabs and use ~[4194304] bytes
   [junit4]   2> 3000336 INFO  (qtp1802167162-47518) [n:127.0.0.1:40885_solr c:MoveReplicaHDFSTest_coll_true s:shard2 r:core_node8 x:MoveReplicaHDFSTest_coll_true_shard2_replica_p6 ] o.a.s.c.HdfsDirectoryFactory Creating new single instance HDFS BlockCache
   [junit4]   2> 3000339 INFO  (qtp1802167162-47518) [n:127.0.0.1:40885_solr c:MoveReplicaHDFSTest_coll_true s:shard2 r:core_node8 x:MoveReplicaHDFSTest_coll_true_shard2_replica_p6 ] o.a.s.s.b.BlockDirectory Block cache on write is disabled
   [junit4]   2> 3000339 INFO  (qtp1333494047-47528) [n:127.0.0.1:40201_solr c:MoveReplicaHDFSTest_coll_true s:shard1 r:core_node3 x:MoveReplicaHDFSTest_coll_true_shard1_replica_n1 ] o.a.s.c.HdfsDirectoryFactory Number of slabs of block cache [1] with direct memory allocation set to [true]
   [junit4]   2> 3000339 INFO  (qtp1333494047-47528) [n:127.0.0.1:40201_solr c:MoveReplicaHDFSTest_coll_true s:shard1 r:core_node3 x:MoveReplicaHDFSTest_coll_true_shard1_replica_n1 ] o.a.s.c.HdfsDirectoryFactory Block cache target memory usage, slab size of [4194304] will allocate [1] slabs and use ~[4194304] bytes
   [junit4]   2> 3000339 INFO  (qtp1333494047-47528) [n:127.0.0.1:40201_solr c:MoveReplicaHDFSTest_coll_true s:shard1 r:core_node3 x:MoveReplicaHDFSTest_coll_true_shard1_replica_n1 ] o.a.s.c.HdfsDirectoryFactory Creating new single instance HDFS BlockCache
   [junit4]   2> 3000340 INFO  (qtp795829240-47521) [n:127.0.0.1:42925_solr c:MoveReplicaHDFSTest_coll_true s:shard1 r:core_node5 x:MoveReplicaHDFSTest_coll_true_shard1_replica_p2 ] o.a.s.s.b.BlockDirectory Block cache on write is disabled
   [junit4]   2> 3000341 INFO  (qtp644371325-47532) [n:127.0.0.1:42529_solr c:MoveReplicaHDFSTest_coll_true s:shard2 r:core_node7 x:MoveReplicaHDFSTest_coll_true_shard2_replica_n4 ] o.a.s.s.b.BlockDirectory Block cache on write is disabled
   [junit4]   2> 3000348 INFO  (qtp1333494047-47528) [n:127.0.0.1:40201_solr c:MoveReplicaHDFSTest_coll_true s:shard1 r:core_node3 x:MoveReplicaHDFSTest_coll_true_shard1_replica_n1 ] o.a.s.s.b.BlockDirectory Block cache on write is disabled
   [junit4]   2> 3000449 INFO  (qtp795829240-47521) [n:127.0.0.1:42925_solr c:MoveReplicaHDFSTest_coll_true s:shard1 r:core_node5 x:MoveReplicaHDFSTest_coll_true_shard1_replica_p2 ] o.a.s.u.CommitTracker Hard AutoCommit: disabled
   [junit4]   2> 3000449 INFO  (qtp795829240-47521) [n:127.0.0.1:42925_solr c:MoveReplicaHDFSTest_coll_true s:shard1 r:core_node5 x:MoveReplicaHDFSTest_coll_true_shard1_replica_p2 ] o.a.s.u.CommitTracker Soft AutoCommit: disabled
   [junit4]   2> 3000462 INFO  (qtp1333494047-47528) [n:127.0.0.1:40201_solr c:MoveReplicaHDFSTest_coll_true s:shard1 r:core_node3 x:MoveReplicaHDFSTest_coll_true_shard1_replica_n1 ] o.a.s.u.UpdateHandler Using UpdateLog implementation: org.apache.solr.update.HdfsUpdateLog
   [junit4]   2> 3000463 INFO  (qtp1333494047-47528) [n:127.0.0.1:40201_solr c:MoveReplicaHDFSTest_coll_true s:shard1 r:core_node3 x:MoveReplicaHDFSTest_coll_true_shard1_replica_n1 ] o.a.s.u.UpdateLog Initializing UpdateLog: dataDir=null defaultSyncLevel=FLUSH numRecordsToKeep=100 maxNumLogsToKeep=10 numVersionBuckets=65536
   [junit4]   2> 3000463 INFO  (qtp1333494047-47528) [n:127.0.0.1:40201_solr c:MoveReplicaHDFSTest_coll_true s:shard1 r:core_node3 x:MoveReplicaHDFSTest_coll_true_shard1_replica_n1 ] o.a.s.u.HdfsUpdateLog Initializing HdfsUpdateLog: tlogDfsReplication=3
   [junit4]   2> 3000464 INFO  (qtp795829240-47521) [n:127.0.0.1:42925_solr c:MoveReplicaHDFSTest_coll_true s:shard1 r:core_node5 x:MoveReplicaHDFSTest_coll_true_shard1_replica_p2 ] o.a.s.s.SolrIndexSearcher Opening [Searcher@7486f26c[MoveReplicaHDFSTest_coll_true_shard1_replica_p2] main]
   [junit4]   2> 3000465 INFO  (qtp795829240-47521) [n:127.0.0.1:42925_solr c:MoveReplicaHDFSTest_coll_true s:shard1 r:core_node5 x:MoveReplicaHDFSTest_coll_true_shard1_replica_p2 ] o.a.s.r.ManagedResourceStorage Configured ZooKeeperStorageIO with znodeBase: /configs/conf1
   [junit4]   2> 3000465 INFO  (qtp795829240-47521) [n:127.0.0.1:42925_solr c:MoveReplicaHDFSTest_coll_true s:shard1 r:core_node5 x:MoveReplicaHDFSTest_coll_true_shard1_replica_p2 ] o.a.s.r.ManagedResourceStorage Loaded null at path _rest_managed.json using ZooKeeperStorageIO:path=/configs/conf1
   [junit4]   2> 3000465 INFO  (qtp795829240-47521) [n:127.0.0.1:42925_solr c:MoveReplicaHDFSTest_coll_true s:shard1 r:core_node5 x:MoveReplicaHDFSTest_coll_true_shard1_replica_p2 ] o.a.s.h.ReplicationHandler Commits will be reserved for 10000ms.
   [junit4]   2> 3000466 INFO  (searcherExecutor-11487-thread-1-processing-n:127.0.0.1:42925_solr x:MoveReplicaHDFSTest_coll_true_shard1_replica_p2 c:MoveReplicaHDFSTest_coll_true s:shard1 r:core_node5) [n:127.0.0.1:42925_solr c:MoveReplicaHDFSTest_coll_true s:shard1 r:core_node5 x:MoveReplicaHDFSTest_coll_true_shard1_replica_p2 ] o.a.s.c.SolrCore [MoveReplicaHDFSTest_coll_true_shard1_replica_p2] Registered new searcher Searcher@7486f26c[MoveReplicaHDFSTest_coll_true_shard1_replica_p2] main{ExitableDirectoryReader(UninvertingDirectoryReader())}
   [junit4]   2> 3000468 INFO  (qtp795829240-47521) [n:127.0.0.1:42925_solr c:MoveReplicaHDFSTest_coll_true s:shard1 r:core_node5 x:MoveReplicaHDFSTest_coll_true_shard1_replica_p2 ] o.a.s.c.ZkController MoveReplicaHDFSTest_coll_true_shard1_replica_p2 starting background replication from leader
   [junit4]   2> 3000468 INFO  (qtp795829240-47521) [n:127.0.0.1:42925_solr c:MoveReplicaHDFSTest_coll_true s:shard1 r:core_node5 x:MoveReplicaHDFSTest_coll_true_shard1_replica_p2 ] o.a.s.c.ReplicateFromLeader Will start replication from leader with poll interval: 00:00:01
   [junit4]   2> 3000469 INFO  (qtp795829240-47521) [n:127.0.0.1:42925_solr c:MoveReplicaHDFSTest_coll_true s:shard1 r:core_node5 x:MoveReplicaHDFSTest_coll_true_shard1_replica_p2 ] o.a.s.h.ReplicationHandler Poll scheduled at an interval of 1000ms
   [junit4]   2> 3000469 INFO  (qtp795829240-47521) [n:127.0.0.1:429

[...truncated too long message...]

FAF8B59E171]) [     ] o.a.s.c.ZkTestServer waitForServerDown: 127.0.0.1:40397
   [junit4]   2> 3077493 INFO  (TEST-MoveReplicaHDFSTest.testNormalMove-seed#[CDA8CFAF8B59E171]) [     ] o.a.s.c.ZkTestServer parse host and port list: 127.0.0.1:40397
   [junit4]   2> 3077493 INFO  (TEST-MoveReplicaHDFSTest.testNormalMove-seed#[CDA8CFAF8B59E171]) [     ] o.a.s.c.ZkTestServer connecting to 127.0.0.1 40397
   [junit4]   2> 3077493 INFO  (TEST-MoveReplicaHDFSTest.testNormalMove-seed#[CDA8CFAF8B59E171]) [     ] o.a.s.SolrTestCaseJ4 ###Ending testNormalMove
   [junit4]   2> 3077494 INFO  (TEST-MoveReplicaHDFSTest.testNormalMove-seed#[CDA8CFAF8B59E171]) [     ] o.a.s.SolrTestCaseJ4 ###Ending testNormalMove
   [junit4]   2> 3077495 WARN  (SUITE-MoveReplicaHDFSTest-seed#[CDA8CFAF8B59E171]-worker) [     ] o.a.h.h.s.d.DirectoryScanner DirectoryScanner: shutdown has been called
   [junit4]   2> 3077501 INFO  (SUITE-MoveReplicaHDFSTest-seed#[CDA8CFAF8B59E171]-worker) [     ] o.e.j.s.h.ContextHandler Stopped o.e.j.w.WebAppContext@470d2f4b{datanode,/,null,UNAVAILABLE}{/datanode}
   [junit4]   2> 3077501 INFO  (SUITE-MoveReplicaHDFSTest-seed#[CDA8CFAF8B59E171]-worker) [     ] o.e.j.s.AbstractConnector Stopped ServerConnector@5073214f{HTTP/1.1,[http/1.1]}{localhost:0}
   [junit4]   2> 3077501 INFO  (SUITE-MoveReplicaHDFSTest-seed#[CDA8CFAF8B59E171]-worker) [     ] o.e.j.s.session node0 Stopped scavenging
   [junit4]   2> 3077501 INFO  (SUITE-MoveReplicaHDFSTest-seed#[CDA8CFAF8B59E171]-worker) [     ] o.e.j.s.h.ContextHandler Stopped o.e.j.s.ServletContextHandler@159302e4{static,/static,jar:file:/home/jenkins/.ivy2/cache/org.apache.hadoop/hadoop-hdfs/tests/hadoop-hdfs-3.2.0-tests.jar!/webapps/static,UNAVAILABLE}
   [junit4]   2> 3077502 WARN  (BP-269622897-10.41.0.5-1571451051256 heartbeating to localhost.localdomain/127.0.0.1:34985) [     ] o.a.h.h.s.d.IncrementalBlockReportManager IncrementalBlockReportManager interrupted
   [junit4]   2> 3077502 WARN  (BP-269622897-10.41.0.5-1571451051256 heartbeating to localhost.localdomain/127.0.0.1:34985) [     ] o.a.h.h.s.d.DataNode Ending block pool service for: Block pool BP-269622897-10.41.0.5-1571451051256 (Datanode Uuid 8e03b05c-bfc0-4d01-b5fa-4a11a779dd7c) service to localhost.localdomain/127.0.0.1:34985
   [junit4]   2> 3077510 WARN  (refreshUsed-/home/jenkins/jenkins-slave/workspace/Lucene-Solr-BadApples-NightlyTests-master/checkout/solr/build/solr-core/test/J2/temp/solr.cloud.MoveReplicaHDFSTest_CDA8CFAF8B59E171-001/tempDir-001/hdfsBaseDir/data/data1/current/BP-269622897-10.41.0.5-1571451051256) [     ] o.a.h.f.CachingGetSpaceUsed Thread Interrupted waiting to refresh disk information: sleep interrupted
   [junit4]   2> 3077515 WARN  (refreshUsed-/home/jenkins/jenkins-slave/workspace/Lucene-Solr-BadApples-NightlyTests-master/checkout/solr/build/solr-core/test/J2/temp/solr.cloud.MoveReplicaHDFSTest_CDA8CFAF8B59E171-001/tempDir-001/hdfsBaseDir/data/data2/current/BP-269622897-10.41.0.5-1571451051256) [     ] o.a.h.f.CachingGetSpaceUsed Thread Interrupted waiting to refresh disk information: sleep interrupted
   [junit4]   2> 3077527 INFO  (SUITE-MoveReplicaHDFSTest-seed#[CDA8CFAF8B59E171]-worker) [     ] o.e.j.s.h.ContextHandler Stopped o.e.j.w.WebAppContext@7c36eec{hdfs,/,null,UNAVAILABLE}{/hdfs}
   [junit4]   2> 3077528 INFO  (SUITE-MoveReplicaHDFSTest-seed#[CDA8CFAF8B59E171]-worker) [     ] o.e.j.s.AbstractConnector Stopped ServerConnector@8c97d45{HTTP/1.1,[http/1.1]}{localhost.localdomain:0}
   [junit4]   2> 3077528 INFO  (SUITE-MoveReplicaHDFSTest-seed#[CDA8CFAF8B59E171]-worker) [     ] o.e.j.s.session node0 Stopped scavenging
   [junit4]   2> 3077528 INFO  (SUITE-MoveReplicaHDFSTest-seed#[CDA8CFAF8B59E171]-worker) [     ] o.e.j.s.h.ContextHandler Stopped o.e.j.s.ServletContextHandler@5b281e8d{static,/static,jar:file:/home/jenkins/.ivy2/cache/org.apache.hadoop/hadoop-hdfs/tests/hadoop-hdfs-3.2.0-tests.jar!/webapps/static,UNAVAILABLE}
   [junit4]   2> NOTE: leaving temporary files on disk at: /home/jenkins/jenkins-slave/workspace/Lucene-Solr-BadApples-NightlyTests-master/checkout/solr/build/solr-core/test/J2/temp/solr.cloud.MoveReplicaHDFSTest_CDA8CFAF8B59E171-001
   [junit4]   2> Oct 19, 2019 2:12:21 AM com.carrotsearch.randomizedtesting.ThreadLeakControl checkThreadLeaks
   [junit4]   2> WARNING: Will linger awaiting termination of 16 leaked thread(s).
   [junit4]   2> NOTE: test params are: codec=Asserting(Lucene80): {_root_=FST50, id=PostingsFormat(name=Direct)}, docValues:{_version_=DocValuesFormat(name=Lucene80)}, maxPointsInLeafNode=1774, maxMBSortInHeap=5.996059836944908, sim=Asserting(org.apache.lucene.search.similarities.AssertingSimilarity@2195f6db), locale=fr-RE, timezone=America/Miquelon
   [junit4]   2> NOTE: Linux 4.15.0-54-generic amd64/Oracle Corporation 11.0.4 (64-bit)/cpus=4,threads=6,free=112117136,total=536870912
   [junit4]   2> NOTE: All tests run in this JVM: [MigrateRouteKeyTest, ManagedSchemaRoundRobinCloudTest, TestCollectionAPIs, TestPartialUpdateDeduplication, TestFieldCacheSort, TestPayloadScoreQParserPlugin, RemoteQueryErrorTest, TestSolrCloudWithHadoopAuthPlugin, AuditLoggerIntegrationTest, MultiThreadedOCPTest, TestMacroExpander, TestNoOpRegenerator, TestMinHashQParser, TestDynamicURP, HLLUtilTest, SmileWriterTest, TestInPlaceUpdatesDistrib, ImplicitSnitchTest, TaggerTest, ResponseHeaderTest, CustomTermsComponentTest, SliceStateTest, ChangedSchemaMergeTest, ZkControllerTest, TestDirectoryFactory, TestComponentsName, AlternateDirectoryTest, TestUseDocValuesAsStored, DistanceUnitsTest, TriggerIntegrationTest, CoreAdminHandlerTest, RoutingToNodesWithPropertiesTest, CreateRoutedAliasTest, TestSchemaNameResource, CustomCollectionTest, AsyncCallRequestStatusResponseTest, TestSubQueryTransformerDistrib, TestExplainDocTransformer, LeaderElectionIntegrationTest, SpellCheckCollatorTest, TestSimExecutePlanAction, SolrShardReporterTest, ReturnFieldsTest, TestStreamBody, TestFuzzyAnalyzedSuggestions, JsonLoaderTest, TestShortCircuitedRequests, TestCloudSchemaless, PeerSyncTest, DistributedExpandComponentTest, SolrXmlInZkTest, ZkShardTermsTest, IndexSizeTriggerTest, TestSolrDeletionPolicy2, DistributedFacetPivotLongTailTest, TestFieldResource, OverseerTaskQueueTest, TestPolicyCloud, TestSafeXMLParsing, CircularListTest, TestReplicationHandlerDiskOverFlow, ShufflingReplicaListTransformerTest, TestSimLargeCluster, TermVectorComponentTest, TestFaceting, HdfsBasicDistributedZk2Test, OverseerModifyCollectionTest, TestHdfsBackupRestoreCore, UpdateRequestProcessorFactoryTest, ByteBuffersDirectoryFactoryTest, TestPullReplica, SimpleFacetsTest, TestSimComputePlanAction, SpellingQueryConverterTest, RangeFacetCloudTest, TestIndexSearcher, TestUtilizeNode, TestBlendedInfixSuggestions, PreAnalyzedFieldTest, TestRandomFlRTGCloud, TestExactSharedStatsCache, CoreMergeIndexesAdminHandlerTest, TestStressCloudBlindAtomicUpdates, TestRawResponseWriter, UnloadDistributedZkTest, CollectionsAPIAsyncDistributedZkTest, SuggesterFSTTest, SolrMetricsIntegrationTest, TestInitParams, CdcrVersionReplicationTest, HttpPartitionTest, TestTlogReplica, TestEmbeddedSolrServerConstructors, TestSolrCloudWithDelegationTokens, InfoHandlerTest, TestDocumentBuilder, OutOfBoxZkACLAndCredentialsProvidersTest, TemplateUpdateProcessorTest, AdminHandlersProxyTest, DistributedFacetPivotWhiteBoxTest, SolrPluginUtilsTest, HdfsWriteToMultipleCollectionsTest, CoreSorterTest, ResponseLogComponentTest, TestTrackingShardHandlerFactory, TestSha256AuthenticationProvider, TestSurroundQueryParser, TestAuthorizationFramework, TestSchemaManager, EmbeddedSolrNoSerializeTest, ScheduledMaintenanceTriggerTest, TestStressReorder, TestSolrCoreSnapshots, TestNumericTerms64, TestXIncludeConfig, TestSchemaVersionResource, ZookeeperStatusHandlerTest, TestLuceneMatchVersion, FastVectorHighlighterTest, TestJoin, DistributedQueryComponentOptimizationTest, TestSlowCompositeReaderWrapper, TestStandardQParsers, TestLRUCache, TestHashPartitioner, TestFunctionQuery, HdfsRecoveryZkTest, BigEndianAscendingWordDeserializerTest, TestLMJelinekMercerSimilarityFactory, TestQuerySenderNoQuery, SolrCoreMetricManagerTest, QueryEqualityTest, TestDocTermOrdsUninvertLimit, TestMiniSolrCloudClusterSSL, OrderedExecutorTest, RequestLoggingTest, NodeAddedTriggerIntegrationTest, CollectionStateFormat2Test, TestSimpleQParserPlugin, TestFoldingMultitermQuery, TestCloudPhrasesIdentificationComponent, TransactionLogTest, HdfsDirectoryFactoryTest, ConvertedLegacyTest, CursorPagingTest, DisMaxRequestHandlerTest, DistributedIntervalFacetingTest, EchoParamsTest, MinimalSchemaTest, OutputWriterTest, SampleTest, SolrInfoBeanTest, SolrTestCaseJ4Test, TestDistributedGrouping, TestSimpleTrackingShardHandler, TestTolerantSearch, TestTrie, PathHierarchyTokenizerFactoryTest, ProtectedTermFilterFactoryTest, TestCharFilters, TestDeprecatedFilters, TestReversedWildcardFilterFactory, TestWordDelimiterFilterFactory, TokenizerChainTest, TestLuceneIndexBackCompat, TestEmbeddedSolrServerAdminHandler, TestEmbeddedSolrServerSchemaAPI, TestJettySolrRunner, ConnectionReuseTest, AliasIntegrationTest, BasicDistributedZkTest, BasicZkTest, ChaosMonkeyNothingIsSafeTest, ChaosMonkeyNothingIsSafeWithPullReplicasTest, ChaosMonkeySafeLeaderTest, ChaosMonkeySafeLeaderWithPullReplicasTest, CleanupOldIndexTest, CloudExitableDirectoryReaderTest, ClusterStateTest, ConfigSetsAPITest, ConnectionManagerTest, CreateCollectionCleanupTest, DeleteNodeTest, DeleteReplicaTest, DeleteShardTest, DeleteStatusTest, DistribCursorPagingTest, DistribDocExpirationUpdateProcessorTest, DistribJoinFromCollectionTest, DocValuesNotIndexedTest, ForceLeaderTest, ForceLeaderWithTlogReplicasTest, FullSolrCloudDistribCmdsTest, HealthCheckHandlerTest, LeaderFailureAfterFreshStartTest, LegacyCloudClusterPropTest, MetricsHistoryIntegrationTest, MetricsHistoryWithAuthIntegrationTest, MoveReplicaHDFSTest]
   [junit4] Completed [487/887 (1!)] on J2 in 93.63s, 4 tests, 1 error, 1 skipped <<< FAILURES!

[...truncated 54098 lines...]

[JENKINS] Lucene-Solr-BadApples-NightlyTests-master - Build # 85 - Failure

Posted by Apache Jenkins Server <je...@builds.apache.org>.
Build: https://builds.apache.org/job/Lucene-Solr-BadApples-NightlyTests-master/85/

All tests passed

Build Log:
[...truncated 65715 lines...]
-ecj-javadoc-lint-tests:
    [mkdir] Created dir: /tmp/ecj25675355
 [ecj-lint] Compiling 48 source files to /tmp/ecj25675355
 [ecj-lint] invalid Class-Path header in manifest of jar file: /home/jenkins/.ivy2/cache/org.restlet.jee/org.restlet/jars/org.restlet-2.3.0.jar
 [ecj-lint] invalid Class-Path header in manifest of jar file: /home/jenkins/.ivy2/cache/org.restlet.jee/org.restlet.ext.servlet/jars/org.restlet.ext.servlet-2.3.0.jar
 [ecj-lint] ----------
 [ecj-lint] 1. ERROR in /home/jenkins/jenkins-slave/workspace/Lucene-Solr-BadApples-NightlyTests-master/checkout/solr/contrib/dataimporthandler/src/test/org/apache/solr/handler/dataimport/MockInitialContextFactory.java (at line 23)
 [ecj-lint] 	import javax.naming.NamingException;
 [ecj-lint] 	       ^^^^^^^^^^^^^^^^^^^^^^^^^^^^
 [ecj-lint] The type javax.naming.NamingException is not accessible
 [ecj-lint] ----------
 [ecj-lint] 2. ERROR in /home/jenkins/jenkins-slave/workspace/Lucene-Solr-BadApples-NightlyTests-master/checkout/solr/contrib/dataimporthandler/src/test/org/apache/solr/handler/dataimport/MockInitialContextFactory.java (at line 28)
 [ecj-lint] 	public class MockInitialContextFactory implements InitialContextFactory {
 [ecj-lint] 	             ^^^^^^^^^^^^^^^^^^^^^^^^^
 [ecj-lint] The type MockInitialContextFactory must implement the inherited abstract method InitialContextFactory.getInitialContext(Hashtable<?,?>)
 [ecj-lint] ----------
 [ecj-lint] 3. ERROR in /home/jenkins/jenkins-slave/workspace/Lucene-Solr-BadApples-NightlyTests-master/checkout/solr/contrib/dataimporthandler/src/test/org/apache/solr/handler/dataimport/MockInitialContextFactory.java (at line 30)
 [ecj-lint] 	private final javax.naming.Context context;
 [ecj-lint] 	              ^^^^^^^^^^^^^^^^^^^^
 [ecj-lint] The type javax.naming.Context is not accessible
 [ecj-lint] ----------
 [ecj-lint] 4. ERROR in /home/jenkins/jenkins-slave/workspace/Lucene-Solr-BadApples-NightlyTests-master/checkout/solr/contrib/dataimporthandler/src/test/org/apache/solr/handler/dataimport/MockInitialContextFactory.java (at line 33)
 [ecj-lint] 	context = mock(javax.naming.Context.class);
 [ecj-lint] 	^^^^^^^
 [ecj-lint] context cannot be resolved to a variable
 [ecj-lint] ----------
 [ecj-lint] 5. ERROR in /home/jenkins/jenkins-slave/workspace/Lucene-Solr-BadApples-NightlyTests-master/checkout/solr/contrib/dataimporthandler/src/test/org/apache/solr/handler/dataimport/MockInitialContextFactory.java (at line 33)
 [ecj-lint] 	context = mock(javax.naming.Context.class);
 [ecj-lint] 	               ^^^^^^^^^^^^^^^^^^^^
 [ecj-lint] The type javax.naming.Context is not accessible
 [ecj-lint] ----------
 [ecj-lint] 6. ERROR in /home/jenkins/jenkins-slave/workspace/Lucene-Solr-BadApples-NightlyTests-master/checkout/solr/contrib/dataimporthandler/src/test/org/apache/solr/handler/dataimport/MockInitialContextFactory.java (at line 36)
 [ecj-lint] 	when(context.lookup(anyString())).thenAnswer(invocation -> objects.get(invocation.getArgument(0)));
 [ecj-lint] 	     ^^^^^^^
 [ecj-lint] context cannot be resolved
 [ecj-lint] ----------
 [ecj-lint] 7. ERROR in /home/jenkins/jenkins-slave/workspace/Lucene-Solr-BadApples-NightlyTests-master/checkout/solr/contrib/dataimporthandler/src/test/org/apache/solr/handler/dataimport/MockInitialContextFactory.java (at line 38)
 [ecj-lint] 	} catch (NamingException e) {
 [ecj-lint] 	         ^^^^^^^^^^^^^^^
 [ecj-lint] NamingException cannot be resolved to a type
 [ecj-lint] ----------
 [ecj-lint] 8. ERROR in /home/jenkins/jenkins-slave/workspace/Lucene-Solr-BadApples-NightlyTests-master/checkout/solr/contrib/dataimporthandler/src/test/org/apache/solr/handler/dataimport/MockInitialContextFactory.java (at line 45)
 [ecj-lint] 	public javax.naming.Context getInitialContext(Hashtable env) {
 [ecj-lint] 	       ^^^^^^^^^^^^^^^^^^^^
 [ecj-lint] The type javax.naming.Context is not accessible
 [ecj-lint] ----------
 [ecj-lint] 9. ERROR in /home/jenkins/jenkins-slave/workspace/Lucene-Solr-BadApples-NightlyTests-master/checkout/solr/contrib/dataimporthandler/src/test/org/apache/solr/handler/dataimport/MockInitialContextFactory.java (at line 46)
 [ecj-lint] 	return context;
 [ecj-lint] 	       ^^^^^^^
 [ecj-lint] context cannot be resolved to a variable
 [ecj-lint] ----------
 [ecj-lint] 9 problems (9 errors)

BUILD FAILED
/home/jenkins/jenkins-slave/workspace/Lucene-Solr-BadApples-NightlyTests-master/checkout/build.xml:662: The following error occurred while executing this line:
/home/jenkins/jenkins-slave/workspace/Lucene-Solr-BadApples-NightlyTests-master/checkout/build.xml:101: The following error occurred while executing this line:
/home/jenkins/jenkins-slave/workspace/Lucene-Solr-BadApples-NightlyTests-master/checkout/solr/build.xml:651: The following error occurred while executing this line:
/home/jenkins/jenkins-slave/workspace/Lucene-Solr-BadApples-NightlyTests-master/checkout/solr/common-build.xml:479: The following error occurred while executing this line:
/home/jenkins/jenkins-slave/workspace/Lucene-Solr-BadApples-NightlyTests-master/checkout/lucene/common-build.xml:2033: The following error occurred while executing this line:
/home/jenkins/jenkins-slave/workspace/Lucene-Solr-BadApples-NightlyTests-master/checkout/lucene/common-build.xml:2066: Compile failed; see the compiler error output for details.

Total time: 318 minutes 40 seconds
Build step 'Invoke Ant' marked build as failure
Archiving artifacts
Recording test results
Email was triggered for: Failure - Any
Sending email for trigger: Failure - Any