You are viewing a plain text version of this content. The canonical link for it is here.
Posted to builds@beam.apache.org by Apache Jenkins Server <je...@builds.apache.org> on 2021/09/08 00:42:54 UTC
Build failed in Jenkins: beam_Publish_Beam_SDK_Snapshots #1685
See <https://ci-beam.apache.org/job/beam_Publish_Beam_SDK_Snapshots/1685/display/redirect?page=changes>
Changes:
[Valentyn Tymofieiev] Disable Kafka perf tests.
[Andrew Pilloud] [BEAM-12851] Map output table names
[Luke Cwik] [BEAM-12802] Define a prefetchable iterator and iterable and utility
------------------------------------------
[...truncated 562.92 KB...]
[0m[91m copying apache_beam/portability/api/beam_runner_api_pb2_urns.py -> build/lib.linux-x86_64-3.8/apache_beam/portability/api
[0m[91m copying apache_beam/portability/api/schema_pb2_grpc.py -> build/lib.linux-x86_64-3.8/apache_beam/portability/api
[0m[91m copying apache_beam/portability/api/standard_window_fns_pb2_urns.py -> build/lib.linux-x86_64-3.8/apache_beam/portability/api
[0m[91m copying apache_beam/portability/api/beam_artifact_api_pb2.py -> build/lib.linux-x86_64-3.8/apache_beam/portability/api
[0m[91m copying apache_beam/portability/api/beam_expansion_api_pb2.py -> build/lib.linux-x86_64-3.8/apache_beam/portability/api
[0m[91m copying apache_beam/portability/api/beam_expansion_api_pb2_grpc.py -> build/lib.linux-x86_64-3.8/apache_beam/portability/api
[0m[91m copying apache_beam/portability/api/metrics_pb2_grpc.py -> build/lib.linux-x86_64-3.8/apache_beam/portability/api
[0m[91m copying apache_beam/portability/api/beam_provision_api_pb2.py -> build/lib.linux-x86_64-3.8/apache_beam/portability/api
[0m[91m copying apache_beam/portability/api/beam_provision_api_pb2_grpc.py -> build/lib.linux-x86_64-3.8/apache_beam/portability/api
[0m[91m copying apache_beam/portability/api/beam_job_api_pb2_grpc.py -> build/lib.linux-x86_64-3.8/apache_beam/portability/api
[0m[91m copying apache_beam/portability/api/beam_interactive_api_pb2.py -> build/lib.linux-x86_64-3.8/apache_beam/portability/api
[0m[91m copying apache_beam/portability/api/beam_runner_api_pb2_grpc.py -> build/lib.linux-x86_64-3.8/apache_beam/portability/api
[0m[91m copying apache_beam/portability/api/endpoints_pb2_grpc.py -> build/lib.linux-x86_64-3.8/apache_beam/portability/api
[0m[91m copying apache_beam/portability/api/external_transforms_pb2_grpc.py -> build/lib.linux-x86_64-3.8/apache_beam/portability/api
[0m[91m copying apache_beam/portability/api/beam_artifact_api_pb2_urns.py -> build/lib.linux-x86_64-3.8/apache_beam/portability/api
[0m[91m copying apache_beam/portability/api/standard_window_fns_pb2.py -> build/lib.linux-x86_64-3.8/apache_beam/portability/api
[0m[91m copying apache_beam/portability/api/__init__.py -> build/lib.linux-x86_64-3.8/apache_beam/portability/api
[0m[91m copying apache_beam/portability/api/beam_fn_api_pb2.py -> build/lib.linux-x86_64-3.8/apache_beam/portability/api
[0m[91m copying apache_beam/portability/api/standard_window_fns_pb2_grpc.py -> build/lib.linux-x86_64-3.8/apache_beam/portability/api
[0m[91m copying apache_beam/portability/api/beam_job_api_pb2.py -> build/lib.linux-x86_64-3.8/apache_beam/portability/api
[0m[91m copying apache_beam/portability/api/external_transforms_pb2.py -> build/lib.linux-x86_64-3.8/apache_beam/portability/api
[0m[91m copying apache_beam/portability/api/beam_artifact_api_pb2_grpc.py -> build/lib.linux-x86_64-3.8/apache_beam/portability/api
[0m[91m copying apache_beam/portability/api/beam_runner_api_pb2.py -> build/lib.linux-x86_64-3.8/apache_beam/portability/api
[0m[91m copying apache_beam/coders/stream.pyx -> build/lib.linux-x86_64-3.8/apache_beam/coders
[0m[91m copying apache_beam/transforms/cy_dataflow_distribution_counter.pyx -> build/lib.linux-x86_64-3.8/apache_beam/transforms
[0m[91m copying apache_beam/runners/worker/statesampler_fast.pyx -> build/lib.linux-x86_64-3.8/apache_beam/runners/worker
[0m[91m copying apache_beam/coders/coder_impl.pxd -> build/lib.linux-x86_64-3.8/apache_beam/coders
copying apache_beam/coders/stream.pxd -> build/lib.linux-x86_64-3.8/apache_beam/coders
[0m[91m copying apache_beam/utils/counters.pxd -> build/lib.linux-x86_64-3.8/apache_beam/utils
[0m[91m copying apache_beam/utils/windowed_value.pxd -> build/lib.linux-x86_64-3.8/apache_beam/utils
[0m[91m copying apache_beam/transforms/cy_combiners.pxd -> build/lib.linux-x86_64-3.8/apache_beam/transforms
[0m[91m copying apache_beam/transforms/stats.pxd -> build/lib.linux-x86_64-3.8/apache_beam/transforms
[0m[91m copying apache_beam/transforms/cy_dataflow_distribution_counter.pxd -> build/lib.linux-x86_64-3.8/apache_beam/transforms
[0m[91m copying apache_beam/runners/common.pxd -> build/lib.linux-x86_64-3.8/apache_beam/runners
[0m[91m copying apache_beam/metrics/execution.pxd -> build/lib.linux-x86_64-3.8/apache_beam/metrics
[0m[91m copying apache_beam/metrics/cells.pxd -> build/lib.linux-x86_64-3.8/apache_beam/metrics
copying apache_beam/runners/worker/opcounters.pxd -> build/lib.linux-x86_64-3.8/apache_beam/runners/worker
[0m[91m copying apache_beam/runners/worker/statesampler_fast.pxd -> build/lib.linux-x86_64-3.8/apache_beam/runners/worker
[0m[91m copying apache_beam/runners/worker/operations.pxd -> build/lib.linux-x86_64-3.8/apache_beam/runners/worker
[0m[91m copying apache_beam/runners/worker/crossplatform_time.h -> build/lib.linux-x86_64-3.8/apache_beam/runners/worker
[0m[91m copying apache_beam/runners/worker/crossplatform_unistd.h -> build/lib.linux-x86_64-3.8/apache_beam/runners/worker
[0m[91m creating build/lib.linux-x86_64-3.8/apache_beam/testing/data
[0m[91m copying apache_beam/testing/data/trigger_transcripts.yaml -> build/lib.linux-x86_64-3.8/apache_beam/testing/data
[0m[91m copying apache_beam/portability/api/standard_coders.yaml -> build/lib.linux-x86_64-3.8/apache_beam/portability/api
[0m[91m running build_ext
[0m[91m building 'apache_beam.coders.stream' extension
creating build/temp.linux-x86_64-3.8
[0m[91m creating build/temp.linux-x86_64-3.8/apache_beam
creating build/temp.linux-x86_64-3.8/apache_beam/coders
gcc -pthread -Wno-unused-result -Wsign-compare -DNDEBUG -g -fwrapv -O3 -Wall -fPIC -I/usr/local/include/python3.8 -c apache_beam/coders/stream.c -o build/temp.linux-x86_64-3.8/apache_beam/coders/stream.o
[0m[91m apache_beam/coders/stream.c: In function ‘__pyx_f_11apache_beam_6coders_6stream_12OutputStream_write_bigendian_double’:
apache_beam/coders/stream.c:3535:185: warning: dereferencing type-punned pointer will break strict-aliasing rules [-Wstrict-aliasing]
__pyx_t_1 = ((struct __pyx_vtabstruct_11apache_beam_6coders_6stream_OutputStream *)__pyx_v_self->__pyx_vtab)->write_bigendian_int64(__pyx_v_self, (((int64_t *)((char *)(&__pyx_v_d)))[0]), 0); if (unlikely(!__pyx_t_1)) __PYX_ERR(1, 99, __pyx_L1_error)
[0m[91m ^
apache_beam/coders/stream.c: In function ‘__pyx_f_11apache_beam_6coders_6stream_11InputStream_read_var_int64’:
apache_beam/coders/stream.c:6674:33: warning: comparison of integer expressions of different signedness: ‘long int’ and ‘long unsigned int’ [-Wsign-compare]
[0m[91m __pyx_t_8 = ((__pyx_v_shift >= ((sizeof(long)) * 8)) != 0);
^~
[0m[91m apache_beam/coders/stream.c:6688:33: warning: comparison of integer expressions of different signedness: ‘long int’ and ‘long unsigned int’ [-Wsign-compare]
[0m[91m __pyx_t_8 = ((__pyx_v_shift >= (((sizeof(long)) * 8) - 1)) != 0);
[0m[91m ^~
[0m[91m apache_beam/coders/stream.c: In function ‘__pyx_f_11apache_beam_6coders_6stream_11InputStream_read_bigendian_double’:
[0m[91m apache_beam/coders/stream.c:7381:54: warning: dereferencing type-punned pointer will break strict-aliasing rules [-Wstrict-aliasing]
__pyx_r = (((double *)((char *)(&__pyx_v_as_long)))[0]);
^
[0m[91m gcc -pthread -shared build/temp.linux-x86_64-3.8/apache_beam/coders/stream.o -L/usr/local/lib -o build/lib.linux-x86_64-3.8/apache_beam/coders/stream.cpython-38-x86_64-linux-gnu.so
[0m[91m building 'apache_beam.runners.worker.statesampler_fast' extension
creating build/temp.linux-x86_64-3.8/apache_beam/runners
[0m[91m creating build/temp.linux-x86_64-3.8/apache_beam/runners/worker
gcc -pthread -Wno-unused-result -Wsign-compare -DNDEBUG -g -fwrapv -O3 -Wall -fPIC -Iapache_beam/runners/worker -I/usr/local/include/python3.8 -c apache_beam/runners/worker/statesampler_fast.c -o build/temp.linux-x86_64-3.8/apache_beam/runners/worker/statesampler_fast.o
[0m[91m gcc -pthread -shared build/temp.linux-x86_64-3.8/apache_beam/runners/worker/statesampler_fast.o -L/usr/local/lib -o build/lib.linux-x86_64-3.8/apache_beam/runners/worker/statesampler_fast.cpython-38-x86_64-linux-gnu.so
[0m[91m building 'apache_beam.transforms.cy_dataflow_distribution_counter' extension
creating build/temp.linux-x86_64-3.8/apache_beam/transforms
[0m[91m gcc -pthread -Wno-unused-result -Wsign-compare -DNDEBUG -g -fwrapv -O3 -Wall -fPIC -I/usr/local/include/python3.8 -c apache_beam/transforms/cy_dataflow_distribution_counter.c -o build/temp.linux-x86_64-3.8/apache_beam/transforms/cy_dataflow_distribution_counter.o
[0m[91m apache_beam/transforms/cy_dataflow_distribution_counter.c: In function ‘__pyx_f_11apache_beam_10transforms_32cy_dataflow_distribution_counter_get_log10_round_to_floor’:
apache_beam/transforms/cy_dataflow_distribution_counter.c:1712:35: warning: comparison of integer expressions of different signedness: ‘int64_t’ {aka ‘long int’} and ‘long long unsigned int’ [-Wsign-compare]
__pyx_t_1 = ((__pyx_v_element >= (__pyx_v_11apache_beam_10transforms_32cy_dataflow_distribution_counter_POWER_TEN[__pyx_v_power])) != 0);
[0m[91m ^~
[0m[91m gcc -pthread -shared build/temp.linux-x86_64-3.8/apache_beam/transforms/cy_dataflow_distribution_counter.o -L/usr/local/lib -o build/lib.linux-x86_64-3.8/apache_beam/transforms/cy_dataflow_distribution_counter.cpython-38-x86_64-linux-gnu.so
[0m[91m building 'apache_beam.coders.coder_impl' extension
gcc -pthread -Wno-unused-result -Wsign-compare -DNDEBUG -g -fwrapv -O3 -Wall -fPIC -I/usr/local/include/python3.8 -c apache_beam/coders/coder_impl.c -o build/temp.linux-x86_64-3.8/apache_beam/coders/coder_impl.o
[0m
> Task :sdks:python:container:py36:docker
[91m gcc -pthread -shared build/temp.linux-x86_64-3.6/apache_beam/runners/worker/statesampler_fast.o -L/usr/local/lib -lpython3.6m -o build/lib.linux-x86_64-3.6/apache_beam/runners/worker/statesampler_fast.cpython-36m-x86_64-linux-gnu.so
[0m[91m building 'apache_beam.transforms.cy_dataflow_distribution_counter' extension
creating build/temp.linux-x86_64-3.6/apache_beam/transforms
[0m[91m gcc -pthread -Wno-unused-result -Wsign-compare -DNDEBUG -g -fwrapv -O3 -Wall -fPIC -I/usr/local/include/python3.6m -c apache_beam/transforms/cy_dataflow_distribution_counter.c -o build/temp.linux-x86_64-3.6/apache_beam/transforms/cy_dataflow_distribution_counter.o
[0m[91m apache_beam/transforms/cy_dataflow_distribution_counter.c: In function ‘__pyx_f_11apache_beam_10transforms_32cy_dataflow_distribution_counter_get_log10_round_to_floor’:
apache_beam/transforms/cy_dataflow_distribution_counter.c:1712:35: warning: comparison of integer expressions of different signedness: ‘int64_t’ {aka ‘long int’} and ‘long long unsigned int’ [-Wsign-compare]
__pyx_t_1 = ((__pyx_v_element >= (__pyx_v_11apache_beam_10transforms_32cy_dataflow_distribution_counter_POWER_TEN[__pyx_v_power])) != 0);
[0m[91m ^~
[0m[91m gcc -pthread -shared build/temp.linux-x86_64-3.6/apache_beam/transforms/cy_dataflow_distribution_counter.o -L/usr/local/lib -lpython3.6m -o build/lib.linux-x86_64-3.6/apache_beam/transforms/cy_dataflow_distribution_counter.cpython-36m-x86_64-linux-gnu.so
[0m[91m building 'apache_beam.coders.coder_impl' extension
gcc -pthread -Wno-unused-result -Wsign-compare -DNDEBUG -g -fwrapv -O3 -Wall -fPIC -I/usr/local/include/python3.6m -c apache_beam/coders/coder_impl.c -o build/temp.linux-x86_64-3.6/apache_beam/coders/coder_impl.o
[0m
> Task :sdks:python:container:py37:docker
[91m apache_beam/transforms/cy_dataflow_distribution_counter.c: In function ‘__pyx_f_11apache_beam_10transforms_32cy_dataflow_distribution_counter_get_log10_round_to_floor’:
apache_beam/transforms/cy_dataflow_distribution_counter.c:1712:35: warning: comparison of integer expressions of different signedness: ‘int64_t’ {aka ‘long int’} and ‘long long unsigned int’ [-Wsign-compare]
__pyx_t_1 = ((__pyx_v_element >= (__pyx_v_11apache_beam_10transforms_32cy_dataflow_distribution_counter_POWER_TEN[__pyx_v_power])) != 0);
[0m[91m ^~
[0m[91m gcc -pthread -shared build/temp.linux-x86_64-3.7/apache_beam/transforms/cy_dataflow_distribution_counter.o -L/usr/local/lib -lpython3.7m -o build/lib.linux-x86_64-3.7/apache_beam/transforms/cy_dataflow_distribution_counter.cpython-37m-x86_64-linux-gnu.so
[0m[91m building 'apache_beam.coders.coder_impl' extension
gcc -pthread -Wno-unused-result -Wsign-compare -DNDEBUG -g -fwrapv -O3 -Wall -fPIC -I/usr/local/include/python3.7m -c apache_beam/coders/coder_impl.c -o build/temp.linux-x86_64-3.7/apache_beam/coders/coder_impl.o
[0m[91m apache_beam/coders/coder_impl.c: In function ‘__pyx_f_11apache_beam_6coders_10coder_impl_17SequenceCoderImpl_encode_to_stream’:
apache_beam/coders/coder_impl.c:35711:32: warning: comparison of integer expressions of different signedness: ‘size_t’ {aka ‘long unsigned int’} and ‘int64_t’ {aka ‘long int’} [-Wsign-compare]
__pyx_t_9 = ((__pyx_t_14 > __pyx_v_target_buffer_size) != 0);
^
[0m[91m gcc -pthread -shared build/temp.linux-x86_64-3.7/apache_beam/coders/coder_impl.o -L/usr/local/lib -lpython3.7m -o build/lib.linux-x86_64-3.7/apache_beam/coders/coder_impl.cpython-37m-x86_64-linux-gnu.so
[0m[91m building 'apache_beam.metrics.cells' extension
creating build/temp.linux-x86_64-3.7/apache_beam/metrics
[0m[91m gcc -pthread -Wno-unused-result -Wsign-compare -DNDEBUG -g -fwrapv -O3 -Wall -fPIC -I/usr/local/include/python3.7m -c apache_beam/metrics/cells.c -o build/temp.linux-x86_64-3.7/apache_beam/metrics/cells.o
[0m
> Task :sdks:python:container:py38:docker
[91m apache_beam/coders/coder_impl.c: In function ‘__pyx_f_11apache_beam_6coders_10coder_impl_17SequenceCoderImpl_encode_to_stream’:
apache_beam/coders/coder_impl.c:35711:32: warning: comparison of integer expressions of different signedness: ‘size_t’ {aka ‘long unsigned int’} and ‘int64_t’ {aka ‘long int’} [-Wsign-compare]
__pyx_t_9 = ((__pyx_t_14 > __pyx_v_target_buffer_size) != 0);
^
[0m[91m gcc -pthread -shared build/temp.linux-x86_64-3.8/apache_beam/coders/coder_impl.o -L/usr/local/lib -o build/lib.linux-x86_64-3.8/apache_beam/coders/coder_impl.cpython-38-x86_64-linux-gnu.so
[0m[91m building 'apache_beam.metrics.cells' extension
creating build/temp.linux-x86_64-3.8/apache_beam/metrics
[0m[91m gcc -pthread -Wno-unused-result -Wsign-compare -DNDEBUG -g -fwrapv -O3 -Wall -fPIC -I/usr/local/include/python3.8 -c apache_beam/metrics/cells.c -o build/temp.linux-x86_64-3.8/apache_beam/metrics/cells.o
[0m[91m gcc -pthread -shared build/temp.linux-x86_64-3.8/apache_beam/metrics/cells.o -L/usr/local/lib -o build/lib.linux-x86_64-3.8/apache_beam/metrics/cells.cpython-38-x86_64-linux-gnu.so
[0m[91m building 'apache_beam.metrics.execution' extension
[0m[91m gcc -pthread -Wno-unused-result -Wsign-compare -DNDEBUG -g -fwrapv -O3 -Wall -fPIC -I/usr/local/include/python3.8 -c apache_beam/metrics/execution.c -o build/temp.linux-x86_64-3.8/apache_beam/metrics/execution.o
[0m[91m gcc -pthread -shared build/temp.linux-x86_64-3.8/apache_beam/metrics/execution.o -L/usr/local/lib -o build/lib.linux-x86_64-3.8/apache_beam/metrics/execution.cpython-38-x86_64-linux-gnu.so
[0m[91m building 'apache_beam.runners.common' extension
[0m[91m gcc -pthread -Wno-unused-result -Wsign-compare -DNDEBUG -g -fwrapv -O3 -Wall -fPIC -I/usr/local/include/python3.8 -c apache_beam/runners/common.c -o build/temp.linux-x86_64-3.8/apache_beam/runners/common.o
[0m
> Task :sdks:python:container:py36:docker
[91m apache_beam/coders/coder_impl.c: In function ‘__pyx_f_11apache_beam_6coders_10coder_impl_17SequenceCoderImpl_encode_to_stream’:
apache_beam/coders/coder_impl.c:35711:32: warning: comparison of integer expressions of different signedness: ‘size_t’ {aka ‘long unsigned int’} and ‘int64_t’ {aka ‘long int’} [-Wsign-compare]
__pyx_t_9 = ((__pyx_t_14 > __pyx_v_target_buffer_size) != 0);
[0m[91m ^
[0m[91m gcc -pthread -shared build/temp.linux-x86_64-3.6/apache_beam/coders/coder_impl.o -L/usr/local/lib -lpython3.6m -o build/lib.linux-x86_64-3.6/apache_beam/coders/coder_impl.cpython-36m-x86_64-linux-gnu.so
[0m[91m building 'apache_beam.metrics.cells' extension
creating build/temp.linux-x86_64-3.6/apache_beam/metrics
gcc -pthread -Wno-unused-result -Wsign-compare -DNDEBUG -g -fwrapv -O3 -Wall -fPIC -I/usr/local/include/python3.6m -c apache_beam/metrics/cells.c -o build/temp.linux-x86_64-3.6/apache_beam/metrics/cells.o
[0m[91m gcc -pthread -shared build/temp.linux-x86_64-3.6/apache_beam/metrics/cells.o -L/usr/local/lib -lpython3.6m -o build/lib.linux-x86_64-3.6/apache_beam/metrics/cells.cpython-36m-x86_64-linux-gnu.so
[0m[91m building 'apache_beam.metrics.execution' extension
gcc -pthread -Wno-unused-result -Wsign-compare -DNDEBUG -g -fwrapv -O3 -Wall -fPIC -I/usr/local/include/python3.6m -c apache_beam/metrics/execution.c -o build/temp.linux-x86_64-3.6/apache_beam/metrics/execution.o
[0m[91m gcc -pthread -shared build/temp.linux-x86_64-3.6/apache_beam/metrics/execution.o -L/usr/local/lib -lpython3.6m -o build/lib.linux-x86_64-3.6/apache_beam/metrics/execution.cpython-36m-x86_64-linux-gnu.so
[0m[91m building 'apache_beam.runners.common' extension
gcc -pthread -Wno-unused-result -Wsign-compare -DNDEBUG -g -fwrapv -O3 -Wall -fPIC -I/usr/local/include/python3.6m -c apache_beam/runners/common.c -o build/temp.linux-x86_64-3.6/apache_beam/runners/common.o
[0m
> Task :sdks:python:container:py37:docker
[91m gcc -pthread -shared build/temp.linux-x86_64-3.7/apache_beam/metrics/cells.o -L/usr/local/lib -lpython3.7m -o build/lib.linux-x86_64-3.7/apache_beam/metrics/cells.cpython-37m-x86_64-linux-gnu.so
[0m[91m building 'apache_beam.metrics.execution' extension
gcc -pthread -Wno-unused-result -Wsign-compare -DNDEBUG -g -fwrapv -O3 -Wall -fPIC -I/usr/local/include/python3.7m -c apache_beam/metrics/execution.c -o build/temp.linux-x86_64-3.7/apache_beam/metrics/execution.o
[0m[91m gcc -pthread -shared build/temp.linux-x86_64-3.7/apache_beam/metrics/execution.o -L/usr/local/lib -lpython3.7m -o build/lib.linux-x86_64-3.7/apache_beam/metrics/execution.cpython-37m-x86_64-linux-gnu.so
[0m[91m building 'apache_beam.runners.common' extension
gcc -pthread -Wno-unused-result -Wsign-compare -DNDEBUG -g -fwrapv -O3 -Wall -fPIC -I/usr/local/include/python3.7m -c apache_beam/runners/common.c -o build/temp.linux-x86_64-3.7/apache_beam/runners/common.o
[0m[91m gcc -pthread -shared build/temp.linux-x86_64-3.7/apache_beam/runners/common.o -L/usr/local/lib -lpython3.7m -o build/lib.linux-x86_64-3.7/apache_beam/runners/common.cpython-37m-x86_64-linux-gnu.so
[0m[91m building 'apache_beam.runners.worker.logger' extension
gcc -pthread -Wno-unused-result -Wsign-compare -DNDEBUG -g -fwrapv -O3 -Wall -fPIC -I/usr/local/include/python3.7m -c apache_beam/runners/worker/logger.c -o build/temp.linux-x86_64-3.7/apache_beam/runners/worker/logger.o
[0m[91m gcc -pthread -shared build/temp.linux-x86_64-3.7/apache_beam/runners/worker/logger.o -L/usr/local/lib -lpython3.7m -o build/lib.linux-x86_64-3.7/apache_beam/runners/worker/logger.cpython-37m-x86_64-linux-gnu.so
[0m[91m building 'apache_beam.runners.worker.opcounters' extension
gcc -pthread -Wno-unused-result -Wsign-compare -DNDEBUG -g -fwrapv -O3 -Wall -fPIC -I/usr/local/include/python3.7m -c apache_beam/runners/worker/opcounters.c -o build/temp.linux-x86_64-3.7/apache_beam/runners/worker/opcounters.o
[0m[91m gcc -pthread -shared build/temp.linux-x86_64-3.7/apache_beam/runners/worker/opcounters.o -L/usr/local/lib -lpython3.7m -o build/lib.linux-x86_64-3.7/apache_beam/runners/worker/opcounters.cpython-37m-x86_64-linux-gnu.so
[0m[91m building 'apache_beam.runners.worker.operations' extension
[0m[91m gcc -pthread -Wno-unused-result -Wsign-compare -DNDEBUG -g -fwrapv -O3 -Wall -fPIC -I/usr/local/include/python3.7m -c apache_beam/runners/worker/operations.c -o build/temp.linux-x86_64-3.7/apache_beam/runners/worker/operations.o
[0m
> Task :sdks:python:container:py38:docker
[91m gcc -pthread -shared build/temp.linux-x86_64-3.8/apache_beam/runners/common.o -L/usr/local/lib -o build/lib.linux-x86_64-3.8/apache_beam/runners/common.cpython-38-x86_64-linux-gnu.so
[0m[91m building 'apache_beam.runners.worker.logger' extension
gcc -pthread -Wno-unused-result -Wsign-compare -DNDEBUG -g -fwrapv -O3 -Wall -fPIC -I/usr/local/include/python3.8 -c apache_beam/runners/worker/logger.c -o build/temp.linux-x86_64-3.8/apache_beam/runners/worker/logger.o
[0m[91m gcc -pthread -shared build/temp.linux-x86_64-3.8/apache_beam/runners/worker/logger.o -L/usr/local/lib -o build/lib.linux-x86_64-3.8/apache_beam/runners/worker/logger.cpython-38-x86_64-linux-gnu.so
[0m[91m building 'apache_beam.runners.worker.opcounters' extension
gcc -pthread -Wno-unused-result -Wsign-compare -DNDEBUG -g -fwrapv -O3 -Wall -fPIC -I/usr/local/include/python3.8 -c apache_beam/runners/worker/opcounters.c -o build/temp.linux-x86_64-3.8/apache_beam/runners/worker/opcounters.o
[0m[91m gcc -pthread -shared build/temp.linux-x86_64-3.8/apache_beam/runners/worker/opcounters.o -L/usr/local/lib -o build/lib.linux-x86_64-3.8/apache_beam/runners/worker/opcounters.cpython-38-x86_64-linux-gnu.so
[0m[91m building 'apache_beam.runners.worker.operations' extension
gcc -pthread -Wno-unused-result -Wsign-compare -DNDEBUG -g -fwrapv -O3 -Wall -fPIC -I/usr/local/include/python3.8 -c apache_beam/runners/worker/operations.c -o build/temp.linux-x86_64-3.8/apache_beam/runners/worker/operations.o
[0m
> Task :sdks:python:container:py36:docker
[91m gcc -pthread -shared build/temp.linux-x86_64-3.6/apache_beam/runners/common.o -L/usr/local/lib -lpython3.6m -o build/lib.linux-x86_64-3.6/apache_beam/runners/common.cpython-36m-x86_64-linux-gnu.so
[0m[91m building 'apache_beam.runners.worker.logger' extension
gcc -pthread -Wno-unused-result -Wsign-compare -DNDEBUG -g -fwrapv -O3 -Wall -fPIC -I/usr/local/include/python3.6m -c apache_beam/runners/worker/logger.c -o build/temp.linux-x86_64-3.6/apache_beam/runners/worker/logger.o
[0m[91m gcc -pthread -shared build/temp.linux-x86_64-3.6/apache_beam/runners/worker/logger.o -L/usr/local/lib -lpython3.6m -o build/lib.linux-x86_64-3.6/apache_beam/runners/worker/logger.cpython-36m-x86_64-linux-gnu.so
[0m[91m building 'apache_beam.runners.worker.opcounters' extension
gcc -pthread -Wno-unused-result -Wsign-compare -DNDEBUG -g -fwrapv -O3 -Wall -fPIC -I/usr/local/include/python3.6m -c apache_beam/runners/worker/opcounters.c -o build/temp.linux-x86_64-3.6/apache_beam/runners/worker/opcounters.o
[0m[91m gcc -pthread -shared build/temp.linux-x86_64-3.6/apache_beam/runners/worker/opcounters.o -L/usr/local/lib -lpython3.6m -o build/lib.linux-x86_64-3.6/apache_beam/runners/worker/opcounters.cpython-36m-x86_64-linux-gnu.so
[0m[91m building 'apache_beam.runners.worker.operations' extension
gcc -pthread -Wno-unused-result -Wsign-compare -DNDEBUG -g -fwrapv -O3 -Wall -fPIC -I/usr/local/include/python3.6m -c apache_beam/runners/worker/operations.c -o build/temp.linux-x86_64-3.6/apache_beam/runners/worker/operations.o
[0m
> Task :sdks:python:container:py37:docker
[91m apache_beam/runners/worker/operations.c:5042:20: warning: ‘__pyx_mdef_11apache_beam_7runners_6worker_10operations_10FakeCython_1cast’ defined but not used [-Wunused-variable]
static PyMethodDef __pyx_mdef_11apache_beam_7runners_6worker_10operations_10FakeCython_1cast = {"cast", (PyCFunction)(void*)(PyCFunctionWithKeywords)__pyx_pw_11apache_beam_7runners_6worker_10operations_10FakeCython_1cast, METH_VARARGS|METH_KEYWORDS, 0};
^~~~~~~~~~~~~~~~~~~~~~~~~~~~~~~~~~~~~~~~~~~~~~~~~~~~~~~~~~~~~~~~~~~~~~~~~
[0m[91m gcc -pthread -shared build/temp.linux-x86_64-3.7/apache_beam/runners/worker/operations.o -L/usr/local/lib -lpython3.7m -o build/lib.linux-x86_64-3.7/apache_beam/runners/worker/operations.cpython-37m-x86_64-linux-gnu.so
[0m[91m building 'apache_beam.transforms.cy_combiners' extension
gcc -pthread -Wno-unused-result -Wsign-compare -DNDEBUG -g -fwrapv -O3 -Wall -fPIC -I/usr/local/include/python3.7m -c apache_beam/transforms/cy_combiners.c -o build/temp.linux-x86_64-3.7/apache_beam/transforms/cy_combiners.o
[0m[91m gcc -pthread -shared build/temp.linux-x86_64-3.7/apache_beam/transforms/cy_combiners.o -L/usr/local/lib -lpython3.7m -o build/lib.linux-x86_64-3.7/apache_beam/transforms/cy_combiners.cpython-37m-x86_64-linux-gnu.so
[0m[91m building 'apache_beam.transforms.stats' extension
gcc -pthread -Wno-unused-result -Wsign-compare -DNDEBUG -g -fwrapv -O3 -Wall -fPIC -I/usr/local/include/python3.7m -c apache_beam/transforms/stats.c -o build/temp.linux-x86_64-3.7/apache_beam/transforms/stats.o
[0m
> Task :sdks:python:container:py38:docker
[91m apache_beam/runners/worker/operations.c:5042:20: warning: ‘__pyx_mdef_11apache_beam_7runners_6worker_10operations_10FakeCython_1cast’ defined but not used [-Wunused-variable]
static PyMethodDef __pyx_mdef_11apache_beam_7runners_6worker_10operations_10FakeCython_1cast = {"cast", (PyCFunction)(void*)(PyCFunctionWithKeywords)__pyx_pw_11apache_beam_7runners_6worker_10operations_10FakeCython_1cast, METH_VARARGS|METH_KEYWORDS, 0};
^~~~~~~~~~~~~~~~~~~~~~~~~~~~~~~~~~~~~~~~~~~~~~~~~~~~~~~~~~~~~~~~~~~~~~~~~
[0m[91m gcc -pthread -shared build/temp.linux-x86_64-3.8/apache_beam/runners/worker/operations.o -L/usr/local/lib -o build/lib.linux-x86_64-3.8/apache_beam/runners/worker/operations.cpython-38-x86_64-linux-gnu.so
[0m[91m building 'apache_beam.transforms.cy_combiners' extension
gcc -pthread -Wno-unused-result -Wsign-compare -DNDEBUG -g -fwrapv -O3 -Wall -fPIC -I/usr/local/include/python3.8 -c apache_beam/transforms/cy_combiners.c -o build/temp.linux-x86_64-3.8/apache_beam/transforms/cy_combiners.o
[0m
> Task :sdks:python:container:py37:docker FAILED
> Task :sdks:python:container:py36:docker
[91m apache_beam/runners/worker/operations.c:5042:20: warning: ‘__pyx_mdef_11apache_beam_7runners_6worker_10operations_10FakeCython_1cast’ defined but not used [-Wunused-variable]
static PyMethodDef __pyx_mdef_11apache_beam_7runners_6worker_10operations_10FakeCython_1cast = {"cast", (PyCFunction)(void*)(PyCFunctionWithKeywords)__pyx_pw_11apache_beam_7runners_6worker_10operations_10FakeCython_1cast, METH_VARARGS|METH_KEYWORDS, 0};
^~~~~~~~~~~~~~~~~~~~~~~~~~~~~~~~~~~~~~~~~~~~~~~~~~~~~~~~~~~~~~~~~~~~~~~~~
[0m[91m gcc -pthread -shared build/temp.linux-x86_64-3.6/apache_beam/runners/worker/operations.o -L/usr/local/lib -lpython3.6m -o build/lib.linux-x86_64-3.6/apache_beam/runners/worker/operations.cpython-36m-x86_64-linux-gnu.so
[0m[91m building 'apache_beam.transforms.cy_combiners' extension
[0m[91m gcc -pthread -Wno-unused-result -Wsign-compare -DNDEBUG -g -fwrapv -O3 -Wall -fPIC -I/usr/local/include/python3.6m -c apache_beam/transforms/cy_combiners.c -o build/temp.linux-x86_64-3.6/apache_beam/transforms/cy_combiners.o
[0m[91m gcc -pthread -shared build/temp.linux-x86_64-3.6/apache_beam/transforms/cy_combiners.o -L/usr/local/lib -lpython3.6m -o build/lib.linux-x86_64-3.6/apache_beam/transforms/cy_combiners.cpython-36m-x86_64-linux-gnu.so
[0m[91m building 'apache_beam.transforms.stats' extension
gcc -pthread -Wno-unused-result -Wsign-compare -DNDEBUG -g -fwrapv -O3 -Wall -fPIC -I/usr/local/include/python3.6m -c apache_beam/transforms/stats.c -o build/temp.linux-x86_64-3.6/apache_beam/transforms/stats.o
[0m
> Task :sdks:python:container:py36:dockerTag9e929bd038f8db4f2a3520312dc28e721e358078
> Task :sdks:python:container:py38:dockerTag9e929bd038f8db4f2a3520312dc28e721e358078
> Task :sdks:python:container:py36:dockerPush9e929bd038f8db4f2a3520312dc28e721e358078
> Task :sdks:python:container:py38:dockerPush9e929bd038f8db4f2a3520312dc28e721e358078
> Task :sdks:python:container:py36:dockerTagLatest
> Task :sdks:python:container:py36:dockerPushLatest
> Task :sdks:python:container:py36:dockerTagsPush
> Task :sdks:python:container:py38:dockerTagLatest
> Task :sdks:python:container:py38:dockerPushLatest
> Task :sdks:python:container:py38:dockerTagsPush
FAILURE: Build failed with an exception.
* What went wrong:
Execution failed for task ':sdks:python:container:py37:docker'.
> Process 'command 'docker'' finished with non-zero exit value 143
* Try:
Run with --stacktrace option to get the stack trace. Run with --info or --debug option to get more log output. Run with --scan to get full insights.
* Get more help at https://help.gradle.org
Deprecated Gradle features were used in this build, making it incompatible with Gradle 7.0.
Use '--warning-mode all' to show the individual deprecation warnings.
See https://docs.gradle.org/6.8.3/userguide/command_line_interface.html#sec:command_line_warnings
BUILD FAILED in 16m 10s
147 actionable tasks: 117 executed, 21 from cache, 9 up-to-date
Publishing build scan...
https://gradle.com/s/c2yovtth6hyji
Build step 'Invoke Gradle script' changed build result to FAILURE
Build step 'Invoke Gradle script' marked build as failure
---------------------------------------------------------------------
To unsubscribe, e-mail: builds-unsubscribe@beam.apache.org
For additional commands, e-mail: builds-help@beam.apache.org
Jenkins build is back to normal : beam_Publish_Beam_SDK_Snapshots
#1686
Posted by Apache Jenkins Server <je...@builds.apache.org>.
See <https://ci-beam.apache.org/job/beam_Publish_Beam_SDK_Snapshots/1686/display/redirect>
---------------------------------------------------------------------
To unsubscribe, e-mail: builds-unsubscribe@beam.apache.org
For additional commands, e-mail: builds-help@beam.apache.org