You are viewing a plain text version of this content. The canonical link for it is here.
Posted to notifications@maven.apache.org by Hudson <Hu...@sonatype.org> on 2008/07/25 18:17:23 UTC
Build failed in Hudson: maven-2.1.x #267
See http://ci.sonatype.org/job/maven-2.1.x/267/changes
Changes:
[John Casey] [MNG-3682] set project to null after recovering from ProjectBuildingException to prevent infinite loop after one level of relocation.
Submitted by: Tomasz Wysocki
------------------------------------------
[...truncated 6742 lines...]
from the specified remote repositories:
Nexus (http://localhost:8081/content/groups/public)
[DEBUG] Using defaults for missing POM org.apache.maven.shared:maven-shared-model:pom:1.0-SNAPSHOT:compile
[DEBUG] org.apache.maven.shared:maven-shared-model:jar:1.0-SNAPSHOT:compile (selected for compile)
[DEBUG] junit:junit:jar:3.8.1:test (not setting scope to: compile; local scope test wins)
[DEBUG] junit:junit:jar:3.8.1:test (selected for test)
[DEBUG] Trying repository central
Downloading: http://localhost:8081/content/groups/public/org/codehaus/plexus/plexus-interpolation/1.1/plexus-interpolation-1.1.jar
34K downloaded
[DEBUG] Artifact resolved
[DEBUG] maven-artifact: resolved to version 3.0-20080717.214645-113 from repository codehaus.snapshots
[DEBUG] Trying repository central
Downloading: http://localhost:8081/content/groups/public/org/apache/maven/wagon/wagon-file/1.0-beta-3/wagon-file-1.0-beta-3.jar
9K downloaded
[DEBUG] Artifact resolved
[DEBUG] Trying repository central
Downloading: http://localhost:8081/content/groups/public/org/codehaus/woodstox/wstx-asl/3.2.6/wstx-asl-3.2.6.jar
508K downloaded
[DEBUG] SHA1 not found, trying MD5
org.apache.maven.wagon.ResourceDoesNotExistException: Unable to locate resource in repository
at org.apache.maven.wagon.providers.http.LightweightHttpWagon.fillInputData(LightweightHttpWagon.java:100)
at org.apache.maven.wagon.StreamWagon.get(StreamWagon.java:68)
at org.apache.maven.artifact.manager.DefaultWagonManager.verifyChecksum(DefaultWagonManager.java:654)
at org.apache.maven.artifact.manager.DefaultWagonManager.getRemoteFile(DefaultWagonManager.java:485)
at org.apache.maven.artifact.manager.DefaultWagonManager.getArtifact(DefaultWagonManager.java:354)
at org.apache.maven.artifact.manager.DefaultWagonManager.getArtifact(DefaultWagonManager.java:309)
at org.apache.maven.artifact.resolver.DefaultArtifactResolver.resolve(DefaultArtifactResolver.java:200)
at org.apache.maven.artifact.resolver.DefaultArtifactResolver.resolve(DefaultArtifactResolver.java:74)
at org.apache.maven.artifact.resolver.DefaultArtifactResolver.resolveTransitively(DefaultArtifactResolver.java:311)
at org.apache.maven.artifact.resolver.DefaultArtifactResolver.resolveTransitively(DefaultArtifactResolver.java:288)
at org.apache.maven.plugin.DefaultPluginManager.resolveTransitiveDependencies(DefaultPluginManager.java:1415)
at org.apache.maven.plugin.DefaultPluginManager.executeMojo(DefaultPluginManager.java:405)
at org.apache.maven.lifecycle.DefaultLifecycleExecutor.executeGoals(DefaultLifecycleExecutor.java:558)
at org.apache.maven.lifecycle.DefaultLifecycleExecutor.executeGoalWithLifecycle(DefaultLifecycleExecutor.java:499)
at org.apache.maven.lifecycle.DefaultLifecycleExecutor.executeGoal(DefaultLifecycleExecutor.java:478)
at org.apache.maven.lifecycle.DefaultLifecycleExecutor.executeGoalAndHandleFailures(DefaultLifecycleExecutor.java:330)
at org.apache.maven.lifecycle.DefaultLifecycleExecutor.executeTaskSegments(DefaultLifecycleExecutor.java:291)
at org.apache.maven.lifecycle.DefaultLifecycleExecutor.execute(DefaultLifecycleExecutor.java:142)
at org.apache.maven.DefaultMaven.doExecute(DefaultMaven.java:336)
at org.apache.maven.DefaultMaven.execute(DefaultMaven.java:129)
at org.apache.maven.cli.MavenCli.main(MavenCli.java:287)
at sun.reflect.NativeMethodAccessorImpl.invoke0(Native Method)
at sun.reflect.NativeMethodAccessorImpl.invoke(NativeMethodAccessorImpl.java:39)
at sun.reflect.DelegatingMethodAccessorImpl.invoke(DelegatingMethodAccessorImpl.java:25)
at java.lang.reflect.Method.invoke(Method.java:585)
at org.codehaus.classworlds.Launcher.launchEnhanced(Launcher.java:315)
at org.codehaus.classworlds.Launcher.launch(Launcher.java:255)
at org.codehaus.classworlds.Launcher.mainWithExitCode(Launcher.java:430)
at org.codehaus.classworlds.Launcher.main(Launcher.java:375)
Caused by: java.io.FileNotFoundException: http://localhost:8081/content/groups/public/org/codehaus/woodstox/wstx-asl/3.2.6/wstx-asl-3.2.6.jar.sha1
at sun.net.www.protocol.http.HttpURLConnection.getInputStream(HttpURLConnection.java:1168)
at org.apache.maven.wagon.providers.http.LightweightHttpWagon.fillInputData(LightweightHttpWagon.java:83)
... 28 more
[WARNING] *** CHECKSUM FAILED - Error retrieving checksum file for org/codehaus/woodstox/wstx-asl/3.2.6/wstx-asl-3.2.6.jar - IGNORING
[DEBUG] Artifact resolved
[DEBUG] Trying repository central
Downloading: http://localhost:8081/content/groups/public/stax/stax-api/1.0.1/stax-api-1.0.1.jar
25K downloaded
[DEBUG] Artifact resolved
[DEBUG] maven-shared-model: using locally installed snapshot
[DEBUG] Trying repository central
Downloading: http://localhost:8081/content/groups/public/org/apache/maven/shared/maven-shared-model/1.0-SNAPSHOT/maven-shared-model-1.0-SNAPSHOT.jar
[DEBUG] Unable to get resource 'org.apache.maven.shared:maven-shared-model:jar:1.0-SNAPSHOT' from repository central (http://Nexus)
[DEBUG] Trying repository apache.snapshots
Downloading: http://localhost:8081/content/groups/public/org/apache/maven/shared/maven-shared-model/1.0-SNAPSHOT/maven-shared-model-1.0-SNAPSHOT.jar
[DEBUG] Unable to get resource 'org.apache.maven.shared:maven-shared-model:jar:1.0-SNAPSHOT' from repository apache.snapshots (http://people.apache.org/repo/m2-snapshot-repository/)
[DEBUG] Trying repository codehaus.snapshots
Downloading: http://localhost:8081/content/groups/public/org/apache/maven/shared/maven-shared-model/1.0-SNAPSHOT/maven-shared-model-1.0-SNAPSHOT.jar
[DEBUG] Unable to get resource 'org.apache.maven.shared:maven-shared-model:jar:1.0-SNAPSHOT' from repository codehaus.snapshots (http://snapshots.repository.codehaus.org/)
[DEBUG] Unable to download the artifact from any repository
Try downloading the file manually from the project website.
Then, install it using the command:
mvn install:install-file -DgroupId=org.apache.maven.shared -DartifactId=maven-shared-model -Dversion=1.0-SNAPSHOT -Dpackaging=jar -Dfile=/path/to/file
Alternatively, if you host your own repository you can deploy the file there:
mvn deploy:deploy-file -DgroupId=org.apache.maven.shared -DartifactId=maven-shared-model -Dversion=1.0-SNAPSHOT -Dpackaging=jar -Dfile=/path/to/file -Durl=[url] -DrepositoryId=[id]
Path to dependency:
1) org.apache.maven:maven-project:jar:2.1-SNAPSHOT
2) org.apache.maven.shared:maven-shared-model:jar:1.0-SNAPSHOT
org.apache.maven.shared:maven-shared-model:jar:1.0-SNAPSHOT
from the specified remote repositories:
Nexus (http://localhost:8081/content/groups/public)
org.apache.maven.artifact.resolver.ArtifactNotFoundException: Unable to download the artifact from any repository
Try downloading the file manually from the project website.
Then, install it using the command:
mvn install:install-file -DgroupId=org.apache.maven.shared -DartifactId=maven-shared-model -Dversion=1.0-SNAPSHOT -Dpackaging=jar -Dfile=/path/to/file
Alternatively, if you host your own repository you can deploy the file there:
mvn deploy:deploy-file -DgroupId=org.apache.maven.shared -DartifactId=maven-shared-model -Dversion=1.0-SNAPSHOT -Dpackaging=jar -Dfile=/path/to/file -Durl=[url] -DrepositoryId=[id]
Path to dependency:
1) org.apache.maven:maven-project:jar:2.1-SNAPSHOT
2) org.apache.maven.shared:maven-shared-model:jar:1.0-SNAPSHOT
org.apache.maven.shared:maven-shared-model:jar:1.0-SNAPSHOT
from the specified remote repositories:
Nexus (http://localhost:8081/content/groups/public)
at org.apache.maven.artifact.resolver.DefaultArtifactResolver.resolve(DefaultArtifactResolver.java:212)
at org.apache.maven.artifact.resolver.DefaultArtifactResolver.resolve(DefaultArtifactResolver.java:74)
at org.apache.maven.artifact.resolver.DefaultArtifactResolver.resolveTransitively(DefaultArtifactResolver.java:311)
at org.apache.maven.artifact.resolver.DefaultArtifactResolver.resolveTransitively(DefaultArtifactResolver.java:288)
at org.apache.maven.plugin.DefaultPluginManager.resolveTransitiveDependencies(DefaultPluginManager.java:1415)
at org.apache.maven.plugin.DefaultPluginManager.executeMojo(DefaultPluginManager.java:405)
at org.apache.maven.lifecycle.DefaultLifecycleExecutor.executeGoals(DefaultLifecycleExecutor.java:558)
at org.apache.maven.lifecycle.DefaultLifecycleExecutor.executeGoalWithLifecycle(DefaultLifecycleExecutor.java:499)
at org.apache.maven.lifecycle.DefaultLifecycleExecutor.executeGoal(DefaultLifecycleExecutor.java:478)
at org.apache.maven.lifecycle.DefaultLifecycleExecutor.executeGoalAndHandleFailures(DefaultLifecycleExecutor.java:330)
at org.apache.maven.lifecycle.DefaultLifecycleExecutor.executeTaskSegments(DefaultLifecycleExecutor.java:291)
at org.apache.maven.lifecycle.DefaultLifecycleExecutor.execute(DefaultLifecycleExecutor.java:142)
at org.apache.maven.DefaultMaven.doExecute(DefaultMaven.java:336)
at org.apache.maven.DefaultMaven.execute(DefaultMaven.java:129)
at org.apache.maven.cli.MavenCli.main(MavenCli.java:287)
at sun.reflect.NativeMethodAccessorImpl.invoke0(Native Method)
at sun.reflect.NativeMethodAccessorImpl.invoke(NativeMethodAccessorImpl.java:39)
at sun.reflect.DelegatingMethodAccessorImpl.invoke(DelegatingMethodAccessorImpl.java:25)
at java.lang.reflect.Method.invoke(Method.java:585)
at org.codehaus.classworlds.Launcher.launchEnhanced(Launcher.java:315)
at org.codehaus.classworlds.Launcher.launch(Launcher.java:255)
at org.codehaus.classworlds.Launcher.mainWithExitCode(Launcher.java:430)
at org.codehaus.classworlds.Launcher.main(Launcher.java:375)
Caused by: org.apache.maven.wagon.ResourceDoesNotExistException: Unable to download the artifact from any repository
at org.apache.maven.artifact.manager.DefaultWagonManager.getArtifact(DefaultWagonManager.java:331)
at org.apache.maven.artifact.resolver.DefaultArtifactResolver.resolve(DefaultArtifactResolver.java:200)
... 22 more
[INFO] ------------------------------------------------------------------------
[ERROR] BUILD ERROR
[INFO] ------------------------------------------------------------------------
[INFO] Failed to resolve artifact.
Missing:
----------
1) org.apache.maven.shared:maven-shared-model:jar:1.0-SNAPSHOT
Try downloading the file manually from the project website.
Then, install it using the command:
mvn install:install-file -DgroupId=org.apache.maven.shared -DartifactId=maven-shared-model -Dversion=1.0-SNAPSHOT -Dpackaging=jar -Dfile=/path/to/file
Alternatively, if you host your own repository you can deploy the file there:
mvn deploy:deploy-file -DgroupId=org.apache.maven.shared -DartifactId=maven-shared-model -Dversion=1.0-SNAPSHOT -Dpackaging=jar -Dfile=/path/to/file -Durl=[url] -DrepositoryId=[id]
Path to dependency:
1) org.apache.maven:maven-project:jar:2.1-SNAPSHOT
2) org.apache.maven.shared:maven-shared-model:jar:1.0-SNAPSHOT
----------
1 required artifact is missing.
for artifact:
org.apache.maven:maven-project:jar:2.1-SNAPSHOT
from the specified remote repositories:
Nexus (http://localhost:8081/content/groups/public)
[INFO] ------------------------------------------------------------------------
[DEBUG] Trace
org.apache.maven.lifecycle.LifecycleExecutionException: Missing:
----------
1) org.apache.maven.shared:maven-shared-model:jar:1.0-SNAPSHOT
Try downloading the file manually from the project website.
Then, install it using the command:
mvn install:install-file -DgroupId=org.apache.maven.shared -DartifactId=maven-shared-model -Dversion=1.0-SNAPSHOT -Dpackaging=jar -Dfile=/path/to/file
Alternatively, if you host your own repository you can deploy the file there:
mvn deploy:deploy-file -DgroupId=org.apache.maven.shared -DartifactId=maven-shared-model -Dversion=1.0-SNAPSHOT -Dpackaging=jar -Dfile=/path/to/file -Durl=[url] -DrepositoryId=[id]
Path to dependency:
1) org.apache.maven:maven-project:jar:2.1-SNAPSHOT
2) org.apache.maven.shared:maven-shared-model:jar:1.0-SNAPSHOT
----------
1 required artifact is missing.
for artifact:
org.apache.maven:maven-project:jar:2.1-SNAPSHOT
from the specified remote repositories:
Nexus (http://localhost:8081/content/groups/public)
at org.apache.maven.lifecycle.DefaultLifecycleExecutor.executeGoals(DefaultLifecycleExecutor.java:575)
at org.apache.maven.lifecycle.DefaultLifecycleExecutor.executeGoalWithLifecycle(DefaultLifecycleExecutor.java:499)
at org.apache.maven.lifecycle.DefaultLifecycleExecutor.executeGoal(DefaultLifecycleExecutor.java:478)
at org.apache.maven.lifecycle.DefaultLifecycleExecutor.executeGoalAndHandleFailures(DefaultLifecycleExecutor.java:330)
at org.apache.maven.lifecycle.DefaultLifecycleExecutor.executeTaskSegments(DefaultLifecycleExecutor.java:291)
at org.apache.maven.lifecycle.DefaultLifecycleExecutor.execute(DefaultLifecycleExecutor.java:142)
at org.apache.maven.DefaultMaven.doExecute(DefaultMaven.java:336)
at org.apache.maven.DefaultMaven.execute(DefaultMaven.java:129)
at org.apache.maven.cli.MavenCli.main(MavenCli.java:287)
at sun.reflect.NativeMethodAccessorImpl.invoke0(Native Method)
at sun.reflect.NativeMethodAccessorImpl.invoke(NativeMethodAccessorImpl.java:39)
at sun.reflect.DelegatingMethodAccessorImpl.invoke(DelegatingMethodAccessorImpl.java:25)
at java.lang.reflect.Method.invoke(Method.java:585)
at org.codehaus.classworlds.Launcher.launchEnhanced(Launcher.java:315)
at org.codehaus.classworlds.Launcher.launch(Launcher.java:255)
at org.codehaus.classworlds.Launcher.mainWithExitCode(Launcher.java:430)
at org.codehaus.classworlds.Launcher.main(Launcher.java:375)
Caused by: org.apache.maven.artifact.resolver.MultipleArtifactsNotFoundException: Missing:
----------
1) org.apache.maven.shared:maven-shared-model:jar:1.0-SNAPSHOT
Try downloading the file manually from the project website.
Then, install it using the command:
mvn install:install-file -DgroupId=org.apache.maven.shared -DartifactId=maven-shared-model -Dversion=1.0-SNAPSHOT -Dpackaging=jar -Dfile=/path/to/file
Alternatively, if you host your own repository you can deploy the file there:
mvn deploy:deploy-file -DgroupId=org.apache.maven.shared -DartifactId=maven-shared-model -Dversion=1.0-SNAPSHOT -Dpackaging=jar -Dfile=/path/to/file -Durl=[url] -DrepositoryId=[id]
Path to dependency:
1) org.apache.maven:maven-project:jar:2.1-SNAPSHOT
2) org.apache.maven.shared:maven-shared-model:jar:1.0-SNAPSHOT
----------
1 required artifact is missing.
for artifact:
org.apache.maven:maven-project:jar:2.1-SNAPSHOT
from the specified remote repositories:
Nexus (http://localhost:8081/content/groups/public)
at org.apache.maven.artifact.resolver.DefaultArtifactResolver.resolveTransitively(DefaultArtifactResolver.java:324)
at org.apache.maven.artifact.resolver.DefaultArtifactResolver.resolveTransitively(DefaultArtifactResolver.java:288)
at org.apache.maven.plugin.DefaultPluginManager.resolveTransitiveDependencies(DefaultPluginManager.java:1415)
at org.apache.maven.plugin.DefaultPluginManager.executeMojo(DefaultPluginManager.java:405)
at org.apache.maven.lifecycle.DefaultLifecycleExecutor.executeGoals(DefaultLifecycleExecutor.java:558)
... 16 more
[INFO] ------------------------------------------------------------------------
[INFO] Total time: 45 seconds
[INFO] Finished at: Fri Jul 25 11:17:23 CDT 2008
[INFO] Final Memory: 46M/374M
[INFO] ------------------------------------------------------------------------
Hudson build is back to normal: maven-2.1.x #272
Posted by Hudson <Hu...@sonatype.org>.
See http://ci.sonatype.org/job/maven-2.1.x/272/changes
Build failed in Hudson: maven-2.1.x #271
Posted by Hudson <Hu...@sonatype.org>.
See http://ci.sonatype.org/job/maven-2.1.x/271/changes
------------------------------------------
[...truncated 5391 lines...]
[DEBUG] active project artifact:
artifact = org.apache.maven:maven-model:jar:2.1-SNAPSHOT:compile;
project: MavenProject: org.apache.maven:maven-model:2.1-SNAPSHOT @ http://ci.sonatype.org/job/maven-2.1.x/ws/trunk/maven-model/pom.xml (selected for compile)
[DEBUG] org.codehaus.plexus:plexus-utils:jar:1.5.5:compile (selected for compile)
[DEBUG] org.codehaus.plexus:plexus-interpolation:jar:1.1:compile (selected for compile)
[DEBUG] org.apache.maven.artifact:maven-artifact:jar:3.0-SNAPSHOT:compile (selected for compile)
[DEBUG] org.codehaus.plexus:plexus-utils:jar:1.5.1:compile (applying version: 1.5.5)
[DEBUG] org.codehaus.plexus:plexus-container-default:jar:1.0-alpha-44:compile (applying version: 1.0-alpha-48)
[DEBUG] org.apache.maven.wagon:wagon-provider-api:jar:1.0-beta-3:compile (selected for compile)
[DEBUG] org.codehaus.plexus:plexus-utils:jar:1.4.2:compile (applying version: 1.5.5)
[DEBUG] aspectj:aspectjrt:jar:1.5.3:compile (selected for compile)
[DEBUG] org.codehaus.plexus:plexus-container-default:jar:1.0-alpha-48:compile (selected for compile)
[DEBUG] org.codehaus.plexus:plexus-utils:jar:1.4.5:compile (applying version: 1.5.5)
[DEBUG] org.codehaus.plexus:plexus-classworlds:jar:1.2-alpha-13:compile (selected for compile)
[DEBUG] junit:junit:jar:3.8.1:compile (selected for compile)
[DEBUG] org.apache.xbean:xbean-reflect:jar:3.4:compile (selected for compile)
[DEBUG] log4j:log4j:jar:1.2.12:compile (selected for compile)
[DEBUG] commons-logging:commons-logging-api:jar:1.1:compile (selected for compile)
[DEBUG] junit:junit:jar:3.8.1:compile (selected for compile)
[DEBUG] aspectj:aspectjrt:jar:1.5.3:compile (selected for compile)
[DEBUG] Retrieving parent-POM: org.apache.maven.wagon:wagon-providers::1.0-beta-3 for project: null:wagon-file:jar:null from the repository.
[DEBUG] Adding managed dependencies for unknown:wagon-file
[DEBUG] org.apache.maven.wagon:wagon-provider-api:jar:1.0-beta-3
[DEBUG] org.apache.maven.wagon:wagon-provider-test:jar:1.0-beta-3
[DEBUG] org.apache.maven.wagon:wagon-ssh-common-test:jar:1.0-beta-3
[DEBUG] org.apache.maven.wagon:wagon-ssh-common:jar:1.0-beta-3
[DEBUG] junit:junit:jar:3.8.1
[DEBUG] org.codehaus.plexus:plexus-interactivity-api:jar:1.0-alpha-6
[DEBUG] org.codehaus.plexus:plexus-container-default:jar:1.0-alpha-9:test
[DEBUG] org.codehaus.plexus:plexus-utils:jar:1.4.2
[DEBUG] org.apache.maven.wagon:wagon-file:jar:1.0-beta-3:test (selected for test)
[DEBUG] org.codehaus.woodstox:wstx-asl:jar:3.2.6:compile (selected for compile)
[DEBUG] stax:stax-api:jar:1.0.1:compile (selected for compile)
[INFO] snapshot org.apache.maven.shared:maven-shared-model:1.0-SNAPSHOT: checking for updates from central
[DEBUG] repository metadata for: 'snapshot org.apache.maven.shared:maven-shared-model:1.0-SNAPSHOT' could not be found on repository: central
[INFO] snapshot org.apache.maven.shared:maven-shared-model:1.0-SNAPSHOT: checking for updates from apache.snapshots
[DEBUG] repository metadata for: 'snapshot org.apache.maven.shared:maven-shared-model:1.0-SNAPSHOT' could not be found on repository: apache.snapshots
[INFO] snapshot org.apache.maven.shared:maven-shared-model:1.0-SNAPSHOT: checking for updates from codehaus.snapshots
[DEBUG] repository metadata for: 'snapshot org.apache.maven.shared:maven-shared-model:1.0-SNAPSHOT' could not be found on repository: codehaus.snapshots
[DEBUG] maven-shared-model: using locally installed snapshot
[DEBUG] Trying repository central
Downloading: http://localhost:8081/content/groups/public/org/apache/maven/shared/maven-shared-model/1.0-SNAPSHOT/maven-shared-model-1.0-SNAPSHOT.pom
[DEBUG] Unable to get resource 'org.apache.maven.shared:maven-shared-model:pom:1.0-SNAPSHOT' from repository central (http://Nexus)
[DEBUG] Trying repository apache.snapshots
Downloading: http://localhost:8081/content/groups/public/org/apache/maven/shared/maven-shared-model/1.0-SNAPSHOT/maven-shared-model-1.0-SNAPSHOT.pom
[DEBUG] Unable to get resource 'org.apache.maven.shared:maven-shared-model:pom:1.0-SNAPSHOT' from repository apache.snapshots (http://people.apache.org/repo/m2-snapshot-repository/)
[DEBUG] Trying repository codehaus.snapshots
Downloading: http://localhost:8081/content/groups/public/org/apache/maven/shared/maven-shared-model/1.0-SNAPSHOT/maven-shared-model-1.0-SNAPSHOT.pom
[DEBUG] Unable to get resource 'org.apache.maven.shared:maven-shared-model:pom:1.0-SNAPSHOT' from repository codehaus.snapshots (http://snapshots.repository.codehaus.org/)
[DEBUG] Artifact not found - using stub model: Unable to download the artifact from any repository
org.apache.maven.shared:maven-shared-model:pom:1.0-SNAPSHOT
from the specified remote repositories:
Nexus (http://localhost:8081/content/groups/public)
[DEBUG] Using defaults for missing POM org.apache.maven.shared:maven-shared-model:pom:1.0-SNAPSHOT:compile
[DEBUG] org.apache.maven.shared:maven-shared-model:jar:1.0-SNAPSHOT:compile (selected for compile)
[DEBUG] junit:junit:jar:3.8.1:test (not setting scope to: compile; local scope test wins)
[DEBUG] junit:junit:jar:3.8.1:test (selected for test)
[DEBUG] maven-artifact: resolved to version 3.0-20080717.214645-113 from repository codehaus.snapshots
[DEBUG] maven-shared-model: using locally installed snapshot
[DEBUG] Trying repository central
Downloading: http://localhost:8081/content/groups/public/org/apache/maven/shared/maven-shared-model/1.0-SNAPSHOT/maven-shared-model-1.0-SNAPSHOT.jar
[DEBUG] Unable to get resource 'org.apache.maven.shared:maven-shared-model:jar:1.0-SNAPSHOT' from repository central (http://Nexus)
[DEBUG] Trying repository apache.snapshots
Downloading: http://localhost:8081/content/groups/public/org/apache/maven/shared/maven-shared-model/1.0-SNAPSHOT/maven-shared-model-1.0-SNAPSHOT.jar
[DEBUG] Unable to get resource 'org.apache.maven.shared:maven-shared-model:jar:1.0-SNAPSHOT' from repository apache.snapshots (http://people.apache.org/repo/m2-snapshot-repository/)
[DEBUG] Trying repository codehaus.snapshots
Downloading: http://localhost:8081/content/groups/public/org/apache/maven/shared/maven-shared-model/1.0-SNAPSHOT/maven-shared-model-1.0-SNAPSHOT.jar
[DEBUG] Unable to get resource 'org.apache.maven.shared:maven-shared-model:jar:1.0-SNAPSHOT' from repository codehaus.snapshots (http://snapshots.repository.codehaus.org/)
[DEBUG] Unable to download the artifact from any repository
Try downloading the file manually from the project website.
Then, install it using the command:
mvn install:install-file -DgroupId=org.apache.maven.shared -DartifactId=maven-shared-model -Dversion=1.0-SNAPSHOT -Dpackaging=jar -Dfile=/path/to/file
Alternatively, if you host your own repository you can deploy the file there:
mvn deploy:deploy-file -DgroupId=org.apache.maven.shared -DartifactId=maven-shared-model -Dversion=1.0-SNAPSHOT -Dpackaging=jar -Dfile=/path/to/file -Durl=[url] -DrepositoryId=[id]
Path to dependency:
1) org.apache.maven:maven-project:jar:2.1-SNAPSHOT
2) org.apache.maven.shared:maven-shared-model:jar:1.0-SNAPSHOT
org.apache.maven.shared:maven-shared-model:jar:1.0-SNAPSHOT
from the specified remote repositories:
Nexus (http://localhost:8081/content/groups/public)
org.apache.maven.artifact.resolver.ArtifactNotFoundException: Unable to download the artifact from any repository
Try downloading the file manually from the project website.
Then, install it using the command:
mvn install:install-file -DgroupId=org.apache.maven.shared -DartifactId=maven-shared-model -Dversion=1.0-SNAPSHOT -Dpackaging=jar -Dfile=/path/to/file
Alternatively, if you host your own repository you can deploy the file there:
mvn deploy:deploy-file -DgroupId=org.apache.maven.shared -DartifactId=maven-shared-model -Dversion=1.0-SNAPSHOT -Dpackaging=jar -Dfile=/path/to/file -Durl=[url] -DrepositoryId=[id]
Path to dependency:
1) org.apache.maven:maven-project:jar:2.1-SNAPSHOT
2) org.apache.maven.shared:maven-shared-model:jar:1.0-SNAPSHOT
org.apache.maven.shared:maven-shared-model:jar:1.0-SNAPSHOT
from the specified remote repositories:
Nexus (http://localhost:8081/content/groups/public)
at org.apache.maven.artifact.resolver.DefaultArtifactResolver.resolve(DefaultArtifactResolver.java:212)
at org.apache.maven.artifact.resolver.DefaultArtifactResolver.resolve(DefaultArtifactResolver.java:74)
at org.apache.maven.artifact.resolver.DefaultArtifactResolver.resolveTransitively(DefaultArtifactResolver.java:311)
at org.apache.maven.artifact.resolver.DefaultArtifactResolver.resolveTransitively(DefaultArtifactResolver.java:288)
at org.apache.maven.plugin.DefaultPluginManager.resolveTransitiveDependencies(DefaultPluginManager.java:1415)
at org.apache.maven.plugin.DefaultPluginManager.executeMojo(DefaultPluginManager.java:405)
at org.apache.maven.lifecycle.DefaultLifecycleExecutor.executeGoals(DefaultLifecycleExecutor.java:558)
at org.apache.maven.lifecycle.DefaultLifecycleExecutor.executeGoalWithLifecycle(DefaultLifecycleExecutor.java:499)
at org.apache.maven.lifecycle.DefaultLifecycleExecutor.executeGoal(DefaultLifecycleExecutor.java:478)
at org.apache.maven.lifecycle.DefaultLifecycleExecutor.executeGoalAndHandleFailures(DefaultLifecycleExecutor.java:330)
at org.apache.maven.lifecycle.DefaultLifecycleExecutor.executeTaskSegments(DefaultLifecycleExecutor.java:291)
at org.apache.maven.lifecycle.DefaultLifecycleExecutor.execute(DefaultLifecycleExecutor.java:142)
at org.apache.maven.DefaultMaven.doExecute(DefaultMaven.java:336)
at org.apache.maven.DefaultMaven.execute(DefaultMaven.java:129)
at org.apache.maven.cli.MavenCli.main(MavenCli.java:287)
at sun.reflect.NativeMethodAccessorImpl.invoke0(Native Method)
at sun.reflect.NativeMethodAccessorImpl.invoke(NativeMethodAccessorImpl.java:39)
at sun.reflect.DelegatingMethodAccessorImpl.invoke(DelegatingMethodAccessorImpl.java:25)
at java.lang.reflect.Method.invoke(Method.java:585)
at org.codehaus.classworlds.Launcher.launchEnhanced(Launcher.java:315)
at org.codehaus.classworlds.Launcher.launch(Launcher.java:255)
at org.codehaus.classworlds.Launcher.mainWithExitCode(Launcher.java:430)
at org.codehaus.classworlds.Launcher.main(Launcher.java:375)
Caused by: org.apache.maven.wagon.ResourceDoesNotExistException: Unable to download the artifact from any repository
at org.apache.maven.artifact.manager.DefaultWagonManager.getArtifact(DefaultWagonManager.java:331)
at org.apache.maven.artifact.resolver.DefaultArtifactResolver.resolve(DefaultArtifactResolver.java:200)
... 22 more
[INFO] ------------------------------------------------------------------------
[ERROR] BUILD ERROR
[INFO] ------------------------------------------------------------------------
[INFO] Failed to resolve artifact.
Missing:
----------
1) org.apache.maven.shared:maven-shared-model:jar:1.0-SNAPSHOT
Try downloading the file manually from the project website.
Then, install it using the command:
mvn install:install-file -DgroupId=org.apache.maven.shared -DartifactId=maven-shared-model -Dversion=1.0-SNAPSHOT -Dpackaging=jar -Dfile=/path/to/file
Alternatively, if you host your own repository you can deploy the file there:
mvn deploy:deploy-file -DgroupId=org.apache.maven.shared -DartifactId=maven-shared-model -Dversion=1.0-SNAPSHOT -Dpackaging=jar -Dfile=/path/to/file -Durl=[url] -DrepositoryId=[id]
Path to dependency:
1) org.apache.maven:maven-project:jar:2.1-SNAPSHOT
2) org.apache.maven.shared:maven-shared-model:jar:1.0-SNAPSHOT
----------
1 required artifact is missing.
for artifact:
org.apache.maven:maven-project:jar:2.1-SNAPSHOT
from the specified remote repositories:
Nexus (http://localhost:8081/content/groups/public)
[INFO] ------------------------------------------------------------------------
[DEBUG] Trace
org.apache.maven.lifecycle.LifecycleExecutionException: Missing:
----------
1) org.apache.maven.shared:maven-shared-model:jar:1.0-SNAPSHOT
Try downloading the file manually from the project website.
Then, install it using the command:
mvn install:install-file -DgroupId=org.apache.maven.shared -DartifactId=maven-shared-model -Dversion=1.0-SNAPSHOT -Dpackaging=jar -Dfile=/path/to/file
Alternatively, if you host your own repository you can deploy the file there:
mvn deploy:deploy-file -DgroupId=org.apache.maven.shared -DartifactId=maven-shared-model -Dversion=1.0-SNAPSHOT -Dpackaging=jar -Dfile=/path/to/file -Durl=[url] -DrepositoryId=[id]
Path to dependency:
1) org.apache.maven:maven-project:jar:2.1-SNAPSHOT
2) org.apache.maven.shared:maven-shared-model:jar:1.0-SNAPSHOT
----------
1 required artifact is missing.
for artifact:
org.apache.maven:maven-project:jar:2.1-SNAPSHOT
from the specified remote repositories:
Nexus (http://localhost:8081/content/groups/public)
at org.apache.maven.lifecycle.DefaultLifecycleExecutor.executeGoals(DefaultLifecycleExecutor.java:575)
at org.apache.maven.lifecycle.DefaultLifecycleExecutor.executeGoalWithLifecycle(DefaultLifecycleExecutor.java:499)
at org.apache.maven.lifecycle.DefaultLifecycleExecutor.executeGoal(DefaultLifecycleExecutor.java:478)
at org.apache.maven.lifecycle.DefaultLifecycleExecutor.executeGoalAndHandleFailures(DefaultLifecycleExecutor.java:330)
at org.apache.maven.lifecycle.DefaultLifecycleExecutor.executeTaskSegments(DefaultLifecycleExecutor.java:291)
at org.apache.maven.lifecycle.DefaultLifecycleExecutor.execute(DefaultLifecycleExecutor.java:142)
at org.apache.maven.DefaultMaven.doExecute(DefaultMaven.java:336)
at org.apache.maven.DefaultMaven.execute(DefaultMaven.java:129)
at org.apache.maven.cli.MavenCli.main(MavenCli.java:287)
at sun.reflect.NativeMethodAccessorImpl.invoke0(Native Method)
at sun.reflect.NativeMethodAccessorImpl.invoke(NativeMethodAccessorImpl.java:39)
at sun.reflect.DelegatingMethodAccessorImpl.invoke(DelegatingMethodAccessorImpl.java:25)
at java.lang.reflect.Method.invoke(Method.java:585)
at org.codehaus.classworlds.Launcher.launchEnhanced(Launcher.java:315)
at org.codehaus.classworlds.Launcher.launch(Launcher.java:255)
at org.codehaus.classworlds.Launcher.mainWithExitCode(Launcher.java:430)
at org.codehaus.classworlds.Launcher.main(Launcher.java:375)
Caused by: org.apache.maven.artifact.resolver.MultipleArtifactsNotFoundException: Missing:
----------
1) org.apache.maven.shared:maven-shared-model:jar:1.0-SNAPSHOT
Try downloading the file manually from the project website.
Then, install it using the command:
mvn install:install-file -DgroupId=org.apache.maven.shared -DartifactId=maven-shared-model -Dversion=1.0-SNAPSHOT -Dpackaging=jar -Dfile=/path/to/file
Alternatively, if you host your own repository you can deploy the file there:
mvn deploy:deploy-file -DgroupId=org.apache.maven.shared -DartifactId=maven-shared-model -Dversion=1.0-SNAPSHOT -Dpackaging=jar -Dfile=/path/to/file -Durl=[url] -DrepositoryId=[id]
Path to dependency:
1) org.apache.maven:maven-project:jar:2.1-SNAPSHOT
2) org.apache.maven.shared:maven-shared-model:jar:1.0-SNAPSHOT
----------
1 required artifact is missing.
for artifact:
org.apache.maven:maven-project:jar:2.1-SNAPSHOT
from the specified remote repositories:
Nexus (http://localhost:8081/content/groups/public)
at org.apache.maven.artifact.resolver.DefaultArtifactResolver.resolveTransitively(DefaultArtifactResolver.java:324)
at org.apache.maven.artifact.resolver.DefaultArtifactResolver.resolveTransitively(DefaultArtifactResolver.java:288)
at org.apache.maven.plugin.DefaultPluginManager.resolveTransitiveDependencies(DefaultPluginManager.java:1415)
at org.apache.maven.plugin.DefaultPluginManager.executeMojo(DefaultPluginManager.java:405)
at org.apache.maven.lifecycle.DefaultLifecycleExecutor.executeGoals(DefaultLifecycleExecutor.java:558)
... 16 more
[INFO] ------------------------------------------------------------------------
[INFO] Total time: 26 seconds
[INFO] Finished at: Sat Jul 26 03:02:51 CDT 2008
[INFO] Final Memory: 47M/424M
[INFO] ------------------------------------------------------------------------
Build failed in Hudson: maven-2.1.x #270
Posted by Hudson <Hu...@sonatype.org>.
See http://ci.sonatype.org/job/maven-2.1.x/270/changes
------------------------------------------
[...truncated 6742 lines...]
from the specified remote repositories:
Nexus (http://localhost:8081/content/groups/public)
[DEBUG] Using defaults for missing POM org.apache.maven.shared:maven-shared-model:pom:1.0-SNAPSHOT:compile
[DEBUG] org.apache.maven.shared:maven-shared-model:jar:1.0-SNAPSHOT:compile (selected for compile)
[DEBUG] junit:junit:jar:3.8.1:test (not setting scope to: compile; local scope test wins)
[DEBUG] junit:junit:jar:3.8.1:test (selected for test)
[DEBUG] Trying repository central
Downloading: http://localhost:8081/content/groups/public/org/codehaus/plexus/plexus-interpolation/1.1/plexus-interpolation-1.1.jar
34K downloaded
[DEBUG] Artifact resolved
[DEBUG] maven-artifact: resolved to version 3.0-20080717.214645-113 from repository codehaus.snapshots
[DEBUG] Trying repository central
Downloading: http://localhost:8081/content/groups/public/org/apache/maven/wagon/wagon-file/1.0-beta-3/wagon-file-1.0-beta-3.jar
9K downloaded
[DEBUG] Artifact resolved
[DEBUG] Trying repository central
Downloading: http://localhost:8081/content/groups/public/org/codehaus/woodstox/wstx-asl/3.2.6/wstx-asl-3.2.6.jar
508K downloaded
[DEBUG] SHA1 not found, trying MD5
org.apache.maven.wagon.ResourceDoesNotExistException: Unable to locate resource in repository
at org.apache.maven.wagon.providers.http.LightweightHttpWagon.fillInputData(LightweightHttpWagon.java:100)
at org.apache.maven.wagon.StreamWagon.get(StreamWagon.java:68)
at org.apache.maven.artifact.manager.DefaultWagonManager.verifyChecksum(DefaultWagonManager.java:654)
at org.apache.maven.artifact.manager.DefaultWagonManager.getRemoteFile(DefaultWagonManager.java:485)
at org.apache.maven.artifact.manager.DefaultWagonManager.getArtifact(DefaultWagonManager.java:354)
at org.apache.maven.artifact.manager.DefaultWagonManager.getArtifact(DefaultWagonManager.java:309)
at org.apache.maven.artifact.resolver.DefaultArtifactResolver.resolve(DefaultArtifactResolver.java:200)
at org.apache.maven.artifact.resolver.DefaultArtifactResolver.resolve(DefaultArtifactResolver.java:74)
at org.apache.maven.artifact.resolver.DefaultArtifactResolver.resolveTransitively(DefaultArtifactResolver.java:311)
at org.apache.maven.artifact.resolver.DefaultArtifactResolver.resolveTransitively(DefaultArtifactResolver.java:288)
at org.apache.maven.plugin.DefaultPluginManager.resolveTransitiveDependencies(DefaultPluginManager.java:1415)
at org.apache.maven.plugin.DefaultPluginManager.executeMojo(DefaultPluginManager.java:405)
at org.apache.maven.lifecycle.DefaultLifecycleExecutor.executeGoals(DefaultLifecycleExecutor.java:558)
at org.apache.maven.lifecycle.DefaultLifecycleExecutor.executeGoalWithLifecycle(DefaultLifecycleExecutor.java:499)
at org.apache.maven.lifecycle.DefaultLifecycleExecutor.executeGoal(DefaultLifecycleExecutor.java:478)
at org.apache.maven.lifecycle.DefaultLifecycleExecutor.executeGoalAndHandleFailures(DefaultLifecycleExecutor.java:330)
at org.apache.maven.lifecycle.DefaultLifecycleExecutor.executeTaskSegments(DefaultLifecycleExecutor.java:291)
at org.apache.maven.lifecycle.DefaultLifecycleExecutor.execute(DefaultLifecycleExecutor.java:142)
at org.apache.maven.DefaultMaven.doExecute(DefaultMaven.java:336)
at org.apache.maven.DefaultMaven.execute(DefaultMaven.java:129)
at org.apache.maven.cli.MavenCli.main(MavenCli.java:287)
at sun.reflect.NativeMethodAccessorImpl.invoke0(Native Method)
at sun.reflect.NativeMethodAccessorImpl.invoke(NativeMethodAccessorImpl.java:39)
at sun.reflect.DelegatingMethodAccessorImpl.invoke(DelegatingMethodAccessorImpl.java:25)
at java.lang.reflect.Method.invoke(Method.java:585)
at org.codehaus.classworlds.Launcher.launchEnhanced(Launcher.java:315)
at org.codehaus.classworlds.Launcher.launch(Launcher.java:255)
at org.codehaus.classworlds.Launcher.mainWithExitCode(Launcher.java:430)
at org.codehaus.classworlds.Launcher.main(Launcher.java:375)
Caused by: java.io.FileNotFoundException: http://localhost:8081/content/groups/public/org/codehaus/woodstox/wstx-asl/3.2.6/wstx-asl-3.2.6.jar.sha1
at sun.net.www.protocol.http.HttpURLConnection.getInputStream(HttpURLConnection.java:1168)
at org.apache.maven.wagon.providers.http.LightweightHttpWagon.fillInputData(LightweightHttpWagon.java:83)
... 28 more
[WARNING] *** CHECKSUM FAILED - Error retrieving checksum file for org/codehaus/woodstox/wstx-asl/3.2.6/wstx-asl-3.2.6.jar - IGNORING
[DEBUG] Artifact resolved
[DEBUG] Trying repository central
Downloading: http://localhost:8081/content/groups/public/stax/stax-api/1.0.1/stax-api-1.0.1.jar
25K downloaded
[DEBUG] Artifact resolved
[DEBUG] maven-shared-model: using locally installed snapshot
[DEBUG] Trying repository central
Downloading: http://localhost:8081/content/groups/public/org/apache/maven/shared/maven-shared-model/1.0-SNAPSHOT/maven-shared-model-1.0-SNAPSHOT.jar
[DEBUG] Unable to get resource 'org.apache.maven.shared:maven-shared-model:jar:1.0-SNAPSHOT' from repository central (http://Nexus)
[DEBUG] Trying repository apache.snapshots
Downloading: http://localhost:8081/content/groups/public/org/apache/maven/shared/maven-shared-model/1.0-SNAPSHOT/maven-shared-model-1.0-SNAPSHOT.jar
[DEBUG] Unable to get resource 'org.apache.maven.shared:maven-shared-model:jar:1.0-SNAPSHOT' from repository apache.snapshots (http://people.apache.org/repo/m2-snapshot-repository/)
[DEBUG] Trying repository codehaus.snapshots
Downloading: http://localhost:8081/content/groups/public/org/apache/maven/shared/maven-shared-model/1.0-SNAPSHOT/maven-shared-model-1.0-SNAPSHOT.jar
[DEBUG] Unable to get resource 'org.apache.maven.shared:maven-shared-model:jar:1.0-SNAPSHOT' from repository codehaus.snapshots (http://snapshots.repository.codehaus.org/)
[DEBUG] Unable to download the artifact from any repository
Try downloading the file manually from the project website.
Then, install it using the command:
mvn install:install-file -DgroupId=org.apache.maven.shared -DartifactId=maven-shared-model -Dversion=1.0-SNAPSHOT -Dpackaging=jar -Dfile=/path/to/file
Alternatively, if you host your own repository you can deploy the file there:
mvn deploy:deploy-file -DgroupId=org.apache.maven.shared -DartifactId=maven-shared-model -Dversion=1.0-SNAPSHOT -Dpackaging=jar -Dfile=/path/to/file -Durl=[url] -DrepositoryId=[id]
Path to dependency:
1) org.apache.maven:maven-project:jar:2.1-SNAPSHOT
2) org.apache.maven.shared:maven-shared-model:jar:1.0-SNAPSHOT
org.apache.maven.shared:maven-shared-model:jar:1.0-SNAPSHOT
from the specified remote repositories:
Nexus (http://localhost:8081/content/groups/public)
org.apache.maven.artifact.resolver.ArtifactNotFoundException: Unable to download the artifact from any repository
Try downloading the file manually from the project website.
Then, install it using the command:
mvn install:install-file -DgroupId=org.apache.maven.shared -DartifactId=maven-shared-model -Dversion=1.0-SNAPSHOT -Dpackaging=jar -Dfile=/path/to/file
Alternatively, if you host your own repository you can deploy the file there:
mvn deploy:deploy-file -DgroupId=org.apache.maven.shared -DartifactId=maven-shared-model -Dversion=1.0-SNAPSHOT -Dpackaging=jar -Dfile=/path/to/file -Durl=[url] -DrepositoryId=[id]
Path to dependency:
1) org.apache.maven:maven-project:jar:2.1-SNAPSHOT
2) org.apache.maven.shared:maven-shared-model:jar:1.0-SNAPSHOT
org.apache.maven.shared:maven-shared-model:jar:1.0-SNAPSHOT
from the specified remote repositories:
Nexus (http://localhost:8081/content/groups/public)
at org.apache.maven.artifact.resolver.DefaultArtifactResolver.resolve(DefaultArtifactResolver.java:212)
at org.apache.maven.artifact.resolver.DefaultArtifactResolver.resolve(DefaultArtifactResolver.java:74)
at org.apache.maven.artifact.resolver.DefaultArtifactResolver.resolveTransitively(DefaultArtifactResolver.java:311)
at org.apache.maven.artifact.resolver.DefaultArtifactResolver.resolveTransitively(DefaultArtifactResolver.java:288)
at org.apache.maven.plugin.DefaultPluginManager.resolveTransitiveDependencies(DefaultPluginManager.java:1415)
at org.apache.maven.plugin.DefaultPluginManager.executeMojo(DefaultPluginManager.java:405)
at org.apache.maven.lifecycle.DefaultLifecycleExecutor.executeGoals(DefaultLifecycleExecutor.java:558)
at org.apache.maven.lifecycle.DefaultLifecycleExecutor.executeGoalWithLifecycle(DefaultLifecycleExecutor.java:499)
at org.apache.maven.lifecycle.DefaultLifecycleExecutor.executeGoal(DefaultLifecycleExecutor.java:478)
at org.apache.maven.lifecycle.DefaultLifecycleExecutor.executeGoalAndHandleFailures(DefaultLifecycleExecutor.java:330)
at org.apache.maven.lifecycle.DefaultLifecycleExecutor.executeTaskSegments(DefaultLifecycleExecutor.java:291)
at org.apache.maven.lifecycle.DefaultLifecycleExecutor.execute(DefaultLifecycleExecutor.java:142)
at org.apache.maven.DefaultMaven.doExecute(DefaultMaven.java:336)
at org.apache.maven.DefaultMaven.execute(DefaultMaven.java:129)
at org.apache.maven.cli.MavenCli.main(MavenCli.java:287)
at sun.reflect.NativeMethodAccessorImpl.invoke0(Native Method)
at sun.reflect.NativeMethodAccessorImpl.invoke(NativeMethodAccessorImpl.java:39)
at sun.reflect.DelegatingMethodAccessorImpl.invoke(DelegatingMethodAccessorImpl.java:25)
at java.lang.reflect.Method.invoke(Method.java:585)
at org.codehaus.classworlds.Launcher.launchEnhanced(Launcher.java:315)
at org.codehaus.classworlds.Launcher.launch(Launcher.java:255)
at org.codehaus.classworlds.Launcher.mainWithExitCode(Launcher.java:430)
at org.codehaus.classworlds.Launcher.main(Launcher.java:375)
Caused by: org.apache.maven.wagon.ResourceDoesNotExistException: Unable to download the artifact from any repository
at org.apache.maven.artifact.manager.DefaultWagonManager.getArtifact(DefaultWagonManager.java:331)
at org.apache.maven.artifact.resolver.DefaultArtifactResolver.resolve(DefaultArtifactResolver.java:200)
... 22 more
[INFO] ------------------------------------------------------------------------
[ERROR] BUILD ERROR
[INFO] ------------------------------------------------------------------------
[INFO] Failed to resolve artifact.
Missing:
----------
1) org.apache.maven.shared:maven-shared-model:jar:1.0-SNAPSHOT
Try downloading the file manually from the project website.
Then, install it using the command:
mvn install:install-file -DgroupId=org.apache.maven.shared -DartifactId=maven-shared-model -Dversion=1.0-SNAPSHOT -Dpackaging=jar -Dfile=/path/to/file
Alternatively, if you host your own repository you can deploy the file there:
mvn deploy:deploy-file -DgroupId=org.apache.maven.shared -DartifactId=maven-shared-model -Dversion=1.0-SNAPSHOT -Dpackaging=jar -Dfile=/path/to/file -Durl=[url] -DrepositoryId=[id]
Path to dependency:
1) org.apache.maven:maven-project:jar:2.1-SNAPSHOT
2) org.apache.maven.shared:maven-shared-model:jar:1.0-SNAPSHOT
----------
1 required artifact is missing.
for artifact:
org.apache.maven:maven-project:jar:2.1-SNAPSHOT
from the specified remote repositories:
Nexus (http://localhost:8081/content/groups/public)
[INFO] ------------------------------------------------------------------------
[DEBUG] Trace
org.apache.maven.lifecycle.LifecycleExecutionException: Missing:
----------
1) org.apache.maven.shared:maven-shared-model:jar:1.0-SNAPSHOT
Try downloading the file manually from the project website.
Then, install it using the command:
mvn install:install-file -DgroupId=org.apache.maven.shared -DartifactId=maven-shared-model -Dversion=1.0-SNAPSHOT -Dpackaging=jar -Dfile=/path/to/file
Alternatively, if you host your own repository you can deploy the file there:
mvn deploy:deploy-file -DgroupId=org.apache.maven.shared -DartifactId=maven-shared-model -Dversion=1.0-SNAPSHOT -Dpackaging=jar -Dfile=/path/to/file -Durl=[url] -DrepositoryId=[id]
Path to dependency:
1) org.apache.maven:maven-project:jar:2.1-SNAPSHOT
2) org.apache.maven.shared:maven-shared-model:jar:1.0-SNAPSHOT
----------
1 required artifact is missing.
for artifact:
org.apache.maven:maven-project:jar:2.1-SNAPSHOT
from the specified remote repositories:
Nexus (http://localhost:8081/content/groups/public)
at org.apache.maven.lifecycle.DefaultLifecycleExecutor.executeGoals(DefaultLifecycleExecutor.java:575)
at org.apache.maven.lifecycle.DefaultLifecycleExecutor.executeGoalWithLifecycle(DefaultLifecycleExecutor.java:499)
at org.apache.maven.lifecycle.DefaultLifecycleExecutor.executeGoal(DefaultLifecycleExecutor.java:478)
at org.apache.maven.lifecycle.DefaultLifecycleExecutor.executeGoalAndHandleFailures(DefaultLifecycleExecutor.java:330)
at org.apache.maven.lifecycle.DefaultLifecycleExecutor.executeTaskSegments(DefaultLifecycleExecutor.java:291)
at org.apache.maven.lifecycle.DefaultLifecycleExecutor.execute(DefaultLifecycleExecutor.java:142)
at org.apache.maven.DefaultMaven.doExecute(DefaultMaven.java:336)
at org.apache.maven.DefaultMaven.execute(DefaultMaven.java:129)
at org.apache.maven.cli.MavenCli.main(MavenCli.java:287)
at sun.reflect.NativeMethodAccessorImpl.invoke0(Native Method)
at sun.reflect.NativeMethodAccessorImpl.invoke(NativeMethodAccessorImpl.java:39)
at sun.reflect.DelegatingMethodAccessorImpl.invoke(DelegatingMethodAccessorImpl.java:25)
at java.lang.reflect.Method.invoke(Method.java:585)
at org.codehaus.classworlds.Launcher.launchEnhanced(Launcher.java:315)
at org.codehaus.classworlds.Launcher.launch(Launcher.java:255)
at org.codehaus.classworlds.Launcher.mainWithExitCode(Launcher.java:430)
at org.codehaus.classworlds.Launcher.main(Launcher.java:375)
Caused by: org.apache.maven.artifact.resolver.MultipleArtifactsNotFoundException: Missing:
----------
1) org.apache.maven.shared:maven-shared-model:jar:1.0-SNAPSHOT
Try downloading the file manually from the project website.
Then, install it using the command:
mvn install:install-file -DgroupId=org.apache.maven.shared -DartifactId=maven-shared-model -Dversion=1.0-SNAPSHOT -Dpackaging=jar -Dfile=/path/to/file
Alternatively, if you host your own repository you can deploy the file there:
mvn deploy:deploy-file -DgroupId=org.apache.maven.shared -DartifactId=maven-shared-model -Dversion=1.0-SNAPSHOT -Dpackaging=jar -Dfile=/path/to/file -Durl=[url] -DrepositoryId=[id]
Path to dependency:
1) org.apache.maven:maven-project:jar:2.1-SNAPSHOT
2) org.apache.maven.shared:maven-shared-model:jar:1.0-SNAPSHOT
----------
1 required artifact is missing.
for artifact:
org.apache.maven:maven-project:jar:2.1-SNAPSHOT
from the specified remote repositories:
Nexus (http://localhost:8081/content/groups/public)
at org.apache.maven.artifact.resolver.DefaultArtifactResolver.resolveTransitively(DefaultArtifactResolver.java:324)
at org.apache.maven.artifact.resolver.DefaultArtifactResolver.resolveTransitively(DefaultArtifactResolver.java:288)
at org.apache.maven.plugin.DefaultPluginManager.resolveTransitiveDependencies(DefaultPluginManager.java:1415)
at org.apache.maven.plugin.DefaultPluginManager.executeMojo(DefaultPluginManager.java:405)
at org.apache.maven.lifecycle.DefaultLifecycleExecutor.executeGoals(DefaultLifecycleExecutor.java:558)
... 16 more
[INFO] ------------------------------------------------------------------------
[INFO] Total time: 1 minute 10 seconds
[INFO] Finished at: Sat Jul 26 01:06:26 CDT 2008
[INFO] Final Memory: 47M/419M
[INFO] ------------------------------------------------------------------------
Build failed in Hudson: maven-2.1.x #269
Posted by Hudson <Hu...@sonatype.org>.
See http://ci.sonatype.org/job/maven-2.1.x/269/changes
------------------------------------------
[...truncated 5391 lines...]
[DEBUG] active project artifact:
artifact = org.apache.maven:maven-model:jar:2.1-SNAPSHOT:compile;
project: MavenProject: org.apache.maven:maven-model:2.1-SNAPSHOT @ http://ci.sonatype.org/job/maven-2.1.x/ws/trunk/maven-model/pom.xml (selected for compile)
[DEBUG] org.codehaus.plexus:plexus-utils:jar:1.5.5:compile (selected for compile)
[DEBUG] org.codehaus.plexus:plexus-interpolation:jar:1.1:compile (selected for compile)
[DEBUG] org.apache.maven.artifact:maven-artifact:jar:3.0-SNAPSHOT:compile (selected for compile)
[DEBUG] org.codehaus.plexus:plexus-utils:jar:1.5.1:compile (applying version: 1.5.5)
[DEBUG] org.codehaus.plexus:plexus-container-default:jar:1.0-alpha-44:compile (applying version: 1.0-alpha-48)
[DEBUG] org.apache.maven.wagon:wagon-provider-api:jar:1.0-beta-3:compile (selected for compile)
[DEBUG] org.codehaus.plexus:plexus-utils:jar:1.4.2:compile (applying version: 1.5.5)
[DEBUG] aspectj:aspectjrt:jar:1.5.3:compile (selected for compile)
[DEBUG] org.codehaus.plexus:plexus-container-default:jar:1.0-alpha-48:compile (selected for compile)
[DEBUG] org.codehaus.plexus:plexus-utils:jar:1.4.5:compile (applying version: 1.5.5)
[DEBUG] org.codehaus.plexus:plexus-classworlds:jar:1.2-alpha-13:compile (selected for compile)
[DEBUG] junit:junit:jar:3.8.1:compile (selected for compile)
[DEBUG] org.apache.xbean:xbean-reflect:jar:3.4:compile (selected for compile)
[DEBUG] log4j:log4j:jar:1.2.12:compile (selected for compile)
[DEBUG] commons-logging:commons-logging-api:jar:1.1:compile (selected for compile)
[DEBUG] junit:junit:jar:3.8.1:compile (selected for compile)
[DEBUG] aspectj:aspectjrt:jar:1.5.3:compile (selected for compile)
[DEBUG] Retrieving parent-POM: org.apache.maven.wagon:wagon-providers::1.0-beta-3 for project: null:wagon-file:jar:null from the repository.
[DEBUG] Adding managed dependencies for unknown:wagon-file
[DEBUG] org.apache.maven.wagon:wagon-provider-api:jar:1.0-beta-3
[DEBUG] org.apache.maven.wagon:wagon-provider-test:jar:1.0-beta-3
[DEBUG] org.apache.maven.wagon:wagon-ssh-common-test:jar:1.0-beta-3
[DEBUG] org.apache.maven.wagon:wagon-ssh-common:jar:1.0-beta-3
[DEBUG] junit:junit:jar:3.8.1
[DEBUG] org.codehaus.plexus:plexus-interactivity-api:jar:1.0-alpha-6
[DEBUG] org.codehaus.plexus:plexus-container-default:jar:1.0-alpha-9:test
[DEBUG] org.codehaus.plexus:plexus-utils:jar:1.4.2
[DEBUG] org.apache.maven.wagon:wagon-file:jar:1.0-beta-3:test (selected for test)
[DEBUG] org.codehaus.woodstox:wstx-asl:jar:3.2.6:compile (selected for compile)
[DEBUG] stax:stax-api:jar:1.0.1:compile (selected for compile)
[INFO] snapshot org.apache.maven.shared:maven-shared-model:1.0-SNAPSHOT: checking for updates from central
[DEBUG] repository metadata for: 'snapshot org.apache.maven.shared:maven-shared-model:1.0-SNAPSHOT' could not be found on repository: central
[INFO] snapshot org.apache.maven.shared:maven-shared-model:1.0-SNAPSHOT: checking for updates from apache.snapshots
[DEBUG] repository metadata for: 'snapshot org.apache.maven.shared:maven-shared-model:1.0-SNAPSHOT' could not be found on repository: apache.snapshots
[INFO] snapshot org.apache.maven.shared:maven-shared-model:1.0-SNAPSHOT: checking for updates from codehaus.snapshots
[DEBUG] repository metadata for: 'snapshot org.apache.maven.shared:maven-shared-model:1.0-SNAPSHOT' could not be found on repository: codehaus.snapshots
[DEBUG] maven-shared-model: using locally installed snapshot
[DEBUG] Trying repository central
Downloading: http://localhost:8081/content/groups/public/org/apache/maven/shared/maven-shared-model/1.0-SNAPSHOT/maven-shared-model-1.0-SNAPSHOT.pom
[DEBUG] Unable to get resource 'org.apache.maven.shared:maven-shared-model:pom:1.0-SNAPSHOT' from repository central (http://Nexus)
[DEBUG] Trying repository apache.snapshots
Downloading: http://localhost:8081/content/groups/public/org/apache/maven/shared/maven-shared-model/1.0-SNAPSHOT/maven-shared-model-1.0-SNAPSHOT.pom
[DEBUG] Unable to get resource 'org.apache.maven.shared:maven-shared-model:pom:1.0-SNAPSHOT' from repository apache.snapshots (http://people.apache.org/repo/m2-snapshot-repository/)
[DEBUG] Trying repository codehaus.snapshots
Downloading: http://localhost:8081/content/groups/public/org/apache/maven/shared/maven-shared-model/1.0-SNAPSHOT/maven-shared-model-1.0-SNAPSHOT.pom
[DEBUG] Unable to get resource 'org.apache.maven.shared:maven-shared-model:pom:1.0-SNAPSHOT' from repository codehaus.snapshots (http://snapshots.repository.codehaus.org/)
[DEBUG] Artifact not found - using stub model: Unable to download the artifact from any repository
org.apache.maven.shared:maven-shared-model:pom:1.0-SNAPSHOT
from the specified remote repositories:
Nexus (http://localhost:8081/content/groups/public)
[DEBUG] Using defaults for missing POM org.apache.maven.shared:maven-shared-model:pom:1.0-SNAPSHOT:compile
[DEBUG] org.apache.maven.shared:maven-shared-model:jar:1.0-SNAPSHOT:compile (selected for compile)
[DEBUG] junit:junit:jar:3.8.1:test (not setting scope to: compile; local scope test wins)
[DEBUG] junit:junit:jar:3.8.1:test (selected for test)
[DEBUG] maven-artifact: resolved to version 3.0-20080717.214645-113 from repository codehaus.snapshots
[DEBUG] maven-shared-model: using locally installed snapshot
[DEBUG] Trying repository central
Downloading: http://localhost:8081/content/groups/public/org/apache/maven/shared/maven-shared-model/1.0-SNAPSHOT/maven-shared-model-1.0-SNAPSHOT.jar
[DEBUG] Unable to get resource 'org.apache.maven.shared:maven-shared-model:jar:1.0-SNAPSHOT' from repository central (http://Nexus)
[DEBUG] Trying repository apache.snapshots
Downloading: http://localhost:8081/content/groups/public/org/apache/maven/shared/maven-shared-model/1.0-SNAPSHOT/maven-shared-model-1.0-SNAPSHOT.jar
[DEBUG] Unable to get resource 'org.apache.maven.shared:maven-shared-model:jar:1.0-SNAPSHOT' from repository apache.snapshots (http://people.apache.org/repo/m2-snapshot-repository/)
[DEBUG] Trying repository codehaus.snapshots
Downloading: http://localhost:8081/content/groups/public/org/apache/maven/shared/maven-shared-model/1.0-SNAPSHOT/maven-shared-model-1.0-SNAPSHOT.jar
[DEBUG] Unable to get resource 'org.apache.maven.shared:maven-shared-model:jar:1.0-SNAPSHOT' from repository codehaus.snapshots (http://snapshots.repository.codehaus.org/)
[DEBUG] Unable to download the artifact from any repository
Try downloading the file manually from the project website.
Then, install it using the command:
mvn install:install-file -DgroupId=org.apache.maven.shared -DartifactId=maven-shared-model -Dversion=1.0-SNAPSHOT -Dpackaging=jar -Dfile=/path/to/file
Alternatively, if you host your own repository you can deploy the file there:
mvn deploy:deploy-file -DgroupId=org.apache.maven.shared -DartifactId=maven-shared-model -Dversion=1.0-SNAPSHOT -Dpackaging=jar -Dfile=/path/to/file -Durl=[url] -DrepositoryId=[id]
Path to dependency:
1) org.apache.maven:maven-project:jar:2.1-SNAPSHOT
2) org.apache.maven.shared:maven-shared-model:jar:1.0-SNAPSHOT
org.apache.maven.shared:maven-shared-model:jar:1.0-SNAPSHOT
from the specified remote repositories:
Nexus (http://localhost:8081/content/groups/public)
org.apache.maven.artifact.resolver.ArtifactNotFoundException: Unable to download the artifact from any repository
Try downloading the file manually from the project website.
Then, install it using the command:
mvn install:install-file -DgroupId=org.apache.maven.shared -DartifactId=maven-shared-model -Dversion=1.0-SNAPSHOT -Dpackaging=jar -Dfile=/path/to/file
Alternatively, if you host your own repository you can deploy the file there:
mvn deploy:deploy-file -DgroupId=org.apache.maven.shared -DartifactId=maven-shared-model -Dversion=1.0-SNAPSHOT -Dpackaging=jar -Dfile=/path/to/file -Durl=[url] -DrepositoryId=[id]
Path to dependency:
1) org.apache.maven:maven-project:jar:2.1-SNAPSHOT
2) org.apache.maven.shared:maven-shared-model:jar:1.0-SNAPSHOT
org.apache.maven.shared:maven-shared-model:jar:1.0-SNAPSHOT
from the specified remote repositories:
Nexus (http://localhost:8081/content/groups/public)
at org.apache.maven.artifact.resolver.DefaultArtifactResolver.resolve(DefaultArtifactResolver.java:212)
at org.apache.maven.artifact.resolver.DefaultArtifactResolver.resolve(DefaultArtifactResolver.java:74)
at org.apache.maven.artifact.resolver.DefaultArtifactResolver.resolveTransitively(DefaultArtifactResolver.java:311)
at org.apache.maven.artifact.resolver.DefaultArtifactResolver.resolveTransitively(DefaultArtifactResolver.java:288)
at org.apache.maven.plugin.DefaultPluginManager.resolveTransitiveDependencies(DefaultPluginManager.java:1415)
at org.apache.maven.plugin.DefaultPluginManager.executeMojo(DefaultPluginManager.java:405)
at org.apache.maven.lifecycle.DefaultLifecycleExecutor.executeGoals(DefaultLifecycleExecutor.java:558)
at org.apache.maven.lifecycle.DefaultLifecycleExecutor.executeGoalWithLifecycle(DefaultLifecycleExecutor.java:499)
at org.apache.maven.lifecycle.DefaultLifecycleExecutor.executeGoal(DefaultLifecycleExecutor.java:478)
at org.apache.maven.lifecycle.DefaultLifecycleExecutor.executeGoalAndHandleFailures(DefaultLifecycleExecutor.java:330)
at org.apache.maven.lifecycle.DefaultLifecycleExecutor.executeTaskSegments(DefaultLifecycleExecutor.java:291)
at org.apache.maven.lifecycle.DefaultLifecycleExecutor.execute(DefaultLifecycleExecutor.java:142)
at org.apache.maven.DefaultMaven.doExecute(DefaultMaven.java:336)
at org.apache.maven.DefaultMaven.execute(DefaultMaven.java:129)
at org.apache.maven.cli.MavenCli.main(MavenCli.java:287)
at sun.reflect.NativeMethodAccessorImpl.invoke0(Native Method)
at sun.reflect.NativeMethodAccessorImpl.invoke(NativeMethodAccessorImpl.java:39)
at sun.reflect.DelegatingMethodAccessorImpl.invoke(DelegatingMethodAccessorImpl.java:25)
at java.lang.reflect.Method.invoke(Method.java:585)
at org.codehaus.classworlds.Launcher.launchEnhanced(Launcher.java:315)
at org.codehaus.classworlds.Launcher.launch(Launcher.java:255)
at org.codehaus.classworlds.Launcher.mainWithExitCode(Launcher.java:430)
at org.codehaus.classworlds.Launcher.main(Launcher.java:375)
Caused by: org.apache.maven.wagon.ResourceDoesNotExistException: Unable to download the artifact from any repository
at org.apache.maven.artifact.manager.DefaultWagonManager.getArtifact(DefaultWagonManager.java:331)
at org.apache.maven.artifact.resolver.DefaultArtifactResolver.resolve(DefaultArtifactResolver.java:200)
... 22 more
[INFO] ------------------------------------------------------------------------
[ERROR] BUILD ERROR
[INFO] ------------------------------------------------------------------------
[INFO] Failed to resolve artifact.
Missing:
----------
1) org.apache.maven.shared:maven-shared-model:jar:1.0-SNAPSHOT
Try downloading the file manually from the project website.
Then, install it using the command:
mvn install:install-file -DgroupId=org.apache.maven.shared -DartifactId=maven-shared-model -Dversion=1.0-SNAPSHOT -Dpackaging=jar -Dfile=/path/to/file
Alternatively, if you host your own repository you can deploy the file there:
mvn deploy:deploy-file -DgroupId=org.apache.maven.shared -DartifactId=maven-shared-model -Dversion=1.0-SNAPSHOT -Dpackaging=jar -Dfile=/path/to/file -Durl=[url] -DrepositoryId=[id]
Path to dependency:
1) org.apache.maven:maven-project:jar:2.1-SNAPSHOT
2) org.apache.maven.shared:maven-shared-model:jar:1.0-SNAPSHOT
----------
1 required artifact is missing.
for artifact:
org.apache.maven:maven-project:jar:2.1-SNAPSHOT
from the specified remote repositories:
Nexus (http://localhost:8081/content/groups/public)
[INFO] ------------------------------------------------------------------------
[DEBUG] Trace
org.apache.maven.lifecycle.LifecycleExecutionException: Missing:
----------
1) org.apache.maven.shared:maven-shared-model:jar:1.0-SNAPSHOT
Try downloading the file manually from the project website.
Then, install it using the command:
mvn install:install-file -DgroupId=org.apache.maven.shared -DartifactId=maven-shared-model -Dversion=1.0-SNAPSHOT -Dpackaging=jar -Dfile=/path/to/file
Alternatively, if you host your own repository you can deploy the file there:
mvn deploy:deploy-file -DgroupId=org.apache.maven.shared -DartifactId=maven-shared-model -Dversion=1.0-SNAPSHOT -Dpackaging=jar -Dfile=/path/to/file -Durl=[url] -DrepositoryId=[id]
Path to dependency:
1) org.apache.maven:maven-project:jar:2.1-SNAPSHOT
2) org.apache.maven.shared:maven-shared-model:jar:1.0-SNAPSHOT
----------
1 required artifact is missing.
for artifact:
org.apache.maven:maven-project:jar:2.1-SNAPSHOT
from the specified remote repositories:
Nexus (http://localhost:8081/content/groups/public)
at org.apache.maven.lifecycle.DefaultLifecycleExecutor.executeGoals(DefaultLifecycleExecutor.java:575)
at org.apache.maven.lifecycle.DefaultLifecycleExecutor.executeGoalWithLifecycle(DefaultLifecycleExecutor.java:499)
at org.apache.maven.lifecycle.DefaultLifecycleExecutor.executeGoal(DefaultLifecycleExecutor.java:478)
at org.apache.maven.lifecycle.DefaultLifecycleExecutor.executeGoalAndHandleFailures(DefaultLifecycleExecutor.java:330)
at org.apache.maven.lifecycle.DefaultLifecycleExecutor.executeTaskSegments(DefaultLifecycleExecutor.java:291)
at org.apache.maven.lifecycle.DefaultLifecycleExecutor.execute(DefaultLifecycleExecutor.java:142)
at org.apache.maven.DefaultMaven.doExecute(DefaultMaven.java:336)
at org.apache.maven.DefaultMaven.execute(DefaultMaven.java:129)
at org.apache.maven.cli.MavenCli.main(MavenCli.java:287)
at sun.reflect.NativeMethodAccessorImpl.invoke0(Native Method)
at sun.reflect.NativeMethodAccessorImpl.invoke(NativeMethodAccessorImpl.java:39)
at sun.reflect.DelegatingMethodAccessorImpl.invoke(DelegatingMethodAccessorImpl.java:25)
at java.lang.reflect.Method.invoke(Method.java:585)
at org.codehaus.classworlds.Launcher.launchEnhanced(Launcher.java:315)
at org.codehaus.classworlds.Launcher.launch(Launcher.java:255)
at org.codehaus.classworlds.Launcher.mainWithExitCode(Launcher.java:430)
at org.codehaus.classworlds.Launcher.main(Launcher.java:375)
Caused by: org.apache.maven.artifact.resolver.MultipleArtifactsNotFoundException: Missing:
----------
1) org.apache.maven.shared:maven-shared-model:jar:1.0-SNAPSHOT
Try downloading the file manually from the project website.
Then, install it using the command:
mvn install:install-file -DgroupId=org.apache.maven.shared -DartifactId=maven-shared-model -Dversion=1.0-SNAPSHOT -Dpackaging=jar -Dfile=/path/to/file
Alternatively, if you host your own repository you can deploy the file there:
mvn deploy:deploy-file -DgroupId=org.apache.maven.shared -DartifactId=maven-shared-model -Dversion=1.0-SNAPSHOT -Dpackaging=jar -Dfile=/path/to/file -Durl=[url] -DrepositoryId=[id]
Path to dependency:
1) org.apache.maven:maven-project:jar:2.1-SNAPSHOT
2) org.apache.maven.shared:maven-shared-model:jar:1.0-SNAPSHOT
----------
1 required artifact is missing.
for artifact:
org.apache.maven:maven-project:jar:2.1-SNAPSHOT
from the specified remote repositories:
Nexus (http://localhost:8081/content/groups/public)
at org.apache.maven.artifact.resolver.DefaultArtifactResolver.resolveTransitively(DefaultArtifactResolver.java:324)
at org.apache.maven.artifact.resolver.DefaultArtifactResolver.resolveTransitively(DefaultArtifactResolver.java:288)
at org.apache.maven.plugin.DefaultPluginManager.resolveTransitiveDependencies(DefaultPluginManager.java:1415)
at org.apache.maven.plugin.DefaultPluginManager.executeMojo(DefaultPluginManager.java:405)
at org.apache.maven.lifecycle.DefaultLifecycleExecutor.executeGoals(DefaultLifecycleExecutor.java:558)
... 16 more
[INFO] ------------------------------------------------------------------------
[INFO] Total time: 21 seconds
[INFO] Finished at: Fri Jul 25 16:02:46 CDT 2008
[INFO] Final Memory: 47M/418M
[INFO] ------------------------------------------------------------------------
Build failed in Hudson: maven-2.1.x #268
Posted by Hudson <Hu...@sonatype.org>.
See http://ci.sonatype.org/job/maven-2.1.x/268/changes
------------------------------------------
[...truncated 5391 lines...]
[DEBUG] active project artifact:
artifact = org.apache.maven:maven-model:jar:2.1-SNAPSHOT:compile;
project: MavenProject: org.apache.maven:maven-model:2.1-SNAPSHOT @ http://ci.sonatype.org/job/maven-2.1.x/ws/trunk/maven-model/pom.xml (selected for compile)
[DEBUG] org.codehaus.plexus:plexus-utils:jar:1.5.5:compile (selected for compile)
[DEBUG] org.codehaus.plexus:plexus-interpolation:jar:1.1:compile (selected for compile)
[DEBUG] org.apache.maven.artifact:maven-artifact:jar:3.0-SNAPSHOT:compile (selected for compile)
[DEBUG] org.codehaus.plexus:plexus-utils:jar:1.5.1:compile (applying version: 1.5.5)
[DEBUG] org.codehaus.plexus:plexus-container-default:jar:1.0-alpha-44:compile (applying version: 1.0-alpha-48)
[DEBUG] org.apache.maven.wagon:wagon-provider-api:jar:1.0-beta-3:compile (selected for compile)
[DEBUG] org.codehaus.plexus:plexus-utils:jar:1.4.2:compile (applying version: 1.5.5)
[DEBUG] aspectj:aspectjrt:jar:1.5.3:compile (selected for compile)
[DEBUG] org.codehaus.plexus:plexus-container-default:jar:1.0-alpha-48:compile (selected for compile)
[DEBUG] org.codehaus.plexus:plexus-utils:jar:1.4.5:compile (applying version: 1.5.5)
[DEBUG] org.codehaus.plexus:plexus-classworlds:jar:1.2-alpha-13:compile (selected for compile)
[DEBUG] junit:junit:jar:3.8.1:compile (selected for compile)
[DEBUG] org.apache.xbean:xbean-reflect:jar:3.4:compile (selected for compile)
[DEBUG] log4j:log4j:jar:1.2.12:compile (selected for compile)
[DEBUG] commons-logging:commons-logging-api:jar:1.1:compile (selected for compile)
[DEBUG] junit:junit:jar:3.8.1:compile (selected for compile)
[DEBUG] aspectj:aspectjrt:jar:1.5.3:compile (selected for compile)
[DEBUG] Retrieving parent-POM: org.apache.maven.wagon:wagon-providers::1.0-beta-3 for project: null:wagon-file:jar:null from the repository.
[DEBUG] Adding managed dependencies for unknown:wagon-file
[DEBUG] org.apache.maven.wagon:wagon-provider-api:jar:1.0-beta-3
[DEBUG] org.apache.maven.wagon:wagon-provider-test:jar:1.0-beta-3
[DEBUG] org.apache.maven.wagon:wagon-ssh-common-test:jar:1.0-beta-3
[DEBUG] org.apache.maven.wagon:wagon-ssh-common:jar:1.0-beta-3
[DEBUG] junit:junit:jar:3.8.1
[DEBUG] org.codehaus.plexus:plexus-interactivity-api:jar:1.0-alpha-6
[DEBUG] org.codehaus.plexus:plexus-container-default:jar:1.0-alpha-9:test
[DEBUG] org.codehaus.plexus:plexus-utils:jar:1.4.2
[DEBUG] org.apache.maven.wagon:wagon-file:jar:1.0-beta-3:test (selected for test)
[DEBUG] org.codehaus.woodstox:wstx-asl:jar:3.2.6:compile (selected for compile)
[DEBUG] stax:stax-api:jar:1.0.1:compile (selected for compile)
[INFO] snapshot org.apache.maven.shared:maven-shared-model:1.0-SNAPSHOT: checking for updates from central
[DEBUG] repository metadata for: 'snapshot org.apache.maven.shared:maven-shared-model:1.0-SNAPSHOT' could not be found on repository: central
[INFO] snapshot org.apache.maven.shared:maven-shared-model:1.0-SNAPSHOT: checking for updates from apache.snapshots
[DEBUG] repository metadata for: 'snapshot org.apache.maven.shared:maven-shared-model:1.0-SNAPSHOT' could not be found on repository: apache.snapshots
[INFO] snapshot org.apache.maven.shared:maven-shared-model:1.0-SNAPSHOT: checking for updates from codehaus.snapshots
[DEBUG] repository metadata for: 'snapshot org.apache.maven.shared:maven-shared-model:1.0-SNAPSHOT' could not be found on repository: codehaus.snapshots
[DEBUG] maven-shared-model: using locally installed snapshot
[DEBUG] Trying repository central
Downloading: http://localhost:8081/content/groups/public/org/apache/maven/shared/maven-shared-model/1.0-SNAPSHOT/maven-shared-model-1.0-SNAPSHOT.pom
[DEBUG] Unable to get resource 'org.apache.maven.shared:maven-shared-model:pom:1.0-SNAPSHOT' from repository central (http://Nexus)
[DEBUG] Trying repository apache.snapshots
Downloading: http://localhost:8081/content/groups/public/org/apache/maven/shared/maven-shared-model/1.0-SNAPSHOT/maven-shared-model-1.0-SNAPSHOT.pom
[DEBUG] Unable to get resource 'org.apache.maven.shared:maven-shared-model:pom:1.0-SNAPSHOT' from repository apache.snapshots (http://people.apache.org/repo/m2-snapshot-repository/)
[DEBUG] Trying repository codehaus.snapshots
Downloading: http://localhost:8081/content/groups/public/org/apache/maven/shared/maven-shared-model/1.0-SNAPSHOT/maven-shared-model-1.0-SNAPSHOT.pom
[DEBUG] Unable to get resource 'org.apache.maven.shared:maven-shared-model:pom:1.0-SNAPSHOT' from repository codehaus.snapshots (http://snapshots.repository.codehaus.org/)
[DEBUG] Artifact not found - using stub model: Unable to download the artifact from any repository
org.apache.maven.shared:maven-shared-model:pom:1.0-SNAPSHOT
from the specified remote repositories:
Nexus (http://localhost:8081/content/groups/public)
[DEBUG] Using defaults for missing POM org.apache.maven.shared:maven-shared-model:pom:1.0-SNAPSHOT:compile
[DEBUG] org.apache.maven.shared:maven-shared-model:jar:1.0-SNAPSHOT:compile (selected for compile)
[DEBUG] junit:junit:jar:3.8.1:test (not setting scope to: compile; local scope test wins)
[DEBUG] junit:junit:jar:3.8.1:test (selected for test)
[DEBUG] maven-artifact: resolved to version 3.0-20080717.214645-113 from repository codehaus.snapshots
[DEBUG] maven-shared-model: using locally installed snapshot
[DEBUG] Trying repository central
Downloading: http://localhost:8081/content/groups/public/org/apache/maven/shared/maven-shared-model/1.0-SNAPSHOT/maven-shared-model-1.0-SNAPSHOT.jar
[DEBUG] Unable to get resource 'org.apache.maven.shared:maven-shared-model:jar:1.0-SNAPSHOT' from repository central (http://Nexus)
[DEBUG] Trying repository apache.snapshots
Downloading: http://localhost:8081/content/groups/public/org/apache/maven/shared/maven-shared-model/1.0-SNAPSHOT/maven-shared-model-1.0-SNAPSHOT.jar
[DEBUG] Unable to get resource 'org.apache.maven.shared:maven-shared-model:jar:1.0-SNAPSHOT' from repository apache.snapshots (http://people.apache.org/repo/m2-snapshot-repository/)
[DEBUG] Trying repository codehaus.snapshots
Downloading: http://localhost:8081/content/groups/public/org/apache/maven/shared/maven-shared-model/1.0-SNAPSHOT/maven-shared-model-1.0-SNAPSHOT.jar
[DEBUG] Unable to get resource 'org.apache.maven.shared:maven-shared-model:jar:1.0-SNAPSHOT' from repository codehaus.snapshots (http://snapshots.repository.codehaus.org/)
[DEBUG] Unable to download the artifact from any repository
Try downloading the file manually from the project website.
Then, install it using the command:
mvn install:install-file -DgroupId=org.apache.maven.shared -DartifactId=maven-shared-model -Dversion=1.0-SNAPSHOT -Dpackaging=jar -Dfile=/path/to/file
Alternatively, if you host your own repository you can deploy the file there:
mvn deploy:deploy-file -DgroupId=org.apache.maven.shared -DartifactId=maven-shared-model -Dversion=1.0-SNAPSHOT -Dpackaging=jar -Dfile=/path/to/file -Durl=[url] -DrepositoryId=[id]
Path to dependency:
1) org.apache.maven:maven-project:jar:2.1-SNAPSHOT
2) org.apache.maven.shared:maven-shared-model:jar:1.0-SNAPSHOT
org.apache.maven.shared:maven-shared-model:jar:1.0-SNAPSHOT
from the specified remote repositories:
Nexus (http://localhost:8081/content/groups/public)
org.apache.maven.artifact.resolver.ArtifactNotFoundException: Unable to download the artifact from any repository
Try downloading the file manually from the project website.
Then, install it using the command:
mvn install:install-file -DgroupId=org.apache.maven.shared -DartifactId=maven-shared-model -Dversion=1.0-SNAPSHOT -Dpackaging=jar -Dfile=/path/to/file
Alternatively, if you host your own repository you can deploy the file there:
mvn deploy:deploy-file -DgroupId=org.apache.maven.shared -DartifactId=maven-shared-model -Dversion=1.0-SNAPSHOT -Dpackaging=jar -Dfile=/path/to/file -Durl=[url] -DrepositoryId=[id]
Path to dependency:
1) org.apache.maven:maven-project:jar:2.1-SNAPSHOT
2) org.apache.maven.shared:maven-shared-model:jar:1.0-SNAPSHOT
org.apache.maven.shared:maven-shared-model:jar:1.0-SNAPSHOT
from the specified remote repositories:
Nexus (http://localhost:8081/content/groups/public)
at org.apache.maven.artifact.resolver.DefaultArtifactResolver.resolve(DefaultArtifactResolver.java:212)
at org.apache.maven.artifact.resolver.DefaultArtifactResolver.resolve(DefaultArtifactResolver.java:74)
at org.apache.maven.artifact.resolver.DefaultArtifactResolver.resolveTransitively(DefaultArtifactResolver.java:311)
at org.apache.maven.artifact.resolver.DefaultArtifactResolver.resolveTransitively(DefaultArtifactResolver.java:288)
at org.apache.maven.plugin.DefaultPluginManager.resolveTransitiveDependencies(DefaultPluginManager.java:1415)
at org.apache.maven.plugin.DefaultPluginManager.executeMojo(DefaultPluginManager.java:405)
at org.apache.maven.lifecycle.DefaultLifecycleExecutor.executeGoals(DefaultLifecycleExecutor.java:558)
at org.apache.maven.lifecycle.DefaultLifecycleExecutor.executeGoalWithLifecycle(DefaultLifecycleExecutor.java:499)
at org.apache.maven.lifecycle.DefaultLifecycleExecutor.executeGoal(DefaultLifecycleExecutor.java:478)
at org.apache.maven.lifecycle.DefaultLifecycleExecutor.executeGoalAndHandleFailures(DefaultLifecycleExecutor.java:330)
at org.apache.maven.lifecycle.DefaultLifecycleExecutor.executeTaskSegments(DefaultLifecycleExecutor.java:291)
at org.apache.maven.lifecycle.DefaultLifecycleExecutor.execute(DefaultLifecycleExecutor.java:142)
at org.apache.maven.DefaultMaven.doExecute(DefaultMaven.java:336)
at org.apache.maven.DefaultMaven.execute(DefaultMaven.java:129)
at org.apache.maven.cli.MavenCli.main(MavenCli.java:287)
at sun.reflect.NativeMethodAccessorImpl.invoke0(Native Method)
at sun.reflect.NativeMethodAccessorImpl.invoke(NativeMethodAccessorImpl.java:39)
at sun.reflect.DelegatingMethodAccessorImpl.invoke(DelegatingMethodAccessorImpl.java:25)
at java.lang.reflect.Method.invoke(Method.java:585)
at org.codehaus.classworlds.Launcher.launchEnhanced(Launcher.java:315)
at org.codehaus.classworlds.Launcher.launch(Launcher.java:255)
at org.codehaus.classworlds.Launcher.mainWithExitCode(Launcher.java:430)
at org.codehaus.classworlds.Launcher.main(Launcher.java:375)
Caused by: org.apache.maven.wagon.ResourceDoesNotExistException: Unable to download the artifact from any repository
at org.apache.maven.artifact.manager.DefaultWagonManager.getArtifact(DefaultWagonManager.java:331)
at org.apache.maven.artifact.resolver.DefaultArtifactResolver.resolve(DefaultArtifactResolver.java:200)
... 22 more
[INFO] ------------------------------------------------------------------------
[ERROR] BUILD ERROR
[INFO] ------------------------------------------------------------------------
[INFO] Failed to resolve artifact.
Missing:
----------
1) org.apache.maven.shared:maven-shared-model:jar:1.0-SNAPSHOT
Try downloading the file manually from the project website.
Then, install it using the command:
mvn install:install-file -DgroupId=org.apache.maven.shared -DartifactId=maven-shared-model -Dversion=1.0-SNAPSHOT -Dpackaging=jar -Dfile=/path/to/file
Alternatively, if you host your own repository you can deploy the file there:
mvn deploy:deploy-file -DgroupId=org.apache.maven.shared -DartifactId=maven-shared-model -Dversion=1.0-SNAPSHOT -Dpackaging=jar -Dfile=/path/to/file -Durl=[url] -DrepositoryId=[id]
Path to dependency:
1) org.apache.maven:maven-project:jar:2.1-SNAPSHOT
2) org.apache.maven.shared:maven-shared-model:jar:1.0-SNAPSHOT
----------
1 required artifact is missing.
for artifact:
org.apache.maven:maven-project:jar:2.1-SNAPSHOT
from the specified remote repositories:
Nexus (http://localhost:8081/content/groups/public)
[INFO] ------------------------------------------------------------------------
[DEBUG] Trace
org.apache.maven.lifecycle.LifecycleExecutionException: Missing:
----------
1) org.apache.maven.shared:maven-shared-model:jar:1.0-SNAPSHOT
Try downloading the file manually from the project website.
Then, install it using the command:
mvn install:install-file -DgroupId=org.apache.maven.shared -DartifactId=maven-shared-model -Dversion=1.0-SNAPSHOT -Dpackaging=jar -Dfile=/path/to/file
Alternatively, if you host your own repository you can deploy the file there:
mvn deploy:deploy-file -DgroupId=org.apache.maven.shared -DartifactId=maven-shared-model -Dversion=1.0-SNAPSHOT -Dpackaging=jar -Dfile=/path/to/file -Durl=[url] -DrepositoryId=[id]
Path to dependency:
1) org.apache.maven:maven-project:jar:2.1-SNAPSHOT
2) org.apache.maven.shared:maven-shared-model:jar:1.0-SNAPSHOT
----------
1 required artifact is missing.
for artifact:
org.apache.maven:maven-project:jar:2.1-SNAPSHOT
from the specified remote repositories:
Nexus (http://localhost:8081/content/groups/public)
at org.apache.maven.lifecycle.DefaultLifecycleExecutor.executeGoals(DefaultLifecycleExecutor.java:575)
at org.apache.maven.lifecycle.DefaultLifecycleExecutor.executeGoalWithLifecycle(DefaultLifecycleExecutor.java:499)
at org.apache.maven.lifecycle.DefaultLifecycleExecutor.executeGoal(DefaultLifecycleExecutor.java:478)
at org.apache.maven.lifecycle.DefaultLifecycleExecutor.executeGoalAndHandleFailures(DefaultLifecycleExecutor.java:330)
at org.apache.maven.lifecycle.DefaultLifecycleExecutor.executeTaskSegments(DefaultLifecycleExecutor.java:291)
at org.apache.maven.lifecycle.DefaultLifecycleExecutor.execute(DefaultLifecycleExecutor.java:142)
at org.apache.maven.DefaultMaven.doExecute(DefaultMaven.java:336)
at org.apache.maven.DefaultMaven.execute(DefaultMaven.java:129)
at org.apache.maven.cli.MavenCli.main(MavenCli.java:287)
at sun.reflect.NativeMethodAccessorImpl.invoke0(Native Method)
at sun.reflect.NativeMethodAccessorImpl.invoke(NativeMethodAccessorImpl.java:39)
at sun.reflect.DelegatingMethodAccessorImpl.invoke(DelegatingMethodAccessorImpl.java:25)
at java.lang.reflect.Method.invoke(Method.java:585)
at org.codehaus.classworlds.Launcher.launchEnhanced(Launcher.java:315)
at org.codehaus.classworlds.Launcher.launch(Launcher.java:255)
at org.codehaus.classworlds.Launcher.mainWithExitCode(Launcher.java:430)
at org.codehaus.classworlds.Launcher.main(Launcher.java:375)
Caused by: org.apache.maven.artifact.resolver.MultipleArtifactsNotFoundException: Missing:
----------
1) org.apache.maven.shared:maven-shared-model:jar:1.0-SNAPSHOT
Try downloading the file manually from the project website.
Then, install it using the command:
mvn install:install-file -DgroupId=org.apache.maven.shared -DartifactId=maven-shared-model -Dversion=1.0-SNAPSHOT -Dpackaging=jar -Dfile=/path/to/file
Alternatively, if you host your own repository you can deploy the file there:
mvn deploy:deploy-file -DgroupId=org.apache.maven.shared -DartifactId=maven-shared-model -Dversion=1.0-SNAPSHOT -Dpackaging=jar -Dfile=/path/to/file -Durl=[url] -DrepositoryId=[id]
Path to dependency:
1) org.apache.maven:maven-project:jar:2.1-SNAPSHOT
2) org.apache.maven.shared:maven-shared-model:jar:1.0-SNAPSHOT
----------
1 required artifact is missing.
for artifact:
org.apache.maven:maven-project:jar:2.1-SNAPSHOT
from the specified remote repositories:
Nexus (http://localhost:8081/content/groups/public)
at org.apache.maven.artifact.resolver.DefaultArtifactResolver.resolveTransitively(DefaultArtifactResolver.java:324)
at org.apache.maven.artifact.resolver.DefaultArtifactResolver.resolveTransitively(DefaultArtifactResolver.java:288)
at org.apache.maven.plugin.DefaultPluginManager.resolveTransitiveDependencies(DefaultPluginManager.java:1415)
at org.apache.maven.plugin.DefaultPluginManager.executeMojo(DefaultPluginManager.java:405)
at org.apache.maven.lifecycle.DefaultLifecycleExecutor.executeGoals(DefaultLifecycleExecutor.java:558)
... 16 more
[INFO] ------------------------------------------------------------------------
[INFO] Total time: 24 seconds
[INFO] Finished at: Fri Jul 25 12:03:40 CDT 2008
[INFO] Final Memory: 47M/423M
[INFO] ------------------------------------------------------------------------