You are viewing a plain text version of this content. The canonical link for it is here.
Posted to builds@mesos.apache.org by Apache Jenkins Server <je...@builds.apache.org> on 2017/01/17 11:50:16 UTC

Build failed in Jenkins: Mesos-Buildbot » autotools,gcc,--verbose --enable-libevent --enable-ssl,GLOG_v=1 MESOS_VERBOSE=1,ubuntu:14.04,(docker||Hadoop)&&(!ubuntu-us1)&&(!ubuntu-6)&&(!ubuntu-eu2) #3117

See <https://builds.apache.org/job/Mesos-Buildbot/BUILDTOOL=autotools,COMPILER=gcc,CONFIGURATION=--verbose%20--enable-libevent%20--enable-ssl,ENVIRONMENT=GLOG_v=1%20MESOS_VERBOSE=1,OS=ubuntu%3A14.04,label_exp=(docker%7C%7CHadoop)&&(!ubuntu-us1)&&(!ubuntu-6)&&(!ubuntu-eu2)/3117/changes>

Changes:

[yujie.jay] Added the `mesos-cni-port-mapper` to the CMake build.

------------------------------------------
[...truncated 13843 lines...]
I0117 11:49:50.771467 26997 openssl.cpp:424] CA directory path unspecified! NOTE: Set CA directory path with LIBPROCESS_SSL_CA_DIR=<dirpath>
I0117 11:49:50.771471 26997 openssl.cpp:429] Will not verify peer certificate!
NOTE: Set LIBPROCESS_SSL_VERIFY_CERT=1 to enable peer certificate verification
I0117 11:49:50.771476 26997 openssl.cpp:449] LIBPROCESS_SSL_REQUIRE_CERT implies peer certificate verification.
LIBPROCESS_SSL_VERIFY_CERT set to true
I0117 11:49:50.771534 26997 openssl.cpp:511] Using default CA file '/usr/lib/ssl/cert.pem' and/or directory '/usr/lib/ssl/certs'
I0117 11:49:50.778780 27014 libevent_ssl_socket.cpp:1164] Socket error: error:140760FC:SSL routines:SSL23_GET_CLIENT_HELLO:unknown protocol
[       OK ] SSLTest.NoValidDowngrade (502 ms)
[ RUN      ] SSLTest.ValidDowngradeEachProtocol
I0117 11:49:51.326469 26997 ssl_tests.cpp:586] Testing server protocol 'LIBPROCESS_SSL_ENABLE_SSL_V3'
W0117 11:49:51.326839 26997 openssl.cpp:402] Failed SSL connections will be downgraded to a non-SSL socket
I0117 11:49:51.326853 26997 openssl.cpp:419] CA file path is unspecified! NOTE: Set CA file path with LIBPROCESS_SSL_CA_FILE=<filepath>
I0117 11:49:51.326856 26997 openssl.cpp:424] CA directory path unspecified! NOTE: Set CA directory path with LIBPROCESS_SSL_CA_DIR=<dirpath>
I0117 11:49:51.326860 26997 openssl.cpp:429] Will not verify peer certificate!
NOTE: Set LIBPROCESS_SSL_VERIFY_CERT=1 to enable peer certificate verification
I0117 11:49:51.326864 26997 openssl.cpp:435] Will only verify peer certificate if presented!
NOTE: Set LIBPROCESS_SSL_REQUIRE_CERT=1 to require peer certificate verification
I0117 11:49:51.418436 26997 ssl_tests.cpp:586] Testing server protocol 'LIBPROCESS_SSL_ENABLE_TLS_V1_0'
W0117 11:49:51.418932 26997 openssl.cpp:402] Failed SSL connections will be downgraded to a non-SSL socket
I0117 11:49:51.418946 26997 openssl.cpp:419] CA file path is unspecified! NOTE: Set CA file path with LIBPROCESS_SSL_CA_FILE=<filepath>
I0117 11:49:51.418954 26997 openssl.cpp:424] CA directory path unspecified! NOTE: Set CA directory path with LIBPROCESS_SSL_CA_DIR=<dirpath>
I0117 11:49:51.418962 26997 openssl.cpp:429] Will not verify peer certificate!
NOTE: Set LIBPROCESS_SSL_VERIFY_CERT=1 to enable peer certificate verification
I0117 11:49:51.418970 26997 openssl.cpp:435] Will only verify peer certificate if presented!
NOTE: Set LIBPROCESS_SSL_REQUIRE_CERT=1 to require peer certificate verification
I0117 11:49:51.519923 26997 ssl_tests.cpp:586] Testing server protocol 'LIBPROCESS_SSL_ENABLE_TLS_V1_1'
W0117 11:49:51.520504 26997 openssl.cpp:402] Failed SSL connections will be downgraded to a non-SSL socket
I0117 11:49:51.520524 26997 openssl.cpp:419] CA file path is unspecified! NOTE: Set CA file path with LIBPROCESS_SSL_CA_FILE=<filepath>
I0117 11:49:51.520529 26997 openssl.cpp:424] CA directory path unspecified! NOTE: Set CA directory path with LIBPROCESS_SSL_CA_DIR=<dirpath>
I0117 11:49:51.520535 26997 openssl.cpp:429] Will not verify peer certificate!
NOTE: Set LIBPROCESS_SSL_VERIFY_CERT=1 to enable peer certificate verification
I0117 11:49:51.520542 26997 openssl.cpp:435] Will only verify peer certificate if presented!
NOTE: Set LIBPROCESS_SSL_REQUIRE_CERT=1 to require peer certificate verification
I0117 11:49:51.620995 26997 ssl_tests.cpp:586] Testing server protocol 'LIBPROCESS_SSL_ENABLE_TLS_V1_2'
W0117 11:49:51.621526 26997 openssl.cpp:402] Failed SSL connections will be downgraded to a non-SSL socket
I0117 11:49:51.621544 26997 openssl.cpp:419] CA file path is unspecified! NOTE: Set CA file path with LIBPROCESS_SSL_CA_FILE=<filepath>
I0117 11:49:51.621551 26997 openssl.cpp:424] CA directory path unspecified! NOTE: Set CA directory path with LIBPROCESS_SSL_CA_DIR=<dirpath>
I0117 11:49:51.621556 26997 openssl.cpp:429] Will not verify peer certificate!
NOTE: Set LIBPROCESS_SSL_VERIFY_CERT=1 to enable peer certificate verification
I0117 11:49:51.621562 26997 openssl.cpp:435] Will only verify peer certificate if presented!
NOTE: Set LIBPROCESS_SSL_REQUIRE_CERT=1 to require peer certificate verification
[       OK ] SSLTest.ValidDowngradeEachProtocol (906 ms)
[ RUN      ] SSLTest.NoValidDowngradeEachProtocol
I0117 11:49:51.907125 26997 ssl_tests.cpp:633] Testing server protocol 'LIBPROCESS_SSL_ENABLE_SSL_V3'
I0117 11:49:51.907608 26997 openssl.cpp:419] CA file path is unspecified! NOTE: Set CA file path with LIBPROCESS_SSL_CA_FILE=<filepath>
I0117 11:49:51.907621 26997 openssl.cpp:424] CA directory path unspecified! NOTE: Set CA directory path with LIBPROCESS_SSL_CA_DIR=<dirpath>
I0117 11:49:51.907625 26997 openssl.cpp:429] Will not verify peer certificate!
NOTE: Set LIBPROCESS_SSL_VERIFY_CERT=1 to enable peer certificate verification
I0117 11:49:51.907632 26997 openssl.cpp:435] Will only verify peer certificate if presented!
NOTE: Set LIBPROCESS_SSL_REQUIRE_CERT=1 to require peer certificate verification
I0117 11:49:51.916640 27014 libevent_ssl_socket.cpp:1164] Socket error: error:140760FC:SSL routines:SSL23_GET_CLIENT_HELLO:unknown protocol
I0117 11:49:51.923249 26997 ssl_tests.cpp:633] Testing server protocol 'LIBPROCESS_SSL_ENABLE_TLS_V1_0'
I0117 11:49:51.923682 26997 openssl.cpp:419] CA file path is unspecified! NOTE: Set CA file path with LIBPROCESS_SSL_CA_FILE=<filepath>
I0117 11:49:51.923697 26997 openssl.cpp:424] CA directory path unspecified! NOTE: Set CA directory path with LIBPROCESS_SSL_CA_DIR=<dirpath>
I0117 11:49:51.923702 26997 openssl.cpp:429] Will not verify peer certificate!
NOTE: Set LIBPROCESS_SSL_VERIFY_CERT=1 to enable peer certificate verification
I0117 11:49:51.923710 26997 openssl.cpp:435] Will only verify peer certificate if presented!
NOTE: Set LIBPROCESS_SSL_REQUIRE_CERT=1 to require peer certificate verification
I0117 11:49:51.929636 27014 libevent_ssl_socket.cpp:1164] Socket error: error:140760FC:SSL routines:SSL23_GET_CLIENT_HELLO:unknown protocol
I0117 11:49:52.024696 26997 ssl_tests.cpp:633] Testing server protocol 'LIBPROCESS_SSL_ENABLE_TLS_V1_1'
I0117 11:49:52.025187 26997 openssl.cpp:419] CA file path is unspecified! NOTE: Set CA file path with LIBPROCESS_SSL_CA_FILE=<filepath>
I0117 11:49:52.025202 26997 openssl.cpp:424] CA directory path unspecified! NOTE: Set CA directory path with LIBPROCESS_SSL_CA_DIR=<dirpath>
I0117 11:49:52.025207 26997 openssl.cpp:429] Will not verify peer certificate!
NOTE: Set LIBPROCESS_SSL_VERIFY_CERT=1 to enable peer certificate verification
I0117 11:49:52.025213 26997 openssl.cpp:435] Will only verify peer certificate if presented!
NOTE: Set LIBPROCESS_SSL_REQUIRE_CERT=1 to require peer certificate verification
I0117 11:49:52.032613 27014 libevent_ssl_socket.cpp:1164] Socket error: error:140760FC:SSL routines:SSL23_GET_CLIENT_HELLO:unknown protocol
I0117 11:49:52.125139 26997 ssl_tests.cpp:633] Testing server protocol 'LIBPROCESS_SSL_ENABLE_TLS_V1_2'
I0117 11:49:52.125529 26997 openssl.cpp:419] CA file path is unspecified! NOTE: Set CA file path with LIBPROCESS_SSL_CA_FILE=<filepath>
I0117 11:49:52.125542 26997 openssl.cpp:424] CA directory path unspecified! NOTE: Set CA directory path with LIBPROCESS_SSL_CA_DIR=<dirpath>
I0117 11:49:52.125546 26997 openssl.cpp:429] Will not verify peer certificate!
NOTE: Set LIBPROCESS_SSL_VERIFY_CERT=1 to enable peer certificate verification
I0117 11:49:52.125550 26997 openssl.cpp:435] Will only verify peer certificate if presented!
NOTE: Set LIBPROCESS_SSL_REQUIRE_CERT=1 to require peer certificate verification
I0117 11:49:52.133208 27014 libevent_ssl_socket.cpp:1164] Socket error: error:140760FC:SSL routines:SSL23_GET_CLIENT_HELLO:unknown protocol
[       OK ] SSLTest.NoValidDowngradeEachProtocol (504 ms)
[ RUN      ] SSLTest.PeerAddress
I0117 11:49:52.660032 26997 openssl.cpp:419] CA file path is unspecified! NOTE: Set CA file path with LIBPROCESS_SSL_CA_FILE=<filepath>
I0117 11:49:52.660051 26997 openssl.cpp:424] CA directory path unspecified! NOTE: Set CA directory path with LIBPROCESS_SSL_CA_DIR=<dirpath>
I0117 11:49:52.660056 26997 openssl.cpp:429] Will not verify peer certificate!
NOTE: Set LIBPROCESS_SSL_VERIFY_CERT=1 to enable peer certificate verification
I0117 11:49:52.660060 26997 openssl.cpp:435] Will only verify peer certificate if presented!
NOTE: Set LIBPROCESS_SSL_REQUIRE_CERT=1 to require peer certificate verification
[       OK ] SSLTest.PeerAddress (439 ms)
[ RUN      ] SSLTest.HTTPSGet
I0117 11:49:53.432847 26997 openssl.cpp:419] CA file path is unspecified! NOTE: Set CA file path with LIBPROCESS_SSL_CA_FILE=<filepath>
I0117 11:49:53.432862 26997 openssl.cpp:424] CA directory path unspecified! NOTE: Set CA directory path with LIBPROCESS_SSL_CA_DIR=<dirpath>
I0117 11:49:53.432868 26997 openssl.cpp:429] Will not verify peer certificate!
NOTE: Set LIBPROCESS_SSL_VERIFY_CERT=1 to enable peer certificate verification
I0117 11:49:53.432870 26997 openssl.cpp:435] Will only verify peer certificate if presented!
NOTE: Set LIBPROCESS_SSL_REQUIRE_CERT=1 to require peer certificate verification
[       OK ] SSLTest.HTTPSGet (775 ms)
[ RUN      ] SSLTest.HTTPSPost
I0117 11:49:54.196825 26997 openssl.cpp:419] CA file path is unspecified! NOTE: Set CA file path with LIBPROCESS_SSL_CA_FILE=<filepath>
I0117 11:49:54.196853 26997 openssl.cpp:424] CA directory path unspecified! NOTE: Set CA directory path with LIBPROCESS_SSL_CA_DIR=<dirpath>
I0117 11:49:54.196861 26997 openssl.cpp:429] Will not verify peer certificate!
NOTE: Set LIBPROCESS_SSL_VERIFY_CERT=1 to enable peer certificate verification
I0117 11:49:54.196867 26997 openssl.cpp:435] Will only verify peer certificate if presented!
NOTE: Set LIBPROCESS_SSL_REQUIRE_CERT=1 to require peer certificate verification
[       OK ] SSLTest.HTTPSPost (764 ms)
[ RUN      ] SSLTest.SilentSocket
I0117 11:49:54.308037 26997 openssl.cpp:419] CA file path is unspecified! NOTE: Set CA file path with LIBPROCESS_SSL_CA_FILE=<filepath>
I0117 11:49:54.308051 26997 openssl.cpp:424] CA directory path unspecified! NOTE: Set CA directory path with LIBPROCESS_SSL_CA_DIR=<dirpath>
I0117 11:49:54.308056 26997 openssl.cpp:429] Will not verify peer certificate!
NOTE: Set LIBPROCESS_SSL_VERIFY_CERT=1 to enable peer certificate verification
I0117 11:49:54.308060 26997 openssl.cpp:435] Will only verify peer certificate if presented!
NOTE: Set LIBPROCESS_SSL_REQUIRE_CERT=1 to require peer certificate verification
I0117 11:49:54.314100 27014 libevent_ssl_socket.cpp:1164] Socket error: error:00000000:lib(0):func(0):reason(0)
[       OK ] SSLTest.SilentSocket (110 ms)
[----------] 15 tests from SSLTest (9326 ms total)

[----------] 38 tests from Scheme/HTTPTest
[ RUN      ] Scheme/HTTPTest.Endpoints/0
I0117 11:49:54.987277 26997 openssl.cpp:419] CA file path is unspecified! NOTE: Set CA file path with LIBPROCESS_SSL_CA_FILE=<filepath>
I0117 11:49:54.987290 26997 openssl.cpp:424] CA directory path unspecified! NOTE: Set CA directory path with LIBPROCESS_SSL_CA_DIR=<dirpath>
I0117 11:49:54.987295 26997 openssl.cpp:429] Will not verify peer certificate!
NOTE: Set LIBPROCESS_SSL_VERIFY_CERT=1 to enable peer certificate verification
I0117 11:49:54.987299 26997 openssl.cpp:435] Will only verify peer certificate if presented!
NOTE: Set LIBPROCESS_SSL_REQUIRE_CERT=1 to require peer certificate verification
I0117 11:49:54.990324 26997 process.cpp:1234] libprocess is initialized on 172.17.0.2:52873 with 16 worker threads
I0117 11:49:54.995679 27764 process.cpp:3676] Handling HTTP event for process '(75)' with path: '/(75)/body'
I0117 11:49:55.001126 27763 process.cpp:3676] Handling HTTP event for process '(75)' with path: '/(75)/pipe'
I0117 11:49:55.006781 27760 process.cpp:3676] Handling HTTP event for process '(75)' with path: '/(75)/body'
I0117 11:49:55.007284 27757 process.cpp:3733] Failed to process request for '/(75)/body': failure
I0117 11:49:55.007302 27764 process.cpp:1435] Returning '500 Internal Server Error' for '/(75)/body' (failure)
[       OK ] Scheme/HTTPTest.Endpoints/0 (694 ms)
[ RUN      ] Scheme/HTTPTest.Endpoints/1
I0117 11:49:55.010491 26997 process.cpp:1234] libprocess is initialized on 172.17.0.2:53839 with 16 worker threads
I0117 11:49:55.011508 27785 process.cpp:3676] Handling HTTP event for process '(76)' with path: '/(76)/body'
I0117 11:49:55.013010 27781 process.cpp:3676] Handling HTTP event for process '(76)' with path: '/(76)/pipe'
I0117 11:49:55.014946 27784 process.cpp:3676] Handling HTTP event for process '(76)' with path: '/(76)/body'
I0117 11:49:55.015354 27775 process.cpp:3733] Failed to process request for '/(76)/body': failure
I0117 11:49:55.015374 27783 process.cpp:1435] Returning '500 Internal Server Error' for '/(76)/body' (failure)
I0117 11:49:55.016083 27787 process.cpp:827] Decode failure: Connection reset by peer
E0117 11:49:55.016124 27787 process.cpp:2398] Failed to shutdown socket with fd 9: Transport endpoint is not connected
[       OK ] Scheme/HTTPTest.Endpoints/1 (8 ms)
[ RUN      ] Scheme/HTTPTest.EndpointsHelp/0
I0117 11:49:55.601507 26997 openssl.cpp:419] CA file path is unspecified! NOTE: Set CA file path with LIBPROCESS_SSL_CA_FILE=<filepath>
I0117 11:49:55.601531 26997 openssl.cpp:424] CA directory path unspecified! NOTE: Set CA directory path with LIBPROCESS_SSL_CA_DIR=<dirpath>
I0117 11:49:55.601536 26997 openssl.cpp:429] Will not verify peer certificate!
NOTE: Set LIBPROCESS_SSL_VERIFY_CERT=1 to enable peer certificate verification
I0117 11:49:55.601541 26997 openssl.cpp:435] Will only verify peer certificate if presented!
NOTE: Set LIBPROCESS_SSL_REQUIRE_CERT=1 to require peer certificate verification
I0117 11:49:55.603549 26997 process.cpp:1234] libprocess is initialized on 172.17.0.2:58251 with 16 worker threads
I0117 11:49:55.608901 27795 process.cpp:3676] Handling HTTP event for process 'help' with path: '/help'
I0117 11:49:55.614337 27789 process.cpp:3676] Handling HTTP event for process 'help' with path: '/help'
I0117 11:49:55.620339 27799 process.cpp:3676] Handling HTTP event for process 'help' with path: '/help/(77)/body'
I0117 11:49:55.625679 27800 process.cpp:3676] Handling HTTP event for process 'help' with path: '/help/(77)/a/b/c'
[       OK ] Scheme/HTTPTest.EndpointsHelp/0 (611 ms)
[ RUN      ] Scheme/HTTPTest.EndpointsHelp/1
I0117 11:49:55.629791 26997 process.cpp:1234] libprocess is initialized on 172.17.0.2:42757 with 16 worker threads
I0117 11:49:55.630893 27806 process.cpp:3676] Handling HTTP event for process 'help' with path: '/help'
I0117 11:49:55.632705 27811 process.cpp:3676] Handling HTTP event for process 'help' with path: '/help'
I0117 11:49:55.635308 27820 process.cpp:3676] Handling HTTP event for process 'help' with path: '/help/(78)/body'
I0117 11:49:55.636939 27805 process.cpp:3676] Handling HTTP event for process 'help' with path: '/help/(78)/a/b/c'
[       OK ] Scheme/HTTPTest.EndpointsHelp/1 (11 ms)
[ RUN      ] Scheme/HTTPTest.EndpointsHelpRemoval/0
I0117 11:49:55.897253 26997 openssl.cpp:419] CA file path is unspecified! NOTE: Set CA file path with LIBPROCESS_SSL_CA_FILE=<filepath>
I0117 11:49:55.897271 26997 openssl.cpp:424] CA directory path unspecified! NOTE: Set CA directory path with LIBPROCESS_SSL_CA_DIR=<dirpath>
I0117 11:49:55.897276 26997 openssl.cpp:429] Will not verify peer certificate!
NOTE: Set LIBPROCESS_SSL_VERIFY_CERT=1 to enable peer certificate verification
I0117 11:49:55.897280 26997 openssl.cpp:435] Will only verify peer certificate if presented!
NOTE: Set LIBPROCESS_SSL_REQUIRE_CERT=1 to require peer certificate verification
I0117 11:49:55.899603 26997 process.cpp:1234] libprocess is initialized on 172.17.0.2:54531 with 16 worker threads
I0117 11:49:55.905266 27832 process.cpp:3676] Handling HTTP event for process 'help' with path: '/help/(79)/body'
I0117 11:49:55.911088 27825 process.cpp:3676] Handling HTTP event for process 'help' with path: '/help/(79)/bogus'
[       OK ] Scheme/HTTPTest.EndpointsHelpRemoval/0 (274 ms)
[ RUN      ] Scheme/HTTPTest.EndpointsHelpRemoval/1
I0117 11:49:55.914919 26997 process.cpp:1234] libprocess is initialized on 172.17.0.2:57929 with 16 worker threads
I0117 11:49:55.916008 27851 process.cpp:3676] Handling HTTP event for process 'help' with path: '/help/(80)/body'
I0117 11:49:55.918054 27851 process.cpp:3676] Handling HTTP event for process 'help' with path: '/help/(80)/bogus'
[       OK ] Scheme/HTTPTest.EndpointsHelpRemoval/1 (7 ms)
[ RUN      ] Scheme/HTTPTest.PipeEOF/0
I0117 11:49:56.100818 26997 openssl.cpp:419] CA file path is unspecified! NOTE: Set CA file path with LIBPROCESS_SSL_CA_FILE=<filepath>
I0117 11:49:56.100834 26997 openssl.cpp:424] CA directory path unspecified! NOTE: Set CA directory path with LIBPROCESS_SSL_CA_DIR=<dirpath>
I0117 11:49:56.100841 26997 openssl.cpp:429] Will not verify peer certificate!
NOTE: Set LIBPROCESS_SSL_VERIFY_CERT=1 to enable peer certificate verification
I0117 11:49:56.100848 26997 openssl.cpp:435] Will only verify peer certificate if presented!
NOTE: Set LIBPROCESS_SSL_REQUIRE_CERT=1 to require peer certificate verification
I0117 11:49:56.112924 26997 process.cpp:1234] libprocess is initialized on 172.17.0.2:38696 with 16 worker threads
[       OK ] Scheme/HTTPTest.PipeEOF/0 (196 ms)
[ RUN      ] Scheme/HTTPTest.PipeEOF/1
*** Aborted at 1484653796 (unix time) try "date -d @1484653796" if you are using GNU date ***
PC: @     0x2aef0db86eee (unknown)
*** SIGSEGV (@0x3978018) received by PID 26997 (TID 0x2aef0ece5700) from PID 60260376; stack trace: ***
    @     0x2aef0c018330 (unknown)
    @     0x2aef0db86eee (unknown)
    @     0x2aef0d389e30 (unknown)
    @     0x2aef0d38a48c (unknown)
I0117 11:49:56.118458 26997 process.cpp:1234] libprocess is initialized on 172.17.0.2:60582 with 16 worker threads
[       OK ] Scheme/HTTPTest.PipeEOF/1 (4 ms)
[ RUN      ] Scheme/HTTPTest.PipeFailure/0
    @           0x422351 process::UPID::UPID()
    @           0x86d458 process::DispatchEvent::DispatchEvent()
    @           0x866330 process::internal::dispatch()
    @           0x87e728 process::dispatch<>()
    @           0x865326 process::ProcessBase::route()
    @           0x93d4bf process::ProcessBase::route<>()
    @           0x939a1f process::Help::initialize()
    @           0x85ec77 process::ProcessManager::resume()
    @           0x85b75c _ZZN7process14ProcessManager12init_threadsEvENKUt_clEv
    @           0x86cbe4 _ZNSt12_Bind_simpleIFZN7process14ProcessManager12init_threadsEvEUt_vEE9_M_invokeIIEEEvSt12_Index_tupleIIXspT_EEE
    @           0x86cb3b _ZNSt12_Bind_simpleIFZN7process14ProcessManager12init_threadsEvEUt_vEEclEv
    @           0x86cad4 _ZNSt6thread5_ImplISt12_Bind_simpleIFZN7process14ProcessManager12init_threadsEvEUt_vEEE6_M_runEv
    @     0x2aef0d380a60 (unknown)
    @     0x2aef0c010184 start_thread
    @     0x2aef0dbe937d (unknown)
make[7]: *** [check-local] Segmentation fault
make[7]: Leaving directory `/mesos/mesos-1.2.0/_build/3rdparty/libprocess'
make[6]: *** [check-am] Error 2
make[6]: Leaving directory `/mesos/mesos-1.2.0/_build/3rdparty/libprocess'
make[5]: *** [check-recursive] Error 1
make[5]: Leaving directory `/mesos/mesos-1.2.0/_build/3rdparty/libprocess'
make[4]: *** [check] Error 2
make[4]: Leaving directory `/mesos/mesos-1.2.0/_build/3rdparty/libprocess'
make[3]: *** [check-recursive] Error 1
make[3]: Leaving directory `/mesos/mesos-1.2.0/_build/3rdparty'
make[2]: *** [check] Error 2
make[2]: Leaving directory `/mesos/mesos-1.2.0/_build/3rdparty'
make[1]: *** [check-recursive] Error 1
make[1]: Leaving directory `/mesos/mesos-1.2.0/_build'
make: *** [distcheck] Error 1
+ docker rmi mesos-1484652192-25570
Untagged: mesos-1484652192-25570:latest
Deleted: sha256:f6fbfe9554b2a70c521f70c39cb80682a5c1fdc78eecc3daf3eb3da3b0119269
Deleted: sha256:a394858f1c2bad3d575285b6e91092ae77bc7f5033b4e749fad3cc2f6ffe862e
Deleted: sha256:86a7fddffa1b35a8cf8056ca62a607174756b09cdf8492af98570636b89df9cf
Deleted: sha256:9a620d63647d5fe3b91edee65369c884bffd465c02984ba0d344c1d810611333
Deleted: sha256:6d512cdd36f3028a596e601def03c7dd6a658de9c01e188f5294bdbbe7fd3c3f
Deleted: sha256:4800e56f3f6497686b7147fce68b73b8521dbea7d24a647388b22dc4e0da32b3
Deleted: sha256:45cb572e758185bdf10c96ac1bb811030af442e8f34b7b99465d53e0acff3c89
Deleted: sha256:cd1608bffaf1a362dfbe57f51f7f56cac66845da2b82ddc01643f4f3cb2f9f5b
Deleted: sha256:27842830dda64a37b1d360df6b8a9ce0eff2084749bfedb746beb7cc017bd058
Deleted: sha256:e90ea818b65cf18eed9e6e386f1c845126156bef032f88a32076b5e3316a2c5e
Deleted: sha256:062caac1739306f11f2be6c50eb2808f5400bc9bc8e28e29ac27049e8b13a2c7
Deleted: sha256:dcb6124f39db5d0a0b8269eb3e8fc53d205b039cbe36e2a9575ef4fd35584631
Deleted: sha256:aea7da5e98ad0bc4781b728ced810ab51de3204e7ff244661d791161e6221d52
Deleted: sha256:d9b75cce1b88cf972dd570ba5c14dc902a304d707d663206f1f50f0d7811539d
Deleted: sha256:161ac772ec21f8970888569f552f5d472e5873c38811662b14fb46a86427eb33
Deleted: sha256:fbbf8d2ce4193ceb7c8a1be981116550fce0c96ef5ef8c24cfa0e22dff309c43
Deleted: sha256:8d2d09fcde5b2c3934e53acba33215081fec58c632b780e15406754b4099061d
Deleted: sha256:c1568b1063ddb3d33f81c1419305bcd92945f63936e2f34107d1ae4fdf6b240f
Deleted: sha256:6bd54084af22a1607f0e726beb7b6e97640ca3a7eee10483b47851148c069458
Deleted: sha256:33e03959b4516f36e78dfc6ed0950ad10f0de01c7b5160a4fac748ad86394294
Deleted: sha256:c6423f6edbd25bad2b7a81e9fad36964bdba40d672e56daadc059551b270864c
Deleted: sha256:a493b25dedcfc228f8653e15574503a1bb1ff5c50f2679dbbbfa0c097d3c6c52
Deleted: sha256:24acd2675927224fc0f5fa41d20f111a414fe3a5a956f5884a2cb92fc95118d6
Deleted: sha256:e40a8d6b3db4178e7b1f4d343cf709bd75122e102f2ab843883973a0c49a678c
Build step 'Execute shell' marked build as failure

Re: Build failed in Jenkins: Mesos-Buildbot » autotools,gcc,--verbose --enable-libevent --enable-ssl,GLOG_v=1 MESOS_VERBOSE=1,ubuntu:14.04,(docker||Hadoop)&&(!ubuntu-us1)&&(!ubuntu-6)&&(!ubuntu-eu2) #3117

Posted by Vinod Kone <vi...@apache.org>.
@anand, @benh: another pipe related failure?

On Tue, Jan 17, 2017 at 12:50 PM, Apache Jenkins Server <
jenkins@builds.apache.org> wrote:

> See <https://builds.apache.org/job/Mesos-Buildbot/BUILDTOOL=
> autotools,COMPILER=gcc,CONFIGURATION=--verbose%20--
> enable-libevent%20--enable-ssl,ENVIRONMENT=GLOG_v=1%
> 20MESOS_VERBOSE=1,OS=ubuntu%3A14.04,label_exp=(docker%7C%
> 7CHadoop)&&(!ubuntu-us1)&&(!ubuntu-6)&&(!ubuntu-eu2)/3117/changes>
>
> Changes:
>
> [yujie.jay] Added the `mesos-cni-port-mapper` to the CMake build.
>
> ------------------------------------------
> [...truncated 13843 lines...]
> I0117 11:49:50.771467 26997 openssl.cpp:424] CA directory path
> unspecified! NOTE: Set CA directory path with LIBPROCESS_SSL_CA_DIR=<
> dirpath>
> I0117 11:49:50.771471 26997 openssl.cpp:429] Will not verify peer
> certificate!
> NOTE: Set LIBPROCESS_SSL_VERIFY_CERT=1 to enable peer certificate
> verification
> I0117 11:49:50.771476 26997 openssl.cpp:449] LIBPROCESS_SSL_REQUIRE_CERT
> implies peer certificate verification.
> LIBPROCESS_SSL_VERIFY_CERT set to true
> I0117 11:49:50.771534 26997 openssl.cpp:511] Using default CA file
> '/usr/lib/ssl/cert.pem' and/or directory '/usr/lib/ssl/certs'
> I0117 11:49:50.778780 27014 libevent_ssl_socket.cpp:1164] Socket error:
> error:140760FC:SSL routines:SSL23_GET_CLIENT_HELLO:unknown protocol
> [       OK ] SSLTest.NoValidDowngrade (502 ms)
> [ RUN      ] SSLTest.ValidDowngradeEachProtocol
> I0117 11:49:51.326469 26997 ssl_tests.cpp:586] Testing server protocol
> 'LIBPROCESS_SSL_ENABLE_SSL_V3'
> W0117 11:49:51.326839 26997 openssl.cpp:402] Failed SSL connections will
> be downgraded to a non-SSL socket
> I0117 11:49:51.326853 26997 openssl.cpp:419] CA file path is unspecified!
> NOTE: Set CA file path with LIBPROCESS_SSL_CA_FILE=<filepath>
> I0117 11:49:51.326856 26997 openssl.cpp:424] CA directory path
> unspecified! NOTE: Set CA directory path with LIBPROCESS_SSL_CA_DIR=<
> dirpath>
> I0117 11:49:51.326860 26997 openssl.cpp:429] Will not verify peer
> certificate!
> NOTE: Set LIBPROCESS_SSL_VERIFY_CERT=1 to enable peer certificate
> verification
> I0117 11:49:51.326864 26997 openssl.cpp:435] Will only verify peer
> certificate if presented!
> NOTE: Set LIBPROCESS_SSL_REQUIRE_CERT=1 to require peer certificate
> verification
> I0117 11:49:51.418436 26997 ssl_tests.cpp:586] Testing server protocol
> 'LIBPROCESS_SSL_ENABLE_TLS_V1_0'
> W0117 11:49:51.418932 26997 openssl.cpp:402] Failed SSL connections will
> be downgraded to a non-SSL socket
> I0117 11:49:51.418946 26997 openssl.cpp:419] CA file path is unspecified!
> NOTE: Set CA file path with LIBPROCESS_SSL_CA_FILE=<filepath>
> I0117 11:49:51.418954 26997 openssl.cpp:424] CA directory path
> unspecified! NOTE: Set CA directory path with LIBPROCESS_SSL_CA_DIR=<
> dirpath>
> I0117 11:49:51.418962 26997 openssl.cpp:429] Will not verify peer
> certificate!
> NOTE: Set LIBPROCESS_SSL_VERIFY_CERT=1 to enable peer certificate
> verification
> I0117 11:49:51.418970 26997 openssl.cpp:435] Will only verify peer
> certificate if presented!
> NOTE: Set LIBPROCESS_SSL_REQUIRE_CERT=1 to require peer certificate
> verification
> I0117 11:49:51.519923 26997 ssl_tests.cpp:586] Testing server protocol
> 'LIBPROCESS_SSL_ENABLE_TLS_V1_1'
> W0117 11:49:51.520504 26997 openssl.cpp:402] Failed SSL connections will
> be downgraded to a non-SSL socket
> I0117 11:49:51.520524 26997 openssl.cpp:419] CA file path is unspecified!
> NOTE: Set CA file path with LIBPROCESS_SSL_CA_FILE=<filepath>
> I0117 11:49:51.520529 26997 openssl.cpp:424] CA directory path
> unspecified! NOTE: Set CA directory path with LIBPROCESS_SSL_CA_DIR=<
> dirpath>
> I0117 11:49:51.520535 26997 openssl.cpp:429] Will not verify peer
> certificate!
> NOTE: Set LIBPROCESS_SSL_VERIFY_CERT=1 to enable peer certificate
> verification
> I0117 11:49:51.520542 26997 openssl.cpp:435] Will only verify peer
> certificate if presented!
> NOTE: Set LIBPROCESS_SSL_REQUIRE_CERT=1 to require peer certificate
> verification
> I0117 11:49:51.620995 26997 ssl_tests.cpp:586] Testing server protocol
> 'LIBPROCESS_SSL_ENABLE_TLS_V1_2'
> W0117 11:49:51.621526 26997 openssl.cpp:402] Failed SSL connections will
> be downgraded to a non-SSL socket
> I0117 11:49:51.621544 26997 openssl.cpp:419] CA file path is unspecified!
> NOTE: Set CA file path with LIBPROCESS_SSL_CA_FILE=<filepath>
> I0117 11:49:51.621551 26997 openssl.cpp:424] CA directory path
> unspecified! NOTE: Set CA directory path with LIBPROCESS_SSL_CA_DIR=<
> dirpath>
> I0117 11:49:51.621556 26997 openssl.cpp:429] Will not verify peer
> certificate!
> NOTE: Set LIBPROCESS_SSL_VERIFY_CERT=1 to enable peer certificate
> verification
> I0117 11:49:51.621562 26997 openssl.cpp:435] Will only verify peer
> certificate if presented!
> NOTE: Set LIBPROCESS_SSL_REQUIRE_CERT=1 to require peer certificate
> verification
> [       OK ] SSLTest.ValidDowngradeEachProtocol (906 ms)
> [ RUN      ] SSLTest.NoValidDowngradeEachProtocol
> I0117 11:49:51.907125 26997 ssl_tests.cpp:633] Testing server protocol
> 'LIBPROCESS_SSL_ENABLE_SSL_V3'
> I0117 11:49:51.907608 26997 openssl.cpp:419] CA file path is unspecified!
> NOTE: Set CA file path with LIBPROCESS_SSL_CA_FILE=<filepath>
> I0117 11:49:51.907621 26997 openssl.cpp:424] CA directory path
> unspecified! NOTE: Set CA directory path with LIBPROCESS_SSL_CA_DIR=<
> dirpath>
> I0117 11:49:51.907625 26997 openssl.cpp:429] Will not verify peer
> certificate!
> NOTE: Set LIBPROCESS_SSL_VERIFY_CERT=1 to enable peer certificate
> verification
> I0117 11:49:51.907632 26997 openssl.cpp:435] Will only verify peer
> certificate if presented!
> NOTE: Set LIBPROCESS_SSL_REQUIRE_CERT=1 to require peer certificate
> verification
> I0117 11:49:51.916640 27014 libevent_ssl_socket.cpp:1164] Socket error:
> error:140760FC:SSL routines:SSL23_GET_CLIENT_HELLO:unknown protocol
> I0117 11:49:51.923249 26997 ssl_tests.cpp:633] Testing server protocol
> 'LIBPROCESS_SSL_ENABLE_TLS_V1_0'
> I0117 11:49:51.923682 26997 openssl.cpp:419] CA file path is unspecified!
> NOTE: Set CA file path with LIBPROCESS_SSL_CA_FILE=<filepath>
> I0117 11:49:51.923697 26997 openssl.cpp:424] CA directory path
> unspecified! NOTE: Set CA directory path with LIBPROCESS_SSL_CA_DIR=<
> dirpath>
> I0117 11:49:51.923702 26997 openssl.cpp:429] Will not verify peer
> certificate!
> NOTE: Set LIBPROCESS_SSL_VERIFY_CERT=1 to enable peer certificate
> verification
> I0117 11:49:51.923710 26997 openssl.cpp:435] Will only verify peer
> certificate if presented!
> NOTE: Set LIBPROCESS_SSL_REQUIRE_CERT=1 to require peer certificate
> verification
> I0117 11:49:51.929636 27014 libevent_ssl_socket.cpp:1164] Socket error:
> error:140760FC:SSL routines:SSL23_GET_CLIENT_HELLO:unknown protocol
> I0117 11:49:52.024696 26997 ssl_tests.cpp:633] Testing server protocol
> 'LIBPROCESS_SSL_ENABLE_TLS_V1_1'
> I0117 11:49:52.025187 26997 openssl.cpp:419] CA file path is unspecified!
> NOTE: Set CA file path with LIBPROCESS_SSL_CA_FILE=<filepath>
> I0117 11:49:52.025202 26997 openssl.cpp:424] CA directory path
> unspecified! NOTE: Set CA directory path with LIBPROCESS_SSL_CA_DIR=<
> dirpath>
> I0117 11:49:52.025207 26997 openssl.cpp:429] Will not verify peer
> certificate!
> NOTE: Set LIBPROCESS_SSL_VERIFY_CERT=1 to enable peer certificate
> verification
> I0117 11:49:52.025213 26997 openssl.cpp:435] Will only verify peer
> certificate if presented!
> NOTE: Set LIBPROCESS_SSL_REQUIRE_CERT=1 to require peer certificate
> verification
> I0117 11:49:52.032613 27014 libevent_ssl_socket.cpp:1164] Socket error:
> error:140760FC:SSL routines:SSL23_GET_CLIENT_HELLO:unknown protocol
> I0117 11:49:52.125139 26997 ssl_tests.cpp:633] Testing server protocol
> 'LIBPROCESS_SSL_ENABLE_TLS_V1_2'
> I0117 11:49:52.125529 26997 openssl.cpp:419] CA file path is unspecified!
> NOTE: Set CA file path with LIBPROCESS_SSL_CA_FILE=<filepath>
> I0117 11:49:52.125542 26997 openssl.cpp:424] CA directory path
> unspecified! NOTE: Set CA directory path with LIBPROCESS_SSL_CA_DIR=<
> dirpath>
> I0117 11:49:52.125546 26997 openssl.cpp:429] Will not verify peer
> certificate!
> NOTE: Set LIBPROCESS_SSL_VERIFY_CERT=1 to enable peer certificate
> verification
> I0117 11:49:52.125550 26997 openssl.cpp:435] Will only verify peer
> certificate if presented!
> NOTE: Set LIBPROCESS_SSL_REQUIRE_CERT=1 to require peer certificate
> verification
> I0117 11:49:52.133208 27014 libevent_ssl_socket.cpp:1164] Socket error:
> error:140760FC:SSL routines:SSL23_GET_CLIENT_HELLO:unknown protocol
> [       OK ] SSLTest.NoValidDowngradeEachProtocol (504 ms)
> [ RUN      ] SSLTest.PeerAddress
> I0117 11:49:52.660032 26997 openssl.cpp:419] CA file path is unspecified!
> NOTE: Set CA file path with LIBPROCESS_SSL_CA_FILE=<filepath>
> I0117 11:49:52.660051 26997 openssl.cpp:424] CA directory path
> unspecified! NOTE: Set CA directory path with LIBPROCESS_SSL_CA_DIR=<
> dirpath>
> I0117 11:49:52.660056 26997 openssl.cpp:429] Will not verify peer
> certificate!
> NOTE: Set LIBPROCESS_SSL_VERIFY_CERT=1 to enable peer certificate
> verification
> I0117 11:49:52.660060 26997 openssl.cpp:435] Will only verify peer
> certificate if presented!
> NOTE: Set LIBPROCESS_SSL_REQUIRE_CERT=1 to require peer certificate
> verification
> [       OK ] SSLTest.PeerAddress (439 ms)
> [ RUN      ] SSLTest.HTTPSGet
> I0117 11:49:53.432847 26997 openssl.cpp:419] CA file path is unspecified!
> NOTE: Set CA file path with LIBPROCESS_SSL_CA_FILE=<filepath>
> I0117 11:49:53.432862 26997 openssl.cpp:424] CA directory path
> unspecified! NOTE: Set CA directory path with LIBPROCESS_SSL_CA_DIR=<
> dirpath>
> I0117 11:49:53.432868 26997 openssl.cpp:429] Will not verify peer
> certificate!
> NOTE: Set LIBPROCESS_SSL_VERIFY_CERT=1 to enable peer certificate
> verification
> I0117 11:49:53.432870 26997 openssl.cpp:435] Will only verify peer
> certificate if presented!
> NOTE: Set LIBPROCESS_SSL_REQUIRE_CERT=1 to require peer certificate
> verification
> [       OK ] SSLTest.HTTPSGet (775 ms)
> [ RUN      ] SSLTest.HTTPSPost
> I0117 11:49:54.196825 26997 openssl.cpp:419] CA file path is unspecified!
> NOTE: Set CA file path with LIBPROCESS_SSL_CA_FILE=<filepath>
> I0117 11:49:54.196853 26997 openssl.cpp:424] CA directory path
> unspecified! NOTE: Set CA directory path with LIBPROCESS_SSL_CA_DIR=<
> dirpath>
> I0117 11:49:54.196861 26997 openssl.cpp:429] Will not verify peer
> certificate!
> NOTE: Set LIBPROCESS_SSL_VERIFY_CERT=1 to enable peer certificate
> verification
> I0117 11:49:54.196867 26997 openssl.cpp:435] Will only verify peer
> certificate if presented!
> NOTE: Set LIBPROCESS_SSL_REQUIRE_CERT=1 to require peer certificate
> verification
> [       OK ] SSLTest.HTTPSPost (764 ms)
> [ RUN      ] SSLTest.SilentSocket
> I0117 11:49:54.308037 26997 openssl.cpp:419] CA file path is unspecified!
> NOTE: Set CA file path with LIBPROCESS_SSL_CA_FILE=<filepath>
> I0117 11:49:54.308051 26997 openssl.cpp:424] CA directory path
> unspecified! NOTE: Set CA directory path with LIBPROCESS_SSL_CA_DIR=<
> dirpath>
> I0117 11:49:54.308056 26997 openssl.cpp:429] Will not verify peer
> certificate!
> NOTE: Set LIBPROCESS_SSL_VERIFY_CERT=1 to enable peer certificate
> verification
> I0117 11:49:54.308060 26997 openssl.cpp:435] Will only verify peer
> certificate if presented!
> NOTE: Set LIBPROCESS_SSL_REQUIRE_CERT=1 to require peer certificate
> verification
> I0117 11:49:54.314100 27014 libevent_ssl_socket.cpp:1164] Socket error:
> error:00000000:lib(0):func(0):reason(0)
> [       OK ] SSLTest.SilentSocket (110 ms)
> [----------] 15 tests from SSLTest (9326 ms total)
>
> [----------] 38 tests from Scheme/HTTPTest
> [ RUN      ] Scheme/HTTPTest.Endpoints/0
> I0117 11:49:54.987277 26997 openssl.cpp:419] CA file path is unspecified!
> NOTE: Set CA file path with LIBPROCESS_SSL_CA_FILE=<filepath>
> I0117 11:49:54.987290 26997 openssl.cpp:424] CA directory path
> unspecified! NOTE: Set CA directory path with LIBPROCESS_SSL_CA_DIR=<
> dirpath>
> I0117 11:49:54.987295 26997 openssl.cpp:429] Will not verify peer
> certificate!
> NOTE: Set LIBPROCESS_SSL_VERIFY_CERT=1 to enable peer certificate
> verification
> I0117 11:49:54.987299 26997 openssl.cpp:435] Will only verify peer
> certificate if presented!
> NOTE: Set LIBPROCESS_SSL_REQUIRE_CERT=1 to require peer certificate
> verification
> I0117 11:49:54.990324 26997 process.cpp:1234] libprocess is initialized on
> 172.17.0.2:52873 with 16 worker threads
> I0117 11:49:54.995679 27764 process.cpp:3676] Handling HTTP event for
> process '(75)' with path: '/(75)/body'
> I0117 11:49:55.001126 27763 process.cpp:3676] Handling HTTP event for
> process '(75)' with path: '/(75)/pipe'
> I0117 11:49:55.006781 27760 process.cpp:3676] Handling HTTP event for
> process '(75)' with path: '/(75)/body'
> I0117 11:49:55.007284 27757 process.cpp:3733] Failed to process request
> for '/(75)/body': failure
> I0117 11:49:55.007302 27764 process.cpp:1435] Returning '500 Internal
> Server Error' for '/(75)/body' (failure)
> [       OK ] Scheme/HTTPTest.Endpoints/0 (694 ms)
> [ RUN      ] Scheme/HTTPTest.Endpoints/1
> I0117 11:49:55.010491 26997 process.cpp:1234] libprocess is initialized on
> 172.17.0.2:53839 with 16 worker threads
> I0117 11:49:55.011508 27785 process.cpp:3676] Handling HTTP event for
> process '(76)' with path: '/(76)/body'
> I0117 11:49:55.013010 27781 process.cpp:3676] Handling HTTP event for
> process '(76)' with path: '/(76)/pipe'
> I0117 11:49:55.014946 27784 process.cpp:3676] Handling HTTP event for
> process '(76)' with path: '/(76)/body'
> I0117 11:49:55.015354 27775 process.cpp:3733] Failed to process request
> for '/(76)/body': failure
> I0117 11:49:55.015374 27783 process.cpp:1435] Returning '500 Internal
> Server Error' for '/(76)/body' (failure)
> I0117 11:49:55.016083 27787 process.cpp:827] Decode failure: Connection
> reset by peer
> E0117 11:49:55.016124 27787 process.cpp:2398] Failed to shutdown socket
> with fd 9: Transport endpoint is not connected
> [       OK ] Scheme/HTTPTest.Endpoints/1 (8 ms)
> [ RUN      ] Scheme/HTTPTest.EndpointsHelp/0
> I0117 11:49:55.601507 26997 openssl.cpp:419] CA file path is unspecified!
> NOTE: Set CA file path with LIBPROCESS_SSL_CA_FILE=<filepath>
> I0117 11:49:55.601531 26997 openssl.cpp:424] CA directory path
> unspecified! NOTE: Set CA directory path with LIBPROCESS_SSL_CA_DIR=<
> dirpath>
> I0117 11:49:55.601536 26997 openssl.cpp:429] Will not verify peer
> certificate!
> NOTE: Set LIBPROCESS_SSL_VERIFY_CERT=1 to enable peer certificate
> verification
> I0117 11:49:55.601541 26997 openssl.cpp:435] Will only verify peer
> certificate if presented!
> NOTE: Set LIBPROCESS_SSL_REQUIRE_CERT=1 to require peer certificate
> verification
> I0117 11:49:55.603549 26997 process.cpp:1234] libprocess is initialized on
> 172.17.0.2:58251 with 16 worker threads
> I0117 11:49:55.608901 27795 process.cpp:3676] Handling HTTP event for
> process 'help' with path: '/help'
> I0117 11:49:55.614337 27789 process.cpp:3676] Handling HTTP event for
> process 'help' with path: '/help'
> I0117 11:49:55.620339 27799 process.cpp:3676] Handling HTTP event for
> process 'help' with path: '/help/(77)/body'
> I0117 11:49:55.625679 27800 process.cpp:3676] Handling HTTP event for
> process 'help' with path: '/help/(77)/a/b/c'
> [       OK ] Scheme/HTTPTest.EndpointsHelp/0 (611 ms)
> [ RUN      ] Scheme/HTTPTest.EndpointsHelp/1
> I0117 11:49:55.629791 26997 process.cpp:1234] libprocess is initialized on
> 172.17.0.2:42757 with 16 worker threads
> I0117 11:49:55.630893 27806 process.cpp:3676] Handling HTTP event for
> process 'help' with path: '/help'
> I0117 11:49:55.632705 27811 process.cpp:3676] Handling HTTP event for
> process 'help' with path: '/help'
> I0117 11:49:55.635308 27820 process.cpp:3676] Handling HTTP event for
> process 'help' with path: '/help/(78)/body'
> I0117 11:49:55.636939 27805 process.cpp:3676] Handling HTTP event for
> process 'help' with path: '/help/(78)/a/b/c'
> [       OK ] Scheme/HTTPTest.EndpointsHelp/1 (11 ms)
> [ RUN      ] Scheme/HTTPTest.EndpointsHelpRemoval/0
> I0117 11:49:55.897253 26997 openssl.cpp:419] CA file path is unspecified!
> NOTE: Set CA file path with LIBPROCESS_SSL_CA_FILE=<filepath>
> I0117 11:49:55.897271 26997 openssl.cpp:424] CA directory path
> unspecified! NOTE: Set CA directory path with LIBPROCESS_SSL_CA_DIR=<
> dirpath>
> I0117 11:49:55.897276 26997 openssl.cpp:429] Will not verify peer
> certificate!
> NOTE: Set LIBPROCESS_SSL_VERIFY_CERT=1 to enable peer certificate
> verification
> I0117 11:49:55.897280 26997 openssl.cpp:435] Will only verify peer
> certificate if presented!
> NOTE: Set LIBPROCESS_SSL_REQUIRE_CERT=1 to require peer certificate
> verification
> I0117 11:49:55.899603 26997 process.cpp:1234] libprocess is initialized on
> 172.17.0.2:54531 with 16 worker threads
> I0117 11:49:55.905266 27832 process.cpp:3676] Handling HTTP event for
> process 'help' with path: '/help/(79)/body'
> I0117 11:49:55.911088 27825 process.cpp:3676] Handling HTTP event for
> process 'help' with path: '/help/(79)/bogus'
> [       OK ] Scheme/HTTPTest.EndpointsHelpRemoval/0 (274 ms)
> [ RUN      ] Scheme/HTTPTest.EndpointsHelpRemoval/1
> I0117 11:49:55.914919 26997 process.cpp:1234] libprocess is initialized on
> 172.17.0.2:57929 with 16 worker threads
> I0117 11:49:55.916008 27851 process.cpp:3676] Handling HTTP event for
> process 'help' with path: '/help/(80)/body'
> I0117 11:49:55.918054 27851 process.cpp:3676] Handling HTTP event for
> process 'help' with path: '/help/(80)/bogus'
> [       OK ] Scheme/HTTPTest.EndpointsHelpRemoval/1 (7 ms)
> [ RUN      ] Scheme/HTTPTest.PipeEOF/0
> I0117 11:49:56.100818 26997 openssl.cpp:419] CA file path is unspecified!
> NOTE: Set CA file path with LIBPROCESS_SSL_CA_FILE=<filepath>
> I0117 11:49:56.100834 26997 openssl.cpp:424] CA directory path
> unspecified! NOTE: Set CA directory path with LIBPROCESS_SSL_CA_DIR=<
> dirpath>
> I0117 11:49:56.100841 26997 openssl.cpp:429] Will not verify peer
> certificate!
> NOTE: Set LIBPROCESS_SSL_VERIFY_CERT=1 to enable peer certificate
> verification
> I0117 11:49:56.100848 26997 openssl.cpp:435] Will only verify peer
> certificate if presented!
> NOTE: Set LIBPROCESS_SSL_REQUIRE_CERT=1 to require peer certificate
> verification
> I0117 11:49:56.112924 26997 process.cpp:1234] libprocess is initialized on
> 172.17.0.2:38696 with 16 worker threads
> [       OK ] Scheme/HTTPTest.PipeEOF/0 (196 ms)
> [ RUN      ] Scheme/HTTPTest.PipeEOF/1
> *** Aborted at 1484653796 (unix time) try "date -d @1484653796" if you are
> using GNU date ***
> PC: @     0x2aef0db86eee (unknown)
> *** SIGSEGV (@0x3978018) received by PID 26997 (TID 0x2aef0ece5700) from
> PID 60260376; stack trace: ***
>     @     0x2aef0c018330 (unknown)
>     @     0x2aef0db86eee (unknown)
>     @     0x2aef0d389e30 (unknown)
>     @     0x2aef0d38a48c (unknown)
> I0117 11:49:56.118458 26997 process.cpp:1234] libprocess is initialized on
> 172.17.0.2:60582 with 16 worker threads
> [       OK ] Scheme/HTTPTest.PipeEOF/1 (4 ms)
> [ RUN      ] Scheme/HTTPTest.PipeFailure/0
>     @           0x422351 process::UPID::UPID()
>     @           0x86d458 process::DispatchEvent::DispatchEvent()
>     @           0x866330 process::internal::dispatch()
>     @           0x87e728 process::dispatch<>()
>     @           0x865326 process::ProcessBase::route()
>     @           0x93d4bf process::ProcessBase::route<>()
>     @           0x939a1f process::Help::initialize()
>     @           0x85ec77 process::ProcessManager::resume()
>     @           0x85b75c _ZZN7process14ProcessManager12i
> nit_threadsEvENKUt_clEv
>     @           0x86cbe4 _ZNSt12_Bind_simpleIFZN7process14ProcessMan
> ager12init_threadsEvEUt_vEE9_M_invokeIIEEEvSt12_Index_tupleIIXspT_EEE
>     @           0x86cb3b _ZNSt12_Bind_simpleIFZN7process14ProcessMan
> ager12init_threadsEvEUt_vEEclEv
>     @           0x86cad4 _ZNSt6thread5_ImplISt12_Bind_
> simpleIFZN7process14ProcessManager12init_threadsEvEUt_vEEE6_M_runEv
>     @     0x2aef0d380a60 (unknown)
>     @     0x2aef0c010184 start_thread
>     @     0x2aef0dbe937d (unknown)
> make[7]: *** [check-local] Segmentation fault
> make[7]: Leaving directory `/mesos/mesos-1.2.0/_build/3rdparty/libprocess'
> make[6]: *** [check-am] Error 2
> make[6]: Leaving directory `/mesos/mesos-1.2.0/_build/3rdparty/libprocess'
> make[5]: *** [check-recursive] Error 1
> make[5]: Leaving directory `/mesos/mesos-1.2.0/_build/3rdparty/libprocess'
> make[4]: *** [check] Error 2
> make[4]: Leaving directory `/mesos/mesos-1.2.0/_build/3rdparty/libprocess'
> make[3]: *** [check-recursive] Error 1
> make[3]: Leaving directory `/mesos/mesos-1.2.0/_build/3rdparty'
> make[2]: *** [check] Error 2
> make[2]: Leaving directory `/mesos/mesos-1.2.0/_build/3rdparty'
> make[1]: *** [check-recursive] Error 1
> make[1]: Leaving directory `/mesos/mesos-1.2.0/_build'
> make: *** [distcheck] Error 1
> + docker rmi mesos-1484652192-25570
> Untagged: mesos-1484652192-25570:latest
> Deleted: sha256:f6fbfe9554b2a70c521f70c39cb806
> 82a5c1fdc78eecc3daf3eb3da3b0119269
> Deleted: sha256:a394858f1c2bad3d575285b6e91092
> ae77bc7f5033b4e749fad3cc2f6ffe862e
> Deleted: sha256:86a7fddffa1b35a8cf8056ca62a607
> 174756b09cdf8492af98570636b89df9cf
> Deleted: sha256:9a620d63647d5fe3b91edee65369c8
> 84bffd465c02984ba0d344c1d810611333
> Deleted: sha256:6d512cdd36f3028a596e601def03c7
> dd6a658de9c01e188f5294bdbbe7fd3c3f
> Deleted: sha256:4800e56f3f6497686b7147fce68b73
> b8521dbea7d24a647388b22dc4e0da32b3
> Deleted: sha256:45cb572e758185bdf10c96ac1bb811
> 030af442e8f34b7b99465d53e0acff3c89
> Deleted: sha256:cd1608bffaf1a362dfbe57f51f7f56
> cac66845da2b82ddc01643f4f3cb2f9f5b
> Deleted: sha256:27842830dda64a37b1d360df6b8a9c
> e0eff2084749bfedb746beb7cc017bd058
> Deleted: sha256:e90ea818b65cf18eed9e6e386f1c84
> 5126156bef032f88a32076b5e3316a2c5e
> Deleted: sha256:062caac1739306f11f2be6c50eb280
> 8f5400bc9bc8e28e29ac27049e8b13a2c7
> Deleted: sha256:dcb6124f39db5d0a0b8269eb3e8fc5
> 3d205b039cbe36e2a9575ef4fd35584631
> Deleted: sha256:aea7da5e98ad0bc4781b728ced810a
> b51de3204e7ff244661d791161e6221d52
> Deleted: sha256:d9b75cce1b88cf972dd570ba5c14dc
> 902a304d707d663206f1f50f0d7811539d
> Deleted: sha256:161ac772ec21f8970888569f552f5d
> 472e5873c38811662b14fb46a86427eb33
> Deleted: sha256:fbbf8d2ce4193ceb7c8a1be9811165
> 50fce0c96ef5ef8c24cfa0e22dff309c43
> Deleted: sha256:8d2d09fcde5b2c3934e53acba33215
> 081fec58c632b780e15406754b4099061d
> Deleted: sha256:c1568b1063ddb3d33f81c1419305bc
> d92945f63936e2f34107d1ae4fdf6b240f
> Deleted: sha256:6bd54084af22a1607f0e726beb7b6e
> 97640ca3a7eee10483b47851148c069458
> Deleted: sha256:33e03959b4516f36e78dfc6ed0950a
> d10f0de01c7b5160a4fac748ad86394294
> Deleted: sha256:c6423f6edbd25bad2b7a81e9fad369
> 64bdba40d672e56daadc059551b270864c
> Deleted: sha256:a493b25dedcfc228f8653e15574503
> a1bb1ff5c50f2679dbbbfa0c097d3c6c52
> Deleted: sha256:24acd2675927224fc0f5fa41d20f11
> 1a414fe3a5a956f5884a2cb92fc95118d6
> Deleted: sha256:e40a8d6b3db4178e7b1f4d343cf709
> bd75122e102f2ab843883973a0c49a678c
> Build step 'Execute shell' marked build as failure
>

Jenkins build is back to normal : Mesos-Buildbot » autotools,gcc,--verbose --enable-libevent --enable-ssl,GLOG_v=1 MESOS_VERBOSE=1,ubuntu:14.04,(docker||Hadoop)&&(!ubuntu-us1)&&(!ubuntu-6)&&(!ubuntu-eu2) #3118

Posted by Apache Jenkins Server <je...@builds.apache.org>.
See <https://builds.apache.org/job/Mesos-Buildbot/BUILDTOOL=autotools,COMPILER=gcc,CONFIGURATION=--verbose%20--enable-libevent%20--enable-ssl,ENVIRONMENT=GLOG_v=1%20MESOS_VERBOSE=1,OS=ubuntu%3A14.04,label_exp=(docker%7C%7CHadoop)&&(!ubuntu-us1)&&(!ubuntu-6)&&(!ubuntu-eu2)/3118/changes>