You are viewing a plain text version of this content. The canonical link for it is here.
Posted to builds@beam.apache.org by Apache Jenkins Server <je...@builds.apache.org> on 2020/06/17 06:35:57 UTC
Build failed in Jenkins: beam_PostCommit_Python35_VR_Flink #2173
See <https://builds.apache.org/job/beam_PostCommit_Python35_VR_Flink/2173/display/redirect?page=changes>
Changes:
[github] [BEAM-10217] CALL_FUNCTION and CALL_METHOD fixes (#11966)
------------------------------------------
[...truncated 2.83 MB...]
return self._restriction_tracker.check_done()
File "<https://builds.apache.org/job/beam_PostCommit_Python35_VR_Flink/ws/src/sdks/python/apache_beam/io/restriction_trackers.py",> line 101, in check_done
self._range.stop))
ValueError: OffsetRestrictionTracker is not done since work in range [0, 3) has not been claimed.
at java.util.concurrent.CompletableFuture.reportGet(CompletableFuture.java:357)
at java.util.concurrent.CompletableFuture.get(CompletableFuture.java:1908)
at org.apache.beam.sdk.util.MoreFutures.get(MoreFutures.java:57)
at org.apache.beam.runners.fnexecution.control.SdkHarnessClient$BundleProcessor$ActiveBundle.close(SdkHarnessClient.java:458)
at org.apache.beam.runners.fnexecution.control.DefaultJobBundleFactory$SimpleStageBundleFactory$1.close(DefaultJobBundleFactory.java:552)
at org.apache.beam.runners.flink.translation.wrappers.streaming.ExecutableStageDoFnOperator$SdkHarnessDoFnRunner.finishBundle(ExecutableStageDoFnOperator.java:781)
... 12 more
Caused by: java.lang.RuntimeException: Error received from SDK harness for instruction 4: Traceback (most recent call last):
File "<https://builds.apache.org/job/beam_PostCommit_Python35_VR_Flink/ws/src/sdks/python/apache_beam/runners/worker/sdk_worker.py",> line 247, in _execute
response = task()
File "<https://builds.apache.org/job/beam_PostCommit_Python35_VR_Flink/ws/src/sdks/python/apache_beam/runners/worker/sdk_worker.py",> line 304, in <lambda>
lambda: self.create_worker().do_instruction(request), request)
File "<https://builds.apache.org/job/beam_PostCommit_Python35_VR_Flink/ws/src/sdks/python/apache_beam/runners/worker/sdk_worker.py",> line 473, in do_instruction
getattr(request, request_type), request.instruction_id)
File "<https://builds.apache.org/job/beam_PostCommit_Python35_VR_Flink/ws/src/sdks/python/apache_beam/runners/worker/sdk_worker.py",> line 508, in process_bundle
bundle_processor.process_bundle(instruction_id))
File "<https://builds.apache.org/job/beam_PostCommit_Python35_VR_Flink/ws/src/sdks/python/apache_beam/runners/worker/bundle_processor.py",> line 954, in process_bundle
element.data)
File "<https://builds.apache.org/job/beam_PostCommit_Python35_VR_Flink/ws/src/sdks/python/apache_beam/runners/worker/bundle_processor.py",> line 218, in process_encoded
self.output(decoded_value)
File "<https://builds.apache.org/job/beam_PostCommit_Python35_VR_Flink/ws/src/sdks/python/apache_beam/runners/worker/operations.py",> line 332, in output
cython.cast(Receiver, self.receivers[output_index]).receive(windowed_value)
File "<https://builds.apache.org/job/beam_PostCommit_Python35_VR_Flink/ws/src/sdks/python/apache_beam/runners/worker/operations.py",> line 195, in receive
self.consumer.process(windowed_value)
File "<https://builds.apache.org/job/beam_PostCommit_Python35_VR_Flink/ws/src/sdks/python/apache_beam/runners/worker/operations.py",> line 764, in process
delayed_application = self.dofn_runner.process_with_sized_restriction(o)
File "<https://builds.apache.org/job/beam_PostCommit_Python35_VR_Flink/ws/src/sdks/python/apache_beam/runners/common.py",> line 975, in process_with_sized_restriction
watermark_estimator=watermark_estimator)
File "<https://builds.apache.org/job/beam_PostCommit_Python35_VR_Flink/ws/src/sdks/python/apache_beam/runners/common.py",> line 712, in invoke_process
windowed_value, additional_args, additional_kwargs)
File "<https://builds.apache.org/job/beam_PostCommit_Python35_VR_Flink/ws/src/sdks/python/apache_beam/runners/common.py",> line 819, in _invoke_process_per_window
self.threadsafe_restriction_tracker.check_done()
File "<https://builds.apache.org/job/beam_PostCommit_Python35_VR_Flink/ws/src/sdks/python/apache_beam/runners/sdf_utils.py",> line 115, in check_done
return self._restriction_tracker.check_done()
File "<https://builds.apache.org/job/beam_PostCommit_Python35_VR_Flink/ws/src/sdks/python/apache_beam/io/restriction_trackers.py",> line 101, in check_done
self._range.stop))
ValueError: OffsetRestrictionTracker is not done since work in range [0, 3) has not been claimed.
at org.apache.beam.runners.fnexecution.control.FnApiControlClient$ResponseStreamObserver.onNext(FnApiControlClient.java:177)
at org.apache.beam.runners.fnexecution.control.FnApiControlClient$ResponseStreamObserver.onNext(FnApiControlClient.java:157)
at org.apache.beam.vendor.grpc.v1p26p0.io.grpc.stub.ServerCalls$StreamingServerCallHandler$StreamingServerCallListener.onMessage(ServerCalls.java:251)
at org.apache.beam.vendor.grpc.v1p26p0.io.grpc.ForwardingServerCallListener.onMessage(ForwardingServerCallListener.java:33)
at org.apache.beam.vendor.grpc.v1p26p0.io.grpc.Contexts$ContextualizedServerCallListener.onMessage(Contexts.java:76)
at org.apache.beam.vendor.grpc.v1p26p0.io.grpc.internal.ServerCallImpl$ServerStreamListenerImpl.messagesAvailableInternal(ServerCallImpl.java:309)
at org.apache.beam.vendor.grpc.v1p26p0.io.grpc.internal.ServerCallImpl$ServerStreamListenerImpl.messagesAvailable(ServerCallImpl.java:292)
at org.apache.beam.vendor.grpc.v1p26p0.io.grpc.internal.ServerImpl$JumpToApplicationThreadServerStreamListener$1MessagesAvailable.runInContext(ServerImpl.java:782)
at org.apache.beam.vendor.grpc.v1p26p0.io.grpc.internal.ContextRunnable.run(ContextRunnable.java:37)
at org.apache.beam.vendor.grpc.v1p26p0.io.grpc.internal.SerializingExecutor.run(SerializingExecutor.java:123)
at java.util.concurrent.ThreadPoolExecutor.runWorker(ThreadPoolExecutor.java:1149)
at java.util.concurrent.ThreadPoolExecutor$Worker.run(ThreadPoolExecutor.java:624)
... 1 more
ERROR:root:java.lang.RuntimeException: Error received from SDK harness for instruction 4: Traceback (most recent call last):
File "<https://builds.apache.org/job/beam_PostCommit_Python35_VR_Flink/ws/src/sdks/python/apache_beam/runners/worker/sdk_worker.py",> line 247, in _execute
response = task()
File "<https://builds.apache.org/job/beam_PostCommit_Python35_VR_Flink/ws/src/sdks/python/apache_beam/runners/worker/sdk_worker.py",> line 304, in <lambda>
lambda: self.create_worker().do_instruction(request), request)
File "<https://builds.apache.org/job/beam_PostCommit_Python35_VR_Flink/ws/src/sdks/python/apache_beam/runners/worker/sdk_worker.py",> line 473, in do_instruction
getattr(request, request_type), request.instruction_id)
File "<https://builds.apache.org/job/beam_PostCommit_Python35_VR_Flink/ws/src/sdks/python/apache_beam/runners/worker/sdk_worker.py",> line 508, in process_bundle
bundle_processor.process_bundle(instruction_id))
File "<https://builds.apache.org/job/beam_PostCommit_Python35_VR_Flink/ws/src/sdks/python/apache_beam/runners/worker/bundle_processor.py",> line 954, in process_bundle
element.data)
File "<https://builds.apache.org/job/beam_PostCommit_Python35_VR_Flink/ws/src/sdks/python/apache_beam/runners/worker/bundle_processor.py",> line 218, in process_encoded
self.output(decoded_value)
File "<https://builds.apache.org/job/beam_PostCommit_Python35_VR_Flink/ws/src/sdks/python/apache_beam/runners/worker/operations.py",> line 332, in output
cython.cast(Receiver, self.receivers[output_index]).receive(windowed_value)
File "<https://builds.apache.org/job/beam_PostCommit_Python35_VR_Flink/ws/src/sdks/python/apache_beam/runners/worker/operations.py",> line 195, in receive
self.consumer.process(windowed_value)
File "<https://builds.apache.org/job/beam_PostCommit_Python35_VR_Flink/ws/src/sdks/python/apache_beam/runners/worker/operations.py",> line 764, in process
delayed_application = self.dofn_runner.process_with_sized_restriction(o)
File "<https://builds.apache.org/job/beam_PostCommit_Python35_VR_Flink/ws/src/sdks/python/apache_beam/runners/common.py",> line 975, in process_with_sized_restriction
watermark_estimator=watermark_estimator)
File "<https://builds.apache.org/job/beam_PostCommit_Python35_VR_Flink/ws/src/sdks/python/apache_beam/runners/common.py",> line 712, in invoke_process
windowed_value, additional_args, additional_kwargs)
File "<https://builds.apache.org/job/beam_PostCommit_Python35_VR_Flink/ws/src/sdks/python/apache_beam/runners/common.py",> line 819, in _invoke_process_per_window
self.threadsafe_restriction_tracker.check_done()
File "<https://builds.apache.org/job/beam_PostCommit_Python35_VR_Flink/ws/src/sdks/python/apache_beam/runners/sdf_utils.py",> line 115, in check_done
return self._restriction_tracker.check_done()
File "<https://builds.apache.org/job/beam_PostCommit_Python35_VR_Flink/ws/src/sdks/python/apache_beam/io/restriction_trackers.py",> line 101, in check_done
self._range.stop))
ValueError: OffsetRestrictionTracker is not done since work in range [0, 3) has not been claimed.
INFO:apache_beam.runners.portability.portable_runner:Job state changed to FAILED
.sssINFO:apache_beam.runners.worker.worker_pool_main:Listening for workers at localhost:42311
WARNING:root:Make sure that locally built Python SDK docker image has Python 3.5 interpreter.
INFO:root:Using Python SDK docker image: apache/beam_python3.5_sdk:2.23.0.dev. If the image is not available at local, we will try to pull from hub.docker.com
INFO:apache_beam.runners.portability.portable_runner:Environment "LOOPBACK" has started a component necessary for the execution. Be sure to run the pipeline using
with Pipeline() as p:
p.apply(..)
This ensures that the pipeline finishes before this program exits.
INFO:apache_beam.runners.portability.portable_runner:Job state changed to STOPPED
INFO:apache_beam.runners.portability.portable_runner:Job state changed to STARTING
INFO:apache_beam.runners.portability.portable_runner:Job state changed to RUNNING
[flink-runner-job-invoker] WARN org.apache.flink.runtime.webmonitor.WebMonitorUtils - Log file environment variable 'log.file' is not set.
[flink-runner-job-invoker] WARN org.apache.flink.runtime.webmonitor.WebMonitorUtils - JobManager log files are unavailable in the web dashboard. Log file location not found in environment variable 'log.file' or configuration key 'Key: 'web.log.path' , default: null (fallback keys: [{key=jobmanager.web.log.path, isDeprecated=true}])'.
[[5]{Create, Map(<lambda at fn_runner_test.py:485>), WindowInto(WindowIntoFn), Map(<lambda at fn_runner_test.py:488>)} (1/2)] WARN org.apache.flink.metrics.MetricGroup - The operator name [5]{Create, Map(<lambda at fn_runner_test.py:485>), WindowInto(WindowIntoFn), Map(<lambda at fn_runner_test.py:488>)} exceeded the 80 characters length limit and was truncated.
[[5]{Create, Map(<lambda at fn_runner_test.py:485>), WindowInto(WindowIntoFn), Map(<lambda at fn_runner_test.py:488>)} (2/2)] WARN org.apache.flink.metrics.MetricGroup - The operator name [5]{Create, Map(<lambda at fn_runner_test.py:485>), WindowInto(WindowIntoFn), Map(<lambda at fn_runner_test.py:488>)} exceeded the 80 characters length limit and was truncated.
INFO:apache_beam.runners.worker.statecache:Creating state cache with size 0
INFO:apache_beam.runners.worker.sdk_worker:Creating insecure control channel for localhost:37883.
INFO:apache_beam.runners.worker.sdk_worker:Control channel established.
INFO:apache_beam.runners.worker.sdk_worker:Initializing SDKHarness with unbounded number of workers.
INFO:apache_beam.runners.worker.sdk_worker:Creating insecure state channel for localhost:42279.
INFO:apache_beam.runners.worker.sdk_worker:State channel established.
INFO:apache_beam.runners.worker.data_plane:Creating client data channel for localhost:35841
INFO:apache_beam.runners.worker.sdk_worker:No more requests from control plane
INFO:apache_beam.runners.worker.sdk_worker:SDK Harness waiting for in-flight requests to complete
INFO:apache_beam.runners.worker.data_plane:Closing all cached grpc data channels.
INFO:apache_beam.runners.worker.sdk_worker:Closing all cached gRPC state handlers.
INFO:apache_beam.runners.worker.sdk_worker:Done consuming work.
[grpc-default-executor-0] WARN org.apache.beam.sdk.fn.data.BeamFnDataGrpcMultiplexer - Hanged up for unknown endpoint.
[assert_that/Group/GroupByKey -> [3]assert_that/{Group, Unkey, Match} (1/2)] WARN org.apache.beam.sdk.fn.data.BeamFnDataGrpcMultiplexer - Hanged up for unknown endpoint.
INFO:apache_beam.runners.portability.portable_runner:Job state changed to DONE
.INFO:apache_beam.runners.worker.worker_pool_main:Listening for workers at localhost:43985
WARNING:root:Make sure that locally built Python SDK docker image has Python 3.5 interpreter.
INFO:root:Using Python SDK docker image: apache/beam_python3.5_sdk:2.23.0.dev. If the image is not available at local, we will try to pull from hub.docker.com
INFO:apache_beam.runners.portability.portable_runner:Environment "LOOPBACK" has started a component necessary for the execution. Be sure to run the pipeline using
with Pipeline() as p:
p.apply(..)
This ensures that the pipeline finishes before this program exits.
INFO:apache_beam.runners.portability.portable_runner:Job state changed to STOPPED
INFO:apache_beam.runners.portability.portable_runner:Job state changed to STARTING
INFO:apache_beam.runners.portability.portable_runner:Job state changed to RUNNING
[flink-runner-job-invoker] WARN org.apache.flink.runtime.webmonitor.WebMonitorUtils - Log file environment variable 'log.file' is not set.
[flink-runner-job-invoker] WARN org.apache.flink.runtime.webmonitor.WebMonitorUtils - JobManager log files are unavailable in the web dashboard. Log file location not found in environment variable 'log.file' or configuration key 'Key: 'web.log.path' , default: null (fallback keys: [{key=jobmanager.web.log.path, isDeprecated=true}])'.
INFO:apache_beam.runners.worker.statecache:Creating state cache with size 0
INFO:apache_beam.runners.worker.sdk_worker:Creating insecure control channel for localhost:38821.
INFO:apache_beam.runners.worker.sdk_worker:Control channel established.
INFO:apache_beam.runners.worker.sdk_worker:Initializing SDKHarness with unbounded number of workers.
INFO:apache_beam.runners.worker.sdk_worker:Creating insecure state channel for localhost:45611.
INFO:apache_beam.runners.worker.sdk_worker:State channel established.
INFO:apache_beam.runners.worker.data_plane:Creating client data channel for localhost:44075
INFO:apache_beam.runners.worker.sdk_worker:No more requests from control plane
INFO:apache_beam.runners.worker.sdk_worker:SDK Harness waiting for in-flight requests to complete
INFO:apache_beam.runners.worker.data_plane:Closing all cached grpc data channels.
INFO:apache_beam.runners.worker.sdk_worker:Closing all cached gRPC state handlers.
[grpc-default-executor-0] WARN org.apache.beam.sdk.fn.data.BeamFnDataGrpcMultiplexer - Hanged up for unknown endpoint.
[assert_that/Group/GroupByKey -> [3]assert_that/{Group, Unkey, Match} (1/2)] WARN org.apache.beam.sdk.fn.data.BeamFnDataGrpcMultiplexer - Hanged up for unknown endpoint.
INFO:apache_beam.runners.worker.sdk_worker:Done consuming work.
INFO:apache_beam.runners.portability.portable_runner:Job state changed to DONE
.INFO:__main__:removing conf dir: /tmp/flinktest-conf4cmx7lpq
==================== Timed out after 60 seconds. ====================
# Thread: <Thread(Thread-122, started daemon 140667906938624)>
# Thread: <Thread(Thread-121, started daemon 140666873042688)>
# Thread: <_MainThread(MainThread, started 140668734711552)>
# Thread: <_Worker(Thread-18, started daemon 140666864649984)>
# Thread: <_Worker(Thread-37, started daemon 140666839471872)>
# Thread: <_Worker(Thread-8, started daemon 140667418306304)>
======================================================================
ERROR: test_external_transforms (__main__.FlinkRunnerTest)
----------------------------------------------------------------------
Traceback (most recent call last):
File "/usr/lib/python3.5/argparse.py", line 169, in __init__
width = int(_os.environ['COLUMNS'])
File "<https://builds.apache.org/job/beam_PostCommit_Python35_VR_Flink/ws/src/build/gradleenv/2022703439/lib/python3.5/os.py",> line 725, in __getitem__
raise KeyError(key) from None
KeyError: 'COLUMNS'
During handling of the above exception, another exception occurred:
Traceback (most recent call last):
File "<https://builds.apache.org/job/beam_PostCommit_Python35_VR_Flink/ws/src/sdks/python/apache_beam/runners/portability/flink_runner_test.py",> line 225, in test_external_transforms
expansion_service=get_expansion_service()))
File "<https://builds.apache.org/job/beam_PostCommit_Python35_VR_Flink/ws/src/sdks/python/apache_beam/pipeline.py",> line 547, in __exit__
self.run().wait_until_finish()
File "<https://builds.apache.org/job/beam_PostCommit_Python35_VR_Flink/ws/src/sdks/python/apache_beam/pipeline.py",> line 526, in run
return self.runner.run_pipeline(self, self._options)
File "<https://builds.apache.org/job/beam_PostCommit_Python35_VR_Flink/ws/src/sdks/python/apache_beam/runners/portability/portable_runner.py",> line 389, in run_pipeline
job_service_handle.submit(proto_pipeline)
File "<https://builds.apache.org/job/beam_PostCommit_Python35_VR_Flink/ws/src/sdks/python/apache_beam/runners/portability/portable_runner.py",> line 106, in submit
prepare_response = self.prepare(proto_pipeline)
File "<https://builds.apache.org/job/beam_PostCommit_Python35_VR_Flink/ws/src/sdks/python/apache_beam/runners/portability/portable_runner.py",> line 183, in prepare
pipeline_options=self.get_pipeline_options()),
File "<https://builds.apache.org/job/beam_PostCommit_Python35_VR_Flink/ws/src/sdks/python/apache_beam/runners/portability/portable_runner.py",> line 165, in get_pipeline_options
retain_unknown_options=self._retain_unknown_options)
File "<https://builds.apache.org/job/beam_PostCommit_Python35_VR_Flink/ws/src/sdks/python/apache_beam/options/pipeline_options.py",> line 288, in get_all_options
add_extra_args_fn(parser)
File "<https://builds.apache.org/job/beam_PostCommit_Python35_VR_Flink/ws/src/sdks/python/apache_beam/runners/portability/portable_runner.py",> line 155, in add_runner_options
parser.add_argument("--%s" % option.name, **add_arg_args)
File "/usr/lib/python3.5/argparse.py", line 1349, in add_argument
self._get_formatter()._format_args(action, None)
File "/usr/lib/python3.5/argparse.py", line 2354, in _get_formatter
return self.formatter_class(prog=self.prog)
File "/usr/lib/python3.5/argparse.py", line 169, in __init__
width = int(_os.environ['COLUMNS'])
File "<https://builds.apache.org/job/beam_PostCommit_Python35_VR_Flink/ws/src/sdks/python/apache_beam/runners/portability/portable_runner_test.py",> line 82, in handler
raise BaseException(msg)
BaseException: Timed out after 60 seconds.
----------------------------------------------------------------------
Ran 82 tests in 555.388s
FAILED (errors=1, skipped=16)
> Task :sdks:python:test-suites:portable:py35:flinkCompatibilityMatrixStreamingPreOptimizeLOOPBACK FAILED
FAILURE: Build completed with 2 failures.
1: Task failed with an exception.
-----------
* Where:
Script '<https://builds.apache.org/job/beam_PostCommit_Python35_VR_Flink/ws/src/sdks/python/test-suites/portable/common.gradle'> line: 55
* What went wrong:
Execution failed for task ':sdks:python:test-suites:portable:py35:flinkCompatibilityMatrixStreamingLOOPBACK'.
> Process 'command 'sh'' finished with non-zero exit value 1
* Try:
Run with --stacktrace option to get the stack trace. Run with --info or --debug option to get more log output. Run with --scan to get full insights.
==============================================================================
2: Task failed with an exception.
-----------
* Where:
Script '<https://builds.apache.org/job/beam_PostCommit_Python35_VR_Flink/ws/src/sdks/python/test-suites/portable/common.gradle'> line: 55
* What went wrong:
Execution failed for task ':sdks:python:test-suites:portable:py35:flinkCompatibilityMatrixStreamingPreOptimizeLOOPBACK'.
> Process 'command 'sh'' finished with non-zero exit value 1
* Try:
Run with --stacktrace option to get the stack trace. Run with --info or --debug option to get more log output. Run with --scan to get full insights.
==============================================================================
* Get more help at https://help.gradle.org
Deprecated Gradle features were used in this build, making it incompatible with Gradle 6.0.
Use '--warning-mode all' to show the individual deprecation warnings.
See https://docs.gradle.org/5.2.1/userguide/command_line_interface.html#sec:command_line_warnings
BUILD FAILED in 34m 50s
78 actionable tasks: 58 executed, 19 from cache, 1 up-to-date
Publishing build scan...
https://gradle.com/s/kd6zvvdgicxqy
Build step 'Invoke Gradle script' changed build result to FAILURE
Build step 'Invoke Gradle script' marked build as failure
---------------------------------------------------------------------
To unsubscribe, e-mail: builds-unsubscribe@beam.apache.org
For additional commands, e-mail: builds-help@beam.apache.org
Build failed in Jenkins: beam_PostCommit_Python35_VR_Flink #2174
Posted by Apache Jenkins Server <je...@builds.apache.org>.
See <https://builds.apache.org/job/beam_PostCommit_Python35_VR_Flink/2174/display/redirect>
Changes:
------------------------------------------
[...truncated 30.09 KB...]
Collecting virtualenv>=14.0.0
Using cached virtualenv-20.0.23-py2.py3-none-any.whl (4.7 MB)
> Task :sdks:java:core:shadowJar
> Task :sdks:go:resolveBuildDependencies
Resolving github.com/hashicorp/hcl: commit='23c074d0eceb2b8a5bfdbb271ab780cde70f05a8', urls=[https://github.com/hashicorp/hcl.git, git@github.com:hashicorp/hcl.git]
Resolving github.com/ianlancetaylor/demangle: commit='4883227f66371e02c4948937d3e2be1664d9be38', urls=[https://github.com/ianlancetaylor/demangle.git, git@github.com:ianlancetaylor/demangle.git]
Resolving cached github.com/coreos/etcd: commit='11214aa33bf5a47d3d9d8dafe0f6b97237dfe921', urls=[https://github.com/coreos/etcd.git, git@github.com:coreos/etcd.git]
Resolving cached github.com/coreos/etcd: commit='11214aa33bf5a47d3d9d8dafe0f6b97237dfe921', urls=[https://github.com/coreos/etcd.git, git@github.com:coreos/etcd.git]
Resolving github.com/kr/fs: commit='2788f0dbd16903de03cb8186e5c7d97b69ad387b', urls=[https://github.com/kr/fs.git, git@github.com:kr/fs.git]
Resolving cached github.com/coreos/etcd: commit='11214aa33bf5a47d3d9d8dafe0f6b97237dfe921', urls=[https://github.com/coreos/etcd.git, git@github.com:coreos/etcd.git]
Resolving github.com/magiconair/properties: commit='49d762b9817ba1c2e9d0c69183c2b4a8b8f1d934', urls=[https://github.com/magiconair/properties.git, git@github.com:magiconair/properties.git]
Resolving cached github.com/coreos/etcd: commit='11214aa33bf5a47d3d9d8dafe0f6b97237dfe921', urls=[https://github.com/coreos/etcd.git, git@github.com:coreos/etcd.git]
Resolving cached github.com/coreos/etcd: commit='11214aa33bf5a47d3d9d8dafe0f6b97237dfe921', urls=[https://github.com/coreos/etcd.git, git@github.com:coreos/etcd.git]
Resolving github.com/mitchellh/go-homedir: commit='b8bc1bf767474819792c23f32d8286a45736f1c6', urls=[https://github.com/mitchellh/go-homedir.git, git@github.com:mitchellh/go-homedir.git]
Resolving github.com/mitchellh/mapstructure: commit='a4e142e9c047c904fa2f1e144d9a84e6133024bc', urls=[https://github.com/mitchellh/mapstructure.git, git@github.com:mitchellh/mapstructure.git]
Resolving github.com/nightlyone/lockfile: commit='0ad87eef1443f64d3d8c50da647e2b1552851124', urls=[https://github.com/nightlyone/lockfile, git@github.com:nightlyone/lockfile.git]
Resolving cached github.com/coreos/etcd: commit='11214aa33bf5a47d3d9d8dafe0f6b97237dfe921', urls=[https://github.com/coreos/etcd.git, git@github.com:coreos/etcd.git]
Resolving github.com/openzipkin/zipkin-go: commit='3741243b287094fda649c7f0fa74bd51f37dc122', urls=[https://github.com/openzipkin/zipkin-go.git, git@github.com:openzipkin/zipkin-go.git]
Resolving github.com/pelletier/go-toml: commit='acdc4509485b587f5e675510c4f2c63e90ff68a8', urls=[https://github.com/pelletier/go-toml.git, git@github.com:pelletier/go-toml.git]
Resolving cached github.com/coreos/etcd: commit='11214aa33bf5a47d3d9d8dafe0f6b97237dfe921', urls=[https://github.com/coreos/etcd.git, git@github.com:coreos/etcd.git]
Resolving github.com/pierrec/lz4: commit='ed8d4cc3b461464e69798080a0092bd028910298', urls=[https://github.com/pierrec/lz4.git, git@github.com:pierrec/lz4.git]
Resolving github.com/pierrec/xxHash: commit='a0006b13c722f7f12368c00a3d3c2ae8a999a0c6', urls=[https://github.com/pierrec/xxHash.git, git@github.com:pierrec/xxHash.git]
Resolving github.com/pkg/errors: commit='30136e27e2ac8d167177e8a583aa4c3fea5be833', urls=[https://github.com/pkg/errors.git, git@github.com:pkg/errors.git]
Resolving github.com/pkg/sftp: commit='22e9c1ccc02fc1b9fa3264572e49109b68a86947', urls=[https://github.com/pkg/sftp.git, git@github.com:pkg/sftp.git]
Resolving github.com/prometheus/client_golang: commit='9bb6ab929dcbe1c8393cd9ef70387cb69811bd1c', urls=[https://github.com/prometheus/client_golang.git, git@github.com:prometheus/client_golang.git]
Resolving cached github.com/coreos/etcd: commit='11214aa33bf5a47d3d9d8dafe0f6b97237dfe921', urls=[https://github.com/coreos/etcd.git, git@github.com:coreos/etcd.git]
Resolving cached github.com/coreos/etcd: commit='11214aa33bf5a47d3d9d8dafe0f6b97237dfe921', urls=[https://github.com/coreos/etcd.git, git@github.com:coreos/etcd.git]
Resolving github.com/prometheus/procfs: commit='cb4147076ac75738c9a7d279075a253c0cc5acbd', urls=[https://github.com/prometheus/procfs.git, git@github.com:prometheus/procfs.git]
Resolving github.com/rcrowley/go-metrics: commit='8732c616f52954686704c8645fe1a9d59e9df7c1', urls=[https://github.com/rcrowley/go-metrics.git, git@github.com:rcrowley/go-metrics.git]
Resolving github.com/cpuguy83/go-md2man: commit='dc9f53734905c233adfc09fd4f063dce63ce3daf', urls=[https://github.com/cpuguy83/go-md2man.git, git@github.com:cpuguy83/go-md2man.git]
Resolving cached github.com/cpuguy83/go-md2man: commit='dc9f53734905c233adfc09fd4f063dce63ce3daf', urls=[https://github.com/cpuguy83/go-md2man.git, git@github.com:cpuguy83/go-md2man.git]
Resolving cached github.com/coreos/etcd: commit='11214aa33bf5a47d3d9d8dafe0f6b97237dfe921', urls=[https://github.com/coreos/etcd.git, git@github.com:coreos/etcd.git]
Resolving cached github.com/coreos/etcd: commit='11214aa33bf5a47d3d9d8dafe0f6b97237dfe921', urls=[https://github.com/coreos/etcd.git, git@github.com:coreos/etcd.git]
Resolving github.com/spf13/afero: commit='bb8f1927f2a9d3ab41c9340aa034f6b803f4359c', urls=[https://github.com/spf13/afero.git, git@github.com:spf13/afero.git]
Resolving github.com/spf13/cast: commit='acbeb36b902d72a7a4c18e8f3241075e7ab763e4', urls=[https://github.com/spf13/cast.git, git@github.com:spf13/cast.git]
Resolving github.com/spf13/cobra: commit='93959269ad99e80983c9ba742a7e01203a4c0e4f', urls=[https://github.com/spf13/cobra.git, git@github.com:spf13/cobra.git]
Resolving github.com/spf13/jwalterweatherman: commit='7c0cea34c8ece3fbeb2b27ab9b59511d360fb394', urls=[https://github.com/spf13/jwalterweatherman.git, git@github.com:spf13/jwalterweatherman.git]
Resolving cached github.com/coreos/etcd: commit='11214aa33bf5a47d3d9d8dafe0f6b97237dfe921', urls=[https://github.com/coreos/etcd.git, git@github.com:coreos/etcd.git]
Resolving github.com/spf13/viper: commit='aafc9e6bc7b7bb53ddaa75a5ef49a17d6e654be5', urls=[https://github.com/spf13/viper.git, git@github.com:spf13/viper.git]
Resolving github.com/stathat/go: commit='74669b9f388d9d788c97399a0824adbfee78400e', urls=[https://github.com/stathat/go.git, git@github.com:stathat/go.git]
Resolving cached github.com/coreos/etcd: commit='11214aa33bf5a47d3d9d8dafe0f6b97237dfe921', urls=[https://github.com/coreos/etcd.git, git@github.com:coreos/etcd.git]
Resolving cached github.com/coreos/etcd: commit='11214aa33bf5a47d3d9d8dafe0f6b97237dfe921', urls=[https://github.com/coreos/etcd.git, git@github.com:coreos/etcd.git]
Resolving cached github.com/coreos/etcd: commit='11214aa33bf5a47d3d9d8dafe0f6b97237dfe921', urls=[https://github.com/coreos/etcd.git, git@github.com:coreos/etcd.git]
Resolving cached github.com/coreos/etcd: commit='11214aa33bf5a47d3d9d8dafe0f6b97237dfe921', urls=[https://github.com/coreos/etcd.git, git@github.com:coreos/etcd.git]
Resolving github.com/xordataexchange/crypt: commit='b2862e3d0a775f18c7cfe02273500ae307b61218', urls=[https://github.com/xordataexchange/crypt.git, git@github.com:xordataexchange/crypt.git]
Resolving go.opencensus.io: commit='aa2b39d1618ef56ba156f27cfcdae9042f68f0bc', urls=[https://github.com/census-instrumentation/opencensus-go]
Resolving golang.org/x/crypto: commit='d9133f5469342136e669e85192a26056b587f503', urls=[https://go.googlesource.com/crypto]
> Task :vendor:sdks-java-extensions-protobuf:compileJava FROM-CACHE
> Task :vendor:sdks-java-extensions-protobuf:classes UP-TO-DATE
> Task :sdks:java:extensions:protobuf:extractIncludeProto
> Task :sdks:java:extensions:protobuf:generateProto NO-SOURCE
> Task :sdks:java:container:pullLicenses
> Task :buildSrc:spotlessGroovy
> Task :buildSrc:spotlessGroovyCheck
> Task :buildSrc:spotlessGroovyGradle
> Task :buildSrc:spotlessGroovyGradleCheck
> Task :buildSrc:spotlessCheck
> Task :buildSrc:pluginUnderTestMetadata
> Task :buildSrc:compileTestJava NO-SOURCE
> Task :buildSrc:compileTestGroovy NO-SOURCE
> Task :buildSrc:processTestResources NO-SOURCE
> Task :buildSrc:testClasses UP-TO-DATE
> Task :buildSrc:test NO-SOURCE
> Task :buildSrc:validateTaskProperties
> Task :buildSrc:check
> Task :buildSrc:build
Configuration on demand is an incubating feature.
> Task :sdks:java:extensions:google-cloud-platform-core:compileJava FROM-CACHE
> Task :sdks:java:extensions:google-cloud-platform-core:classes UP-TO-DATE
> Task :sdks:java:extensions:google-cloud-platform-core:jar
> Task :sdks:java:extensions:protobuf:compileJava FROM-CACHE
> Task :sdks:java:extensions:protobuf:classes UP-TO-DATE
> Task :sdks:java:fn-execution:compileJava FROM-CACHE
> Task :sdks:java:fn-execution:classes UP-TO-DATE
> Task :runners:core-construction-java:compileJava FROM-CACHE
> Task :runners:core-construction-java:classes UP-TO-DATE
> Task :sdks:java:extensions:protobuf:jar
> Task :vendor:sdks-java-extensions-protobuf:shadowJar
> Task :sdks:java:fn-execution:jar
> Task :sdks:python:test-suites:portable:py35:setupVirtualenv
Collecting grpcio>=1.14.2
Using cached grpcio-1.29.0-cp35-cp35m-manylinux2010_x86_64.whl (3.0 MB)
> Task :runners:core-construction-java:jar
> Task :runners:core-java:compileJava FROM-CACHE
> Task :runners:core-java:classes UP-TO-DATE
> Task :runners:core-java:jar
> Task :sdks:java:harness:compileJava FROM-CACHE
> Task :sdks:java:harness:classes UP-TO-DATE
> Task :sdks:java:harness:jar
> Task :sdks:go:resolveBuildDependencies
Resolving golang.org/x/debug: commit='95515998a8a4bd7448134b2cb5971dbeb12e0b77', urls=[https://go.googlesource.com/debug]
Resolving golang.org/x/net: commit='2fb46b16b8dda405028c50f7c7f0f9dd1fa6bfb1', urls=[https://go.googlesource.com/net]
Resolving golang.org/x/oauth2: commit='a032972e28060ca4f5644acffae3dfc268cc09db', urls=[https://go.googlesource.com/oauth2]
Resolving golang.org/x/sync: commit='fd80eb99c8f653c847d294a001bdf2a3a6f768f5', urls=[https://go.googlesource.com/sync]
Resolving golang.org/x/sys: commit='37707fdb30a5b38865cfb95e5aab41707daec7fd', urls=[https://go.googlesource.com/sys]
Resolving cached github.com/coreos/etcd: commit='11214aa33bf5a47d3d9d8dafe0f6b97237dfe921', urls=[https://github.com/coreos/etcd.git, git@github.com:coreos/etcd.git]
Resolving cached github.com/coreos/etcd: commit='11214aa33bf5a47d3d9d8dafe0f6b97237dfe921', urls=[https://github.com/coreos/etcd.git, git@github.com:coreos/etcd.git]
> Task :sdks:python:test-suites:portable:py35:setupVirtualenv
Collecting protobuf>=3.5.0.post1
Using cached protobuf-3.12.2-cp35-cp35m-manylinux1_x86_64.whl (1.3 MB)
Collecting importlib-metadata>=0.12; python_version < "3.8"
Using cached importlib_metadata-1.6.1-py2.py3-none-any.whl (31 kB)
Collecting importlib-resources>=1.0; python_version < "3.7"
Using cached importlib_resources-2.0.1-py2.py3-none-any.whl (22 kB)
Collecting appdirs<2,>=1.4.3
Using cached appdirs-1.4.4-py2.py3-none-any.whl (9.6 kB)
Processing /home/jenkins/.cache/pip/wheels/94/5a/46/d8f983987fd0c952afdb2db57ec55e7a7642e88db2d57ab674/distlib-0.3.0-py3-none-any.whl
Collecting zipp>=0.5
Using cached zipp-1.2.0-py2.py3-none-any.whl (4.8 kB)
Installing collected packages: toml, six, py, zipp, importlib-metadata, pluggy, filelock, importlib-resources, appdirs, distlib, virtualenv, tox, grpcio, protobuf, grpcio-tools, future, mypy-protobuf
Successfully installed appdirs-1.4.4 distlib-0.3.0 filelock-3.0.12 future-0.18.2 grpcio-1.29.0 grpcio-tools-1.14.2 importlib-metadata-1.6.1 importlib-resources-2.0.1 mypy-protobuf-1.18 pluggy-0.13.1 protobuf-3.12.2 py-1.8.2 six-1.15.0 toml-0.10.1 tox-3.11.1 virtualenv-20.0.23 zipp-1.2.0
> Task :sdks:java:container:pullLicenses
> Configure project :sdks:java:container
Found go 1.12 in /usr/bin/go, use it.
> Configure project :sdks:go
Found go 1.12 in /usr/bin/go, use it.
> Configure project :sdks:go:container
Found go 1.12 in /usr/bin/go, use it.
> Configure project :sdks:go:examples
Found go 1.12 in /usr/bin/go, use it.
> Configure project :sdks:go:test
Found go 1.12 in /usr/bin/go, use it.
> Configure project :sdks:python:container
Found go 1.12 in /usr/bin/go, use it.
> Task :sdks:java:harness:shadowJar
> Task :runners:java-fn-execution:compileJava FROM-CACHE
> Task :runners:java-fn-execution:classes UP-TO-DATE
> Task :runners:java-fn-execution:jar
> Task :sdks:java:expansion-service:compileJava FROM-CACHE
> Task :sdks:java:expansion-service:classes UP-TO-DATE
> Task :sdks:java:expansion-service:jar
> Task :runners:java-job-service:compileJava FROM-CACHE
> Task :runners:java-job-service:classes UP-TO-DATE
> Task :runners:java-job-service:jar
> Task :sdks:java:io:kafka:compileJava FROM-CACHE
> Task :sdks:java:io:kafka:classes UP-TO-DATE
> Task :sdks:java:io:kafka:jar
> Task :runners:flink:1.10:compileJava FROM-CACHE
> Task :runners:flink:1.10:classes
> Task :sdks:java:io:google-cloud-platform:compileJava FROM-CACHE
> Task :sdks:java:io:google-cloud-platform:classes UP-TO-DATE
> Task :runners:flink:1.10:jar
> Task :runners:flink:1.10:job-server:compileJava NO-SOURCE
> Task :runners:flink:1.10:job-server:classes UP-TO-DATE
> Task :sdks:java:io:google-cloud-platform:jar
> Task :sdks:java:container:pullLicenses FAILED
The message received from the daemon indicates that the daemon has disappeared.
Build request sent: Build{id=74598591-d21b-432a-a737-1a67dc55aa66, currentDir=<https://builds.apache.org/job/beam_PostCommit_Python35_VR_Flink/ws/src}>
Attempting to read last messages from the daemon log...
Daemon pid: 20735
log file: /home/jenkins/.gradle/daemon/5.2.1/daemon-20735.out.log
----- Last 20 lines from daemon log file - daemon-20735.out.log -----
12:02:34.330 [DEBUG] [org.gradle.cache.internal.DefaultFileLockManager] Lock acquired on daemon addresses registry.
12:02:34.331 [DEBUG] [org.gradle.cache.internal.DefaultFileLockManager] Releasing lock on daemon addresses registry.
12:02:34.331 [DEBUG] [org.gradle.launcher.daemon.server.DaemonStateCoordinator] resetting idle timer
12:02:34.331 [DEBUG] [org.gradle.launcher.daemon.server.DaemonStateCoordinator] daemon is running. Sleeping until state changes.
12:02:34.332 [INFO] [org.gradle.launcher.daemon.server.exec.StartBuildOrRespondWithBusy] Daemon is about to start building Build{id=74598591-d21b-432a-a737-1a67dc55aa66, currentDir=<https://builds.apache.org/job/beam_PostCommit_Python35_VR_Flink/ws/src}.> Dispatching build started information...
12:02:34.332 [DEBUG] [org.gradle.launcher.daemon.server.SynchronizedDispatchConnection] thread 109: dispatching class org.gradle.launcher.daemon.protocol.BuildStarted
12:02:34.332 [DEBUG] [org.gradle.launcher.daemon.server.exec.EstablishBuildEnvironment] Configuring env variables: {PATH=/home/jenkins/tools/java/latest1.8/bin:/usr/local/sbin:/usr/local/bin:/usr/sbin:/usr/bin:/sbin:/bin:/usr/games:/usr/local/games, RUN_DISPLAY_URL=https://builds.apache.org/job/beam_PostCommit_Python35_VR_Flink/2174/display/redirect, HUDSON_HOME=/x1/jenkins/jenkins-home, RUN_CHANGES_DISPLAY_URL=https://builds.apache.org/job/beam_PostCommit_Python35_VR_Flink/2174/display/redirect?page=changes, JOB_URL=https://builds.apache.org/job/beam_PostCommit_Python35_VR_Flink/, HUDSON_COOKIE=6d7f8d25-832a-4bb1-b48d-bf65b5c1d6f5, NIX_LABEL=ubuntu, SLACK_WEBHOOK_URL=****, SUDO_USER=yifanzou, MAIL=/var/mail/jenkins, WIN_LABEL=Windows, JENKINS_SERVER_COOKIE=f4ebd1e6b0d976e8, USERNAME=root, LOGNAME=jenkins, PWD=<https://builds.apache.org/job/beam_PostCommit_Python35_VR_Flink/ws/src,> JENKINS_URL=https://builds.apache.org/, SHELL=/bin/bash, BUILD_TAG=jenkins-beam_PostCommit_Python35_VR_Flink-2174, GIT_AUTHOR_EMAIL=builds@apache.org, LESSOPEN=| /usr/bin/lesspipe %s, ROOT_BUILD_CAUSE=TIMERTRIGGER, BUILD_CAUSE_TIMERTRIGGER=true, GIT_AUTHOR_NAME=jenkins, OLDPWD=<https://builds.apache.org/job/beam_PostCommit_Python35_VR_Flink/ws/src,> JENKINS_HOME=/x1/jenkins/jenkins-home, sha1=master, NODE_NAME=apache-beam-jenkins-6, BUILD_DISPLAY_NAME=#2174, JOB_DISPLAY_URL=https://builds.apache.org/job/beam_PostCommit_Python35_VR_Flink/display/redirect, GIT_BRANCH=origin/master, LS_COLORS=rs=0:di=01;34:ln=01;36:mh=00:pi=40;33:so=01;35:do=01;35:bd=40;33;01:cd=40;33;01:or=40;31;01:mi=00:su=37;41:sg=30;43:ca=30;41:tw=30;42:ow=34;42:st=37;44:ex=01;32:*.tar=01;31:*.tgz=01;31:*.arc=01;31:*.arj=01;31:*.taz=01;31:*.lha=01;31:*.lz4=01;31:*.lzh=01;31:*.lzma=01;31:*.tlz=01;31:*.txz=01;31:*.tzo=01;31:*.t7z=01;31:*.zip=01;31:*.z=01;31:*.Z=01;31:*.dz=01;31:*.gz=01;31:*.lrz=01;31:*.lz=01;31:*.lzo=01;31:*.xz=01;31:*.bz2=01;31:*.bz=01;31:*.tbz=01;31:*.tbz2=01;31:*.tz=01;31:*.deb=01;31:*.rpm=01;31:*.jar=01;31:*.war=01;31:*.ear=01;31:*.sar=01;31:*.rar=01;31:*.alz=01;31:*.ace=01;31:*.zoo=01;31:*.cpio=01;31:*.7z=01;31:*.rz=01;31:*.cab=01;31:*.jpg=01;35:*.jpeg=01;35:*.gif=01;35:*.bmp=01;35:*.pbm=01;35:*.pgm=01;35:*.ppm=01;35:*.tga=01;35:*.xbm=01;35:*.xpm=01;35:*.tif=01;35:*.tiff=01;35:*.png=01;35:*.svg=01;35:*.svgz=01;35:*.mng=01;35:*.pcx=01;35:*.mov=01;35:*.mpg=01;35:*.mpeg=01;35:*.m2v=01;35:*.mkv=01;35:*.webm=01;35:*.ogm=01;35:*.mp4=01;35:*.m4v=01;35:*.mp4v=01;35:*.vob=01;35:*.qt=01;35:*.nuv=01;35:*.wmv=01;35:*.asf=01;35:*.rm=01;35:*.rmvb=01;35:*.flc=01;35:*.avi=01;35:*.fli=01;35:*.flv=01;35:*.gl=01;35:*.dl=01;35:*.xcf=01;35:*.xwd=01;35:*.yuv=01;35:*.cgm=01;35:*.emf=01;35:*.ogv=01;35:*.ogx=01;35:*.aac=00;36:*.au=00;36:*.flac=00;36:*.m4a=00;36:*.mid=00;36:*.midi=00;36:*.mka=00;36:*.mp3=00;36:*.mpc=00;36:*.ogg=00;36:*.ra=00;36:*.wav=00;36:*.oga=00;36:*.opus=00;36:*.spx=00;36:*.xspf=00;36:, SHLVL=1, GIT_PREVIOUS_COMMIT=fb3daf93af5e504f96ed81c637405b935cf1721e, LESSCLOSE=/usr/bin/lesspipe %s %s, JAVA_HOME=/home/jenkins/tools/java/latest1.8, TERM=xterm-256color, BUILD_ID=2174, LANG=en_US.UTF-8, JOB_NAME=beam_PostCommit_Python35_VR_Flink, SPARK_LOCAL_IP=127.0.0.1, BUILD_CAUSE=TIMERTRIGGER, SUDO_GID=1014, GIT_PREVIOUS_SUCCESSFUL_COMMIT=ca0611abe06d15734f85fcbcfa9fdc980c66db11, NODE_LABELS=apache-beam-jenkins-6 beam, HUDSON_URL=https://builds.apache.org/, WORKSPACE=<https://builds.apache.org/job/beam_PostCommit_Python35_VR_Flink/ws/,> ROOT_BUILD_CAUSE_TIMERTRIGGER=true, SUDO_UID=1013, _=/usr/bin/nohup, GIT_COMMIT=fb3daf93af5e504f96ed81c637405b935cf1721e, COVERALLS_REPO_TOKEN=****, EXECUTOR_NUMBER=0, HUDSON_SERVER_COOKIE=f4ebd1e6b0d976e8, GIT_COMMITTER_NAME=jenkins, JOB_BASE_NAME=beam_PostCommit_Python35_VR_Flink, USER=jenkins, SUDO_COMMAND=/bin/su jenkins, BUILD_NUMBER=2174, BUILD_URL=https://builds.apache.org/job/beam_PostCommit_Python35_VR_Flink/2174/, GIT_COMMITTER_EMAIL=builds@apache.org, GIT_URL=https://github.com/apache/beam.git, HOME=/home/jenkins}
12:02:34.334 [DEBUG] [org.gradle.launcher.daemon.server.exec.LogToClient] About to start relaying all logs to the client via the connection.
12:02:34.335 [INFO] [org.gradle.launcher.daemon.server.exec.LogToClient] The client will now receive all logging from the daemon (pid: 20735). The daemon log file: /home/jenkins/.gradle/daemon/5.2.1/daemon-20735.out.log
12:02:34.336 [INFO] [org.gradle.launcher.daemon.server.exec.LogAndCheckHealth] Starting 2nd build in daemon [uptime: 2 mins 5.472 secs, performance: 98%]
12:02:34.336 [DEBUG] [org.gradle.launcher.daemon.server.exec.ExecuteBuild] The daemon has started executing the build.
12:02:34.337 [DEBUG] [org.gradle.launcher.daemon.server.exec.ExecuteBuild] Executing build with daemon context: DefaultDaemonContext[uid=37de8c12-3377-46bc-8017-3a110f28bb24,javaHome=/usr/lib/jvm/java-8-openjdk-amd64,daemonRegistryDir=/home/jenkins/.gradle/daemon,pid=20735,idleTimeout=10800000,priority=NORMAL,daemonOpts=-Xss10240k,-Dfile.encoding=UTF-8,-Duser.country=US,-Duser.language=en,-Duser.variant]
Configuration on demand is an incubating feature.
Found go 1.12 in /usr/bin/go, use it.
Found go 1.12 in /usr/bin/go, use it.
Found go 1.12 in /usr/bin/go, use it.
Found go 1.12 in /usr/bin/go, use it.
Found go 1.12 in /usr/bin/go, use it.
Found go 1.12 in /usr/bin/go, use it.
Daemon vm is shutting down... The daemon has exited normally or was terminated in response to a user interrupt.
----- End of the daemon log -----
FAILURE: Build failed with an exception.
* What went wrong:
Gradle build daemon disappeared unexpectedly (it may have been killed or may have crashed)
> Task :sdks:java:container:generateLicenseReport
* Try:
Run with --stacktrace option to get the stack trace. Run with --info or --debug option to get more log output. Run with --scan to get full insights.
* Get more help at https://help.gradle.org
> Task :sdks:java:container:copyDockerfileDependencies
> Task :runners:flink:1.10:job-server:shadowJar
> Task :sdks:go:resolveBuildDependencies
Resolving google.golang.org/api: commit='386d4e5f4f92f86e6aec85985761bba4b938a2d5', urls=[https://code.googlesource.com/google-api-go-client]
Resolving google.golang.org/genproto: commit='2b5a72b8730b0b16380010cfe5286c42108d88e7', urls=[https://github.com/google/go-genproto]
Resolving google.golang.org/grpc: commit='7646b5360d049a7ca31e9133315db43456f39e2e', urls=[https://github.com/grpc/grpc-go]
Resolving cached github.com/coreos/etcd: commit='11214aa33bf5a47d3d9d8dafe0f6b97237dfe921', urls=[https://github.com/coreos/etcd.git, git@github.com:coreos/etcd.git]
Resolving cached github.com/coreos/etcd: commit='11214aa33bf5a47d3d9d8dafe0f6b97237dfe921', urls=[https://github.com/coreos/etcd.git, git@github.com:coreos/etcd.git]
> Task :sdks:go:installDependencies
> Task :sdks:go:buildLinuxAmd64
> Task :sdks:go:goBuild
> Task :sdks:java:container:resolveBuildDependencies
Resolving ./github.com/apache/beam/sdks/go@<https://builds.apache.org/job/beam_PostCommit_Python35_VR_Flink/ws/src/sdks/go>
> Task :sdks:java:container:installDependencies
> Task :sdks:java:container:buildLinuxAmd64
> Task :sdks:java:container:goBuild
FAILURE: Build failed with an exception.
* What went wrong:
Execution failed for task ':sdks:java:container:pullLicenses'.
> Process 'command './sdks/java/container/license_scripts/license_script.sh'' finished with non-zero exit value 1
* Try:
Run with --stacktrace option to get the stack trace. Run with --info or --debug option to get more log output. Run with --scan to get full insights.
* Get more help at https://help.gradle.org
Deprecated Gradle features were used in this build, making it incompatible with Gradle 6.0.
Use '--warning-mode all' to show the individual deprecation warnings.
See https://docs.gradle.org/5.2.1/userguide/command_line_interface.html#sec:command_line_warnings
BUILD FAILED in 2m 10s
73 actionable tasks: 53 executed, 19 from cache, 1 up-to-date
Publishing build scan...
https://gradle.com/s/nvhbm2qpjf7tg
Build step 'Invoke Gradle script' changed build result to FAILURE
Build step 'Invoke Gradle script' marked build as failure
---------------------------------------------------------------------
To unsubscribe, e-mail: builds-unsubscribe@beam.apache.org
For additional commands, e-mail: builds-help@beam.apache.org