You are viewing a plain text version of this content. The canonical link for it is here.
Posted to issues@tez.apache.org by Apache Jenkins Server <je...@builds.apache.org> on 2015/08/03 11:23:38 UTC
Failed: TEZ-2647 PreCommit Build #950
Jira: https://issues.apache.org/jira/browse/TEZ-2647
Build: https://builds.apache.org/job/PreCommit-TEZ-Build/950/
###################################################################################
########################## LAST 60 LINES OF THE CONSOLE ###########################
[...truncated 2836 lines...]
{color:red}-1 overall{color}. Here are the results of testing the latest attachment
http://issues.apache.org/jira/secure/attachment/12748413/TEZ-2647.1.patch
against master revision f37699f.
{color:green}+1 @author{color}. The patch does not contain any @author tags.
{color:green}+1 tests included{color}. The patch appears to include 10 new or modified test files.
{color:green}+1 javac{color}. The applied patch does not increase the total number of javac compiler warnings.
{color:green}+1 javadoc{color}. There were no new javadoc warning messages.
{color:green}+1 findbugs{color}. The patch does not introduce any new Findbugs (version 3.0.1) warnings.
{color:green}+1 release audit{color}. The applied patch does not increase the total number of release audit warnings.
{color:red}-1 core tests{color}. The patch failed these unit tests in :
org.apache.tez.test.TestFaultTolerance
Test results: https://builds.apache.org/job/PreCommit-TEZ-Build/950//testReport/
Console output: https://builds.apache.org/job/PreCommit-TEZ-Build/950//console
This message is automatically generated.
======================================================================
======================================================================
Adding comment to Jira.
======================================================================
======================================================================
Comment added.
c33df5ba42815674fd406c520dcbd26cc2d77b8e logged out
======================================================================
======================================================================
Finished build.
======================================================================
======================================================================
Build step 'Execute shell' marked build as failure
Archiving artifacts
Sending artifact delta relative to PreCommit-TEZ-Build #949
Archived 50 artifacts
Archive block size is 32768
Received 4 blocks and 2882446 bytes
Compression is 4.3%
Took 0.83 sec
[description-setter] Could not determine description.
Recording test results
Email was triggered for: Failure
Sending email for trigger: Failure
###################################################################################
############################## FAILED TESTS (if any) ##############################
1 tests failed.
REGRESSION: org.apache.tez.test.TestFaultTolerance.testMultiVersionInputFailureWithoutExit
Error Message:
expected:<SUCCEEDED> but was:<FAILED>
Stack Trace:
java.lang.AssertionError: expected:<SUCCEEDED> but was:<FAILED>
at org.junit.Assert.fail(Assert.java:88)
at org.junit.Assert.failNotEquals(Assert.java:743)
at org.junit.Assert.assertEquals(Assert.java:118)
at org.junit.Assert.assertEquals(Assert.java:144)
at org.apache.tez.test.TestFaultTolerance.runDAGAndVerify(TestFaultTolerance.java:135)
at org.apache.tez.test.TestFaultTolerance.runDAGAndVerify(TestFaultTolerance.java:114)
at org.apache.tez.test.TestFaultTolerance.testMultiVersionInputFailureWithoutExit(TestFaultTolerance.java:326)
Success: TEZ-2647 PreCommit Build #952
Posted by Apache Jenkins Server <je...@builds.apache.org>.
Jira: https://issues.apache.org/jira/browse/TEZ-2647
Build: https://builds.apache.org/job/PreCommit-TEZ-Build/952/
###################################################################################
########################## LAST 60 LINES OF THE CONSOLE ###########################
[...truncated 3212 lines...]
[INFO] Final Memory: 90M/1466M
[INFO] ------------------------------------------------------------------------
{color:green}+1 overall{color}. Here are the results of testing the latest attachment
http://issues.apache.org/jira/secure/attachment/12748516/TEZ-2647.1.patch
against master revision 4d381d7.
{color:green}+1 @author{color}. The patch does not contain any @author tags.
{color:green}+1 tests included{color}. The patch appears to include 10 new or modified test files.
{color:green}+1 javac{color}. The applied patch does not increase the total number of javac compiler warnings.
{color:green}+1 javadoc{color}. There were no new javadoc warning messages.
{color:green}+1 findbugs{color}. The patch does not introduce any new Findbugs (version 3.0.1) warnings.
{color:green}+1 release audit{color}. The applied patch does not increase the total number of release audit warnings.
{color:green}+1 core tests{color}. The patch passed unit tests in .
Test results: https://builds.apache.org/job/PreCommit-TEZ-Build/952//testReport/
Console output: https://builds.apache.org/job/PreCommit-TEZ-Build/952//console
This message is automatically generated.
======================================================================
======================================================================
Adding comment to Jira.
======================================================================
======================================================================
Comment added.
d1869d55d12b29929c4543f043afe07581a0c7b8 logged out
======================================================================
======================================================================
Finished build.
======================================================================
======================================================================
Archiving artifacts
Sending artifact delta relative to PreCommit-TEZ-Build #949
Archived 50 artifacts
Archive block size is 32768
Received 24 blocks and 2278867 bytes
Compression is 25.7%
Took 7.2 sec
Description set: TEZ-2647
Recording test results
Email was triggered for: Success
Sending email for trigger: Success
###################################################################################
############################## FAILED TESTS (if any) ##############################
All tests passed
Failed: TEZ-2647 PreCommit Build #951
Posted by Apache Jenkins Server <je...@builds.apache.org>.
Jira: https://issues.apache.org/jira/browse/TEZ-2647
Build: https://builds.apache.org/job/PreCommit-TEZ-Build/951/
###################################################################################
########################## LAST 60 LINES OF THE CONSOLE ###########################
[...truncated 2902 lines...]
{color:red}-1 overall{color}. Here are the results of testing the latest attachment
http://issues.apache.org/jira/secure/attachment/12748413/TEZ-2647.1.patch
against master revision f37699f.
{color:green}+1 @author{color}. The patch does not contain any @author tags.
{color:green}+1 tests included{color}. The patch appears to include 10 new or modified test files.
{color:green}+1 javac{color}. The applied patch does not increase the total number of javac compiler warnings.
{color:green}+1 javadoc{color}. There were no new javadoc warning messages.
{color:green}+1 findbugs{color}. The patch does not introduce any new Findbugs (version 3.0.1) warnings.
{color:green}+1 release audit{color}. The applied patch does not increase the total number of release audit warnings.
{color:red}-1 core tests{color}. The patch failed these unit tests in :
org.apache.tez.dag.history.logging.ats.TestHistoryEventTimelineConversion
Test results: https://builds.apache.org/job/PreCommit-TEZ-Build/951//testReport/
Console output: https://builds.apache.org/job/PreCommit-TEZ-Build/951//console
This message is automatically generated.
======================================================================
======================================================================
Adding comment to Jira.
======================================================================
======================================================================
Comment added.
37844d4620f8fa2152df42a9db9d6286e1ac1983 logged out
======================================================================
======================================================================
Finished build.
======================================================================
======================================================================
Build step 'Execute shell' marked build as failure
Archiving artifacts
Sending artifact delta relative to PreCommit-TEZ-Build #949
Archived 50 artifacts
Archive block size is 32768
Received 4 blocks and 2910692 bytes
Compression is 4.3%
Took 0.72 sec
[description-setter] Could not determine description.
Recording test results
Email was triggered for: Failure
Sending email for trigger: Failure
###################################################################################
############################## FAILED TESTS (if any) ##############################
1 tests failed.
FAILED: org.apache.tez.dag.history.logging.ats.TestHistoryEventTimelineConversion.testConvertTaskAttemptFinishedEvent
Error Message:
expected:<6> but was:<8>
Stack Trace:
java.lang.AssertionError: expected:<6> but was:<8>
at org.junit.Assert.fail(Assert.java:88)
at org.junit.Assert.failNotEquals(Assert.java:743)
at org.junit.Assert.assertEquals(Assert.java:118)
at org.junit.Assert.assertEquals(Assert.java:555)
at org.junit.Assert.assertEquals(Assert.java:542)
at org.apache.tez.dag.history.logging.ats.TestHistoryEventTimelineConversion.testConvertTaskAttemptFinishedEvent(TestHistoryEventTimelineConversion.java:479)