You are viewing a plain text version of this content. The canonical link for it is here.
Posted to builds@beam.apache.org by Apache Jenkins Server <je...@builds.apache.org> on 2023/08/08 11:12:41 UTC
Build failed in Jenkins: beam_PostCommit_XVR_Direct #4449
See <https://ci-beam.apache.org/job/beam_PostCommit_XVR_Direct/4449/display/redirect>
Changes:
------------------------------------------
[...truncated 128.16 KB...]
#18 [14/16] COPY target/go-licenses/* /opt/apache/beam/third_party_licenses/golang/
#18 DONE 0.1s
#19 [15/16] RUN if [ "true" = "false" ] ; then rm -rf /opt/apache/beam/third_party_licenses ; fi
#19 DONE 0.5s
#20 [16/16] COPY target/profiler/* /opt/google_cloud_profiler/
#20 DONE 0.2s
#21 exporting to image
#21 exporting layers
#21 exporting layers 0.3s done
#21 writing image sha256:64f42359f6b78f62ce961ab072741841513a925ab07dc976a2610f308239653e done
#21 naming to docker.io/apache/beam_java8_sdk:2.50.0.dev done
#21 DONE 0.4s
> Task :release:go-licenses:go:dockerRun
W0808 11:12:00.312806 36 library.go:101] "golang.org/x/crypto/chacha20poly1305" contains non-Go code that can't be inspected for further dependencies:
/go/pkg/mod/golang.org/x/crypto@v0.10.0/chacha20poly1305/chacha20poly1305_amd64.s
W0808 11:12:00.333751 36 library.go:101] "golang.org/x/crypto/internal/poly1305" contains non-Go code that can't be inspected for further dependencies:
/go/pkg/mod/golang.org/x/crypto@v0.10.0/internal/poly1305/sum_amd64.s
W0808 11:12:00.340352 36 library.go:101] "golang.org/x/sys/cpu" contains non-Go code that can't be inspected for further dependencies:
/go/pkg/mod/golang.org/x/sys@v0.9.0/cpu/cpu_x86.s
+ go-licenses csv github.com/apache/beam/sdks/v2/go/container
+ tee /output/licenses/list.csv
W0808 11:12:04.221705 81 library.go:101] "golang.org/x/sys/unix" contains non-Go code that can't be inspected for further dependencies:
/go/pkg/mod/golang.org/x/sys@v0.9.0/unix/asm_linux_amd64.s
W0808 11:12:08.772545 81 library.go:101] "golang.org/x/crypto/chacha20poly1305" contains non-Go code that can't be inspected for further dependencies:
/go/pkg/mod/golang.org/x/crypto@v0.10.0/chacha20poly1305/chacha20poly1305_amd64.s
W0808 11:12:08.792625 81 library.go:101] "golang.org/x/crypto/internal/poly1305" contains non-Go code that can't be inspected for further dependencies:
/go/pkg/mod/golang.org/x/crypto@v0.10.0/internal/poly1305/sum_amd64.s
W0808 11:12:08.799047 81 library.go:101] "golang.org/x/sys/cpu" contains non-Go code that can't be inspected for further dependencies:
/go/pkg/mod/golang.org/x/sys@v0.9.0/cpu/cpu_x86.s
> Task :release:go-licenses:py:dockerRun
go: downloading github.com/golang/protobuf v1.5.3
go: downloading google.golang.org/grpc v1.56.1
go: downloading google.golang.org/protobuf v1.31.0
go: downloading golang.org/x/net v0.11.0
go: downloading google.golang.org/genproto/googleapis/rpc v0.0.0-20230530153820-e85fd2cbaebc
go: downloading golang.org/x/sys v0.9.0
go: downloading google.golang.org/genproto v0.0.0-20230530153820-e85fd2cbaebc
go: downloading golang.org/x/text v0.10.0
go: added github.com/apache/beam/sdks/v2 v2.49.0
go: added github.com/golang/protobuf v1.5.3
go: added golang.org/x/net v0.11.0
go: added golang.org/x/sys v0.9.0
go: added golang.org/x/text v0.10.0
go: added google.golang.org/genproto/googleapis/rpc v0.0.0-20230530153820-e85fd2cbaebc
go: added google.golang.org/grpc v1.56.1
go: added google.golang.org/protobuf v1.31.0
+ go-licenses save github.com/apache/beam/sdks/v2/python/container --save_path=/output/licenses
W0808 11:12:00.802758 39 library.go:101] "golang.org/x/sys/unix" contains non-Go code that can't be inspected for further dependencies:
/go/pkg/mod/golang.org/x/sys@v0.9.0/unix/asm_linux_amd64.s
+ go-licenses csv github.com/apache/beam/sdks/v2/python/container
+ tee /output/licenses/list.csv
W0808 11:12:05.414127 85 library.go:101] "golang.org/x/sys/unix" contains non-Go code that can't be inspected for further dependencies:
/go/pkg/mod/golang.org/x/sys@v0.9.0/unix/asm_linux_amd64.s
github.com/apache/beam/sdks/v2/go,https://github.com/apache/beam/blob/sdks/v2.49.0/sdks/go/README.md,Apache-2.0
github.com/apache/beam/sdks/v2/python/container,https://github.com/apache/beam/blob/sdks/v2.49.0/sdks/LICENSE,Apache-2.0
github.com/golang/protobuf,https://github.com/golang/protobuf/blob/v1.5.3/LICENSE,BSD-3-Clause
golang.org/x/net,https://cs.opensource.google/go/x/net/+/v0.11.0:LICENSE,BSD-3-Clause
golang.org/x/sys/unix,https://cs.opensource.google/go/x/sys/+/v0.9.0:LICENSE,BSD-3-Clause
golang.org/x/text,https://cs.opensource.google/go/x/text/+/v0.10.0:LICENSE,BSD-3-Clause
google.golang.org/genproto/googleapis/rpc/status,https://github.com/googleapis/go-genproto/blob/e85fd2cbaebc/googleapis/rpc/LICENSE,Apache-2.0
google.golang.org/grpc,https://github.com/grpc/grpc-go/blob/v1.56.1/LICENSE,Apache-2.0
google.golang.org/protobuf,https://github.com/protocolbuffers/protobuf-go/blob/v1.31.0/LICENSE,BSD-3-Clause
+ chmod -R a+w /output/licenses
> Task :release:go-licenses:py:createLicenses
> Task :sdks:python:container:py38:copyGolangLicenses
> Task :sdks:python:installGcpTest
Building wheel for apache-beam (setup.py): finished with status 'done'
Created wheel for apache-beam: filename=apache_beam-2.50.0.dev0-py3-none-any.whl size=3257342 sha256=e05271efe6d69f2b25354f0a1a6735e93ea876edbf275693666e48a02b596fc3
Stored in directory: /home/jenkins/.cache/pip/wheels/c0/01/10/5a028b724cdf5b5d2643067a82afc4660de8e5639d060da291
Successfully built apache-beam
Installing collected packages: sortedcontainers, pytz, docopt, crcmod, zstandard, wrapt, websocket-client, urllib3, typing-extensions, threadpoolctl, tenacity, sqlparse, six, shapely, scipy, regex, pyyaml, pyparsing, pymysql, PyJWT, pyhamcrest, pycparser, pyasn1, pyarrow, psycopg2-binary, protobuf, portalocker, parameterized, overrides, orjson, objsize, mock, joblib, jmespath, iniconfig, idna, greenlet, google-crc32c, fasteners, fastavro, execnet, exceptiongroup, dnspython, dill, deprecation, cloudpickle, charset-normalizer, certifi, attrs, sqlalchemy, scikit-learn, rsa, requests, python-dateutil, pytest, pymongo, pydot, pyasn1-modules, proto-plus, isodate, hypothesis, httplib2, googleapis-common-protos, google-resumable-media, cffi, requests_mock, pytest-xdist, pytest-timeout, pandas, oauth2client, hdfs, grpcio-status, google-auth, freezegun, docker, cryptography, botocore, azure-core, testcontainers, s3transfer, grpc-google-iam-v1, google-auth-httplib2, google-apitools, google-api-core, azure-storage-blob, apache-beam, msal, google-cloud-core, boto3, msal-extensions, google-cloud-vision, google-cloud-videointelligence, google-cloud-storage, google-cloud-spanner, google-cloud-resource-manager, google-cloud-recommendations-ai, google-cloud-pubsub, google-cloud-language, google-cloud-dlp, google-cloud-datastore, google-cloud-bigtable, google-cloud-bigquery-storage, google-cloud-bigquery, google-cloud-pubsublite, google-cloud-aiplatform, azure-identity
Attempting uninstall: protobuf
Found existing installation: protobuf 4.24.0rc3
Uninstalling protobuf-4.24.0rc3:
Successfully uninstalled protobuf-4.24.0rc3
> Task :sdks:python:container:py38:dockerPrepare
> Task :release:go-licenses:go:dockerRun
+ chmod -R a+w /output/licenses
> Task :release:go-licenses:go:createLicenses
> Task :sdks:go:container:copyGolangLicenses
> Task :sdks:python:container:py38:docker
#1 [internal] load build definition from Dockerfile
#1 ...
#2 [internal] load .dockerignore
#2 transferring context: 2B done
#2 DONE 0.1s
#1 [internal] load build definition from Dockerfile
#1 transferring dockerfile: 4.91kB 0.0s done
#1 DONE 0.3s
#3 [internal] load metadata for docker.io/library/python:3.8-bullseye
#3 DONE 0.3s
#4 [beam 1/5] FROM docker.io/library/python:3.8-bullseye@sha256:c47828347cef6d451af1cd3555ec1d80550ae843c79e82d1619fd5c1208771e8
#4 resolve docker.io/library/python:3.8-bullseye@sha256:c47828347cef6d451af1cd3555ec1d80550ae843c79e82d1619fd5c1208771e8 0.0s done
#4 CACHED
#5 [internal] load build context
#5 transferring context: 2.42MB 0.1s done
#5 DONE 0.1s
#6 [beam 3/5] COPY target/apache-beam.tar.gz /opt/apache/beam/tars/
#6 CACHED
#7 [beam 4/5] COPY target/launcher/linux_amd64/boot target/LICENSE target/NOTICE target/LICENSE.python /opt/apache/beam/
#7 ERROR: "/target/launcher/linux_amd64/boot" not found: not found
#8 [beam 2/5] COPY target/base_image_requirements.txt /tmp/base_image_requirements.txt
#8 CANCELED
------
> [beam 4/5] COPY target/launcher/linux_amd64/boot target/LICENSE target/NOTICE target/LICENSE.python /opt/apache/beam/:
------
ERROR: failed to solve: failed to compute cache key: "/target/launcher/linux_amd64/boot" not found: not found
> Task :sdks:python:container:py38:docker FAILED
> Task :sdks:go:container:dockerPrepare
> Task :sdks:go:container:docker
#1 [internal] load build definition from Dockerfile
#1 transferring dockerfile: 1.70kB done
#1 DONE 0.0s
#2 [internal] load .dockerignore
#2 transferring context: 2B done
#2 DONE 0.0s
#3 [internal] load metadata for docker.io/library/debian:bullseye
#3 DONE 0.3s
#4 [1/7] FROM docker.io/library/debian:bullseye@sha256:630454da4c59041a2bca987a0d54c68962f1d6ea37a3641bd61db42b753234f2
#4 CACHED
#5 [internal] load build context
#5 transferring context: 24.10MB 0.2s done
#5 DONE 0.2s
#6 [2/7] RUN apt-get update && DEBIAN_FRONTEND=noninteractive apt-get install -y ca-certificates && rm -rf /var/lib/apt/lists/*
#6 0.510 Get:1 http://deb.debian.org/debian bullseye InRelease [116 kB]
#6 0.607 Get:2 http://deb.debian.org/debian-security bullseye-security InRelease [48.4 kB]
#6 0.644 Get:3 http://deb.debian.org/debian bullseye-updates InRelease [44.1 kB]
#6 0.761 Get:4 http://deb.debian.org/debian bullseye/main amd64 Packages [8183 kB]
#6 1.010 Get:5 http://deb.debian.org/debian-security bullseye-security/main amd64 Packages [253 kB]
#6 1.044 Get:6 http://deb.debian.org/debian bullseye-updates/main amd64 Packages [17.3 kB]
#6 2.321 Fetched 8661 kB in 2s (4576 kB/s)
#6 2.321 Reading package lists...
#6 3.004 Reading package lists...
#6 3.666 Building dependency tree...
#6 3.831 Reading state information...
#6 4.033 The following additional packages will be installed:
#6 4.033 openssl
#6 4.066 The following NEW packages will be installed:
#6 4.068 ca-certificates openssl
#6 4.164 0 upgraded, 2 newly installed, 0 to remove and 2 not upgraded.
#6 4.164 Need to get 1012 kB of archives.
#6 4.164 After this operation, 1892 kB of additional disk space will be used.
#6 4.164 Get:1 http://deb.debian.org/debian-security bullseye-security/main amd64 openssl amd64 1.1.1n-0+deb11u5 [854 kB]
#6 4.366 Get:2 http://deb.debian.org/debian bullseye/main amd64 ca-certificates all 20210119 [158 kB]
#6 4.636 debconf: delaying package configuration, since apt-utils is not installed
#6 4.673 Fetched 1012 kB in 0s (3444 kB/s)
#6 4.703 Selecting previously unselected package openssl.
#6 4.703 (Reading database ... (Reading database ... 5%(Reading database ... 10%(Reading database ... 15%(Reading database ... 20%(Reading database ... 25%(Reading database ... 30%(Reading database ... 35%(Reading database ... 40%(Reading database ... 45%(Reading database ... 50%(Reading database ... 55%(Reading database ... 60%(Reading database ... 65%(Reading database ... 70%(Reading database ... 75%(Reading database ... 80%(Reading database ... 85%(Reading database ... 90%(Reading database ... 95%(Reading database ... 100%(Reading database ... 6664 files and directories currently installed.)
#6 4.715 Preparing to unpack .../openssl_1.1.1n-0+deb11u5_amd64.deb ...
#6 4.721 Unpacking openssl (1.1.1n-0+deb11u5) ...
#6 4.873 Selecting previously unselected package ca-certificates.
#6 4.875 Preparing to unpack .../ca-certificates_20210119_all.deb ...
#6 4.880 Unpacking ca-certificates (20210119) ...
#6 4.957 Setting up openssl (1.1.1n-0+deb11u5) ...
#6 4.977 Setting up ca-certificates (20210119) ...
#6 5.805 Updating certificates in /etc/ssl/certs...
#6 6.607 129 added, 0 removed; done.
#6 6.670 Processing triggers for ca-certificates (20210119) ...
#6 6.680 Updating certificates in /etc/ssl/certs...
#6 7.276 0 added, 0 removed; done.
#6 7.276 Running hooks in /etc/ca-certificates/update.d...
#6 7.300 done.
#6 DONE 10.1s
#7 [3/7] ADD target/linux_amd64/boot /opt/apache/beam/
#7 DONE 0.3s
#8 [4/7] COPY target/LICENSE /opt/apache/beam/
#8 DONE 0.1s
#9 [5/7] COPY target/NOTICE /opt/apache/beam/
#9 DONE 0.1s
#10 [6/7] COPY target/go-licenses/* /opt/apache/beam/third_party_licenses/golang/
#10 DONE 0.1s
#11 [7/7] RUN if [ "true" = "false" ] ; then rm -rf /opt/apache/beam/third_party_licenses ; fi
#11 DONE 0.4s
#12 exporting to image
#12 exporting layers
#12 exporting layers 0.2s done
#12 writing image sha256:204414dce9caedd33d6c74569c7fe09f97f2ddbffcd243e166918095056e83ab done
#12 naming to docker.io/apache/beam_go_sdk:latest done
#12 DONE 0.2s
> Task :sdks:python:test-suites:direct:xlang:fnApiJobServerSetup
Waiting for server to start up...
Server started at port 33789
> Task :sdks:python:test-suites:direct:xlang:fnApiJobServerCleanup
Killing process at 3205453
FAILURE: Build failed with an exception.
* What went wrong:
Execution failed for task ':sdks:python:container:py38:docker'.
> Process 'command 'docker'' finished with non-zero exit value 1
* Try:
> Run with --stacktrace option to get the stack trace.
> Run with --info or --debug option to get more log output.
* Get more help at https://help.gradle.org
Deprecated Gradle features were used in this build, making it incompatible with Gradle 8.0.
You can use '--warning-mode all' to show the individual deprecation warnings and determine if they come from your own scripts or plugins.
See https://docs.gradle.org/7.6.2/userguide/command_line_interface.html#sec:command_line_warnings
Execution optimizations have been disabled for 1 invalid unit(s) of work during this build to ensure correctness.
Please consult deprecation warnings for more details.
BUILD FAILED in 2m 10s
251 actionable tasks: 160 executed, 79 from cache, 12 up-to-date
Publishing build scan...
https://ge.apache.org/s/nn7qpwyn7iehy
Build step 'Invoke Gradle script' changed build result to FAILURE
Build step 'Invoke Gradle script' marked build as failure
---------------------------------------------------------------------
To unsubscribe, e-mail: builds-unsubscribe@beam.apache.org
For additional commands, e-mail: builds-help@beam.apache.org
Jenkins build is back to normal : beam_PostCommit_XVR_Direct #4450
Posted by Apache Jenkins Server <je...@builds.apache.org>.
See <https://ci-beam.apache.org/job/beam_PostCommit_XVR_Direct/4450/display/redirect?page=changes>
---------------------------------------------------------------------
To unsubscribe, e-mail: builds-unsubscribe@beam.apache.org
For additional commands, e-mail: builds-help@beam.apache.org