You are viewing a plain text version of this content. The canonical link for it is here.
Posted to dev@lucene.apache.org by Policeman Jenkins Server <je...@thetaphi.de> on 2016/09/14 11:12:21 UTC
[JENKINS] Lucene-Solr-6.x-MacOSX (64bit/jdk1.8.0) - Build # 410 -
Unstable!
Build: http://jenkins.thetaphi.de/job/Lucene-Solr-6.x-MacOSX/410/
Java: 64bit/jdk1.8.0 -XX:-UseCompressedOops -XX:+UseParallelGC
1 tests failed.
FAILED: org.apache.solr.cloud.ForceLeaderTest.testReplicasInLIRNoLeader
Error Message:
No live SolrServers available to handle this request:[http://127.0.0.1:53719/v/forceleader_test_collection_shard1_replica2]
Stack Trace:
org.apache.solr.client.solrj.impl.CloudSolrClient$RouteException: No live SolrServers available to handle this request:[http://127.0.0.1:53719/v/forceleader_test_collection_shard1_replica2]
at __randomizedtesting.SeedInfo.seed([26A53202BC47C79E:C03206C285C53EFF]:0)
at org.apache.solr.client.solrj.impl.CloudSolrClient.directUpdate(CloudSolrClient.java:755)
at org.apache.solr.client.solrj.impl.CloudSolrClient.sendRequest(CloudSolrClient.java:1161)
at org.apache.solr.client.solrj.impl.CloudSolrClient.requestWithRetryOnStaleState(CloudSolrClient.java:1050)
at org.apache.solr.client.solrj.impl.CloudSolrClient.request(CloudSolrClient.java:992)
at org.apache.solr.cloud.AbstractFullDistribZkTestBase.sendDocsWithRetry(AbstractFullDistribZkTestBase.java:753)
at org.apache.solr.cloud.AbstractFullDistribZkTestBase.sendDocsWithRetry(AbstractFullDistribZkTestBase.java:741)
at org.apache.solr.cloud.ForceLeaderTest.sendDoc(ForceLeaderTest.java:424)
at org.apache.solr.cloud.ForceLeaderTest.testReplicasInLIRNoLeader(ForceLeaderTest.java:131)
at sun.reflect.NativeMethodAccessorImpl.invoke0(Native Method)
at sun.reflect.NativeMethodAccessorImpl.invoke(NativeMethodAccessorImpl.java:62)
at sun.reflect.DelegatingMethodAccessorImpl.invoke(DelegatingMethodAccessorImpl.java:43)
at java.lang.reflect.Method.invoke(Method.java:498)
at com.carrotsearch.randomizedtesting.RandomizedRunner.invoke(RandomizedRunner.java:1764)
at com.carrotsearch.randomizedtesting.RandomizedRunner$8.evaluate(RandomizedRunner.java:871)
at com.carrotsearch.randomizedtesting.RandomizedRunner$9.evaluate(RandomizedRunner.java:907)
at com.carrotsearch.randomizedtesting.RandomizedRunner$10.evaluate(RandomizedRunner.java:921)
at org.apache.solr.BaseDistributedSearchTestCase$ShardsRepeatRule$ShardsFixedStatement.callStatement(BaseDistributedSearchTestCase.java:992)
at org.apache.solr.BaseDistributedSearchTestCase$ShardsRepeatRule$ShardsStatement.evaluate(BaseDistributedSearchTestCase.java:967)
at com.carrotsearch.randomizedtesting.rules.SystemPropertiesRestoreRule$1.evaluate(SystemPropertiesRestoreRule.java:57)
at org.apache.lucene.util.TestRuleSetupTeardownChained$1.evaluate(TestRuleSetupTeardownChained.java:49)
at org.apache.lucene.util.AbstractBeforeAfterRule$1.evaluate(AbstractBeforeAfterRule.java:45)
at org.apache.lucene.util.TestRuleThreadAndTestName$1.evaluate(TestRuleThreadAndTestName.java:48)
at org.apache.lucene.util.TestRuleIgnoreAfterMaxFailures$1.evaluate(TestRuleIgnoreAfterMaxFailures.java:64)
at org.apache.lucene.util.TestRuleMarkFailure$1.evaluate(TestRuleMarkFailure.java:47)
at com.carrotsearch.randomizedtesting.rules.StatementAdapter.evaluate(StatementAdapter.java:36)
at com.carrotsearch.randomizedtesting.ThreadLeakControl$StatementRunner.run(ThreadLeakControl.java:367)
at com.carrotsearch.randomizedtesting.ThreadLeakControl.forkTimeoutingTask(ThreadLeakControl.java:809)
at com.carrotsearch.randomizedtesting.ThreadLeakControl$3.evaluate(ThreadLeakControl.java:460)
at com.carrotsearch.randomizedtesting.RandomizedRunner.runSingleTest(RandomizedRunner.java:880)
at com.carrotsearch.randomizedtesting.RandomizedRunner$5.evaluate(RandomizedRunner.java:781)
at com.carrotsearch.randomizedtesting.RandomizedRunner$6.evaluate(RandomizedRunner.java:816)
at com.carrotsearch.randomizedtesting.RandomizedRunner$7.evaluate(RandomizedRunner.java:827)
at com.carrotsearch.randomizedtesting.rules.StatementAdapter.evaluate(StatementAdapter.java:36)
at com.carrotsearch.randomizedtesting.rules.SystemPropertiesRestoreRule$1.evaluate(SystemPropertiesRestoreRule.java:57)
at org.apache.lucene.util.AbstractBeforeAfterRule$1.evaluate(AbstractBeforeAfterRule.java:45)
at com.carrotsearch.randomizedtesting.rules.StatementAdapter.evaluate(StatementAdapter.java:36)
at org.apache.lucene.util.TestRuleStoreClassName$1.evaluate(TestRuleStoreClassName.java:41)
at com.carrotsearch.randomizedtesting.rules.NoShadowingOrOverridesOnMethodsRule$1.evaluate(NoShadowingOrOverridesOnMethodsRule.java:40)
at com.carrotsearch.randomizedtesting.rules.NoShadowingOrOverridesOnMethodsRule$1.evaluate(NoShadowingOrOverridesOnMethodsRule.java:40)
at com.carrotsearch.randomizedtesting.rules.StatementAdapter.evaluate(StatementAdapter.java:36)
at com.carrotsearch.randomizedtesting.rules.StatementAdapter.evaluate(StatementAdapter.java:36)
at com.carrotsearch.randomizedtesting.rules.StatementAdapter.evaluate(StatementAdapter.java:36)
at org.apache.lucene.util.TestRuleAssertionsRequired$1.evaluate(TestRuleAssertionsRequired.java:53)
at org.apache.lucene.util.TestRuleMarkFailure$1.evaluate(TestRuleMarkFailure.java:47)
at org.apache.lucene.util.TestRuleIgnoreAfterMaxFailures$1.evaluate(TestRuleIgnoreAfterMaxFailures.java:64)
at org.apache.lucene.util.TestRuleIgnoreTestSuites$1.evaluate(TestRuleIgnoreTestSuites.java:54)
at com.carrotsearch.randomizedtesting.rules.StatementAdapter.evaluate(StatementAdapter.java:36)
at com.carrotsearch.randomizedtesting.ThreadLeakControl$StatementRunner.run(ThreadLeakControl.java:367)
at java.lang.Thread.run(Thread.java:745)
Caused by: org.apache.solr.client.solrj.SolrServerException: No live SolrServers available to handle this request:[http://127.0.0.1:53719/v/forceleader_test_collection_shard1_replica2]
at org.apache.solr.client.solrj.impl.LBHttpSolrClient.request(LBHttpSolrClient.java:384)
at org.apache.solr.client.solrj.impl.CloudSolrClient.lambda$directUpdate$0(CloudSolrClient.java:730)
at java.util.concurrent.FutureTask.run(FutureTask.java:266)
at org.apache.solr.common.util.ExecutorUtil$MDCAwareThreadPoolExecutor.lambda$execute$0(ExecutorUtil.java:229)
at java.util.concurrent.ThreadPoolExecutor.runWorker(ThreadPoolExecutor.java:1142)
at java.util.concurrent.ThreadPoolExecutor$Worker.run(ThreadPoolExecutor.java:617)
... 1 more
Caused by: org.apache.solr.client.solrj.SolrServerException: Server refused connection at: http://127.0.0.1:53719/v/forceleader_test_collection_shard1_replica2
at org.apache.solr.client.solrj.impl.HttpSolrClient.executeMethod(HttpSolrClient.java:599)
at org.apache.solr.client.solrj.impl.HttpSolrClient.request(HttpSolrClient.java:261)
at org.apache.solr.client.solrj.impl.HttpSolrClient.request(HttpSolrClient.java:250)
at org.apache.solr.client.solrj.impl.LBHttpSolrClient.doRequest(LBHttpSolrClient.java:405)
at org.apache.solr.client.solrj.impl.LBHttpSolrClient.request(LBHttpSolrClient.java:373)
... 6 more
Caused by: java.net.ConnectException: Connection refused
at java.net.PlainSocketImpl.socketConnect(Native Method)
at java.net.AbstractPlainSocketImpl.doConnect(AbstractPlainSocketImpl.java:350)
at java.net.AbstractPlainSocketImpl.connectToAddress(AbstractPlainSocketImpl.java:206)
at java.net.AbstractPlainSocketImpl.connect(AbstractPlainSocketImpl.java:188)
at java.net.SocksSocketImpl.connect(SocksSocketImpl.java:392)
at java.net.Socket.connect(Socket.java:589)
at org.apache.http.conn.scheme.PlainSocketFactory.connectSocket(PlainSocketFactory.java:117)
at org.apache.http.impl.conn.DefaultClientConnectionOperator.openConnection(DefaultClientConnectionOperator.java:177)
at org.apache.http.impl.conn.ManagedClientConnectionImpl.open(ManagedClientConnectionImpl.java:304)
at org.apache.http.impl.client.DefaultRequestDirector.tryConnect(DefaultRequestDirector.java:611)
at org.apache.http.impl.client.DefaultRequestDirector.execute(DefaultRequestDirector.java:446)
at org.apache.http.impl.client.AbstractHttpClient.doExecute(AbstractHttpClient.java:882)
at org.apache.http.impl.client.CloseableHttpClient.execute(CloseableHttpClient.java:82)
at org.apache.http.impl.client.CloseableHttpClient.execute(CloseableHttpClient.java:107)
at org.apache.http.impl.client.CloseableHttpClient.execute(CloseableHttpClient.java:55)
at org.apache.solr.client.solrj.impl.HttpSolrClient.executeMethod(HttpSolrClient.java:497)
... 10 more
Build Log:
[...truncated 11211 lines...]
[junit4] Suite: org.apache.solr.cloud.ForceLeaderTest
[junit4] 2> Creating dataDir: /Users/jenkins/workspace/Lucene-Solr-6.x-MacOSX/solr/build/solr-core/test/J1/temp/solr.cloud.ForceLeaderTest_26A53202BC47C79E-001/init-core-data-001
[junit4] 2> 1305124 INFO (SUITE-ForceLeaderTest-seed#[26A53202BC47C79E]-worker) [ ] o.a.s.SolrTestCaseJ4 Randomized ssl (false) and clientAuth (false) via: @org.apache.solr.SolrTestCaseJ4$SuppressSSL(bugUrl=https://issues.apache.org/jira/browse/SOLR-5776) w/ MAC_OS_X supressed clientAuth
[junit4] 2> 1305125 INFO (SUITE-ForceLeaderTest-seed#[26A53202BC47C79E]-worker) [ ] o.a.s.BaseDistributedSearchTestCase Setting hostContext system property: /v/
[junit4] 2> 1305129 INFO (TEST-ForceLeaderTest.testReplicasInLIRNoLeader-seed#[26A53202BC47C79E]) [ ] o.a.s.c.ZkTestServer STARTING ZK TEST SERVER
[junit4] 2> 1305129 INFO (Thread-1614) [ ] o.a.s.c.ZkTestServer client port:0.0.0.0/0.0.0.0:0
[junit4] 2> 1305130 INFO (Thread-1614) [ ] o.a.s.c.ZkTestServer Starting server
[junit4] 2> 1305230 INFO (TEST-ForceLeaderTest.testReplicasInLIRNoLeader-seed#[26A53202BC47C79E]) [ ] o.a.s.c.ZkTestServer start zk server on port:53700
[junit4] 2> 1305231 INFO (TEST-ForceLeaderTest.testReplicasInLIRNoLeader-seed#[26A53202BC47C79E]) [ ] o.a.s.c.c.SolrZkClient Using default ZkCredentialsProvider
[junit4] 2> 1305231 INFO (TEST-ForceLeaderTest.testReplicasInLIRNoLeader-seed#[26A53202BC47C79E]) [ ] o.a.s.c.c.ConnectionManager Waiting for client to connect to ZooKeeper
[junit4] 2> 1305255 INFO (zkCallback-1261-thread-1) [ ] o.a.s.c.c.ConnectionManager Watcher org.apache.solr.common.cloud.ConnectionManager@2f0239a4 name:ZooKeeperConnection Watcher:127.0.0.1:53700 got event WatchedEvent state:SyncConnected type:None path:null path:null type:None
[junit4] 2> 1305255 INFO (TEST-ForceLeaderTest.testReplicasInLIRNoLeader-seed#[26A53202BC47C79E]) [ ] o.a.s.c.c.ConnectionManager Client is connected to ZooKeeper
[junit4] 2> 1305256 INFO (TEST-ForceLeaderTest.testReplicasInLIRNoLeader-seed#[26A53202BC47C79E]) [ ] o.a.s.c.c.SolrZkClient Using default ZkACLProvider
[junit4] 2> 1305256 INFO (TEST-ForceLeaderTest.testReplicasInLIRNoLeader-seed#[26A53202BC47C79E]) [ ] o.a.s.c.c.SolrZkClient makePath: /solr
[junit4] 2> 1305260 INFO (TEST-ForceLeaderTest.testReplicasInLIRNoLeader-seed#[26A53202BC47C79E]) [ ] o.a.s.c.c.SolrZkClient Using default ZkCredentialsProvider
[junit4] 2> 1305261 INFO (TEST-ForceLeaderTest.testReplicasInLIRNoLeader-seed#[26A53202BC47C79E]) [ ] o.a.s.c.c.ConnectionManager Waiting for client to connect to ZooKeeper
[junit4] 2> 1305262 INFO (zkCallback-1262-thread-1) [ ] o.a.s.c.c.ConnectionManager Watcher org.apache.solr.common.cloud.ConnectionManager@c06b76 name:ZooKeeperConnection Watcher:127.0.0.1:53700/solr got event WatchedEvent state:SyncConnected type:None path:null path:null type:None
[junit4] 2> 1305262 INFO (TEST-ForceLeaderTest.testReplicasInLIRNoLeader-seed#[26A53202BC47C79E]) [ ] o.a.s.c.c.ConnectionManager Client is connected to ZooKeeper
[junit4] 2> 1305263 INFO (TEST-ForceLeaderTest.testReplicasInLIRNoLeader-seed#[26A53202BC47C79E]) [ ] o.a.s.c.c.SolrZkClient Using default ZkACLProvider
[junit4] 2> 1305263 INFO (TEST-ForceLeaderTest.testReplicasInLIRNoLeader-seed#[26A53202BC47C79E]) [ ] o.a.s.c.c.SolrZkClient makePath: /collections/collection1
[junit4] 2> 1305265 INFO (TEST-ForceLeaderTest.testReplicasInLIRNoLeader-seed#[26A53202BC47C79E]) [ ] o.a.s.c.c.SolrZkClient makePath: /collections/collection1/shards
[junit4] 2> 1305269 INFO (TEST-ForceLeaderTest.testReplicasInLIRNoLeader-seed#[26A53202BC47C79E]) [ ] o.a.s.c.c.SolrZkClient makePath: /collections/control_collection
[junit4] 2> 1305272 INFO (TEST-ForceLeaderTest.testReplicasInLIRNoLeader-seed#[26A53202BC47C79E]) [ ] o.a.s.c.c.SolrZkClient makePath: /collections/control_collection/shards
[junit4] 2> 1305275 INFO (TEST-ForceLeaderTest.testReplicasInLIRNoLeader-seed#[26A53202BC47C79E]) [ ] o.a.s.c.AbstractZkTestCase put /Users/jenkins/workspace/Lucene-Solr-6.x-MacOSX/solr/core/src/test-files/solr/collection1/conf/solrconfig-tlog.xml to /configs/conf1/solrconfig.xml
[junit4] 2> 1305275 INFO (TEST-ForceLeaderTest.testReplicasInLIRNoLeader-seed#[26A53202BC47C79E]) [ ] o.a.s.c.c.SolrZkClient makePath: /configs/conf1/solrconfig.xml
[junit4] 2> 1305279 INFO (TEST-ForceLeaderTest.testReplicasInLIRNoLeader-seed#[26A53202BC47C79E]) [ ] o.a.s.c.AbstractZkTestCase put /Users/jenkins/workspace/Lucene-Solr-6.x-MacOSX/solr/core/src/test-files/solr/collection1/conf/schema.xml to /configs/conf1/schema.xml
[junit4] 2> 1305279 INFO (TEST-ForceLeaderTest.testReplicasInLIRNoLeader-seed#[26A53202BC47C79E]) [ ] o.a.s.c.c.SolrZkClient makePath: /configs/conf1/schema.xml
[junit4] 2> 1305282 INFO (TEST-ForceLeaderTest.testReplicasInLIRNoLeader-seed#[26A53202BC47C79E]) [ ] o.a.s.c.AbstractZkTestCase put /Users/jenkins/workspace/Lucene-Solr-6.x-MacOSX/solr/core/src/test-files/solr/collection1/conf/solrconfig.snippet.randomindexconfig.xml to /configs/conf1/solrconfig.snippet.randomindexconfig.xml
[junit4] 2> 1305282 INFO (TEST-ForceLeaderTest.testReplicasInLIRNoLeader-seed#[26A53202BC47C79E]) [ ] o.a.s.c.c.SolrZkClient makePath: /configs/conf1/solrconfig.snippet.randomindexconfig.xml
[junit4] 2> 1305285 INFO (TEST-ForceLeaderTest.testReplicasInLIRNoLeader-seed#[26A53202BC47C79E]) [ ] o.a.s.c.AbstractZkTestCase put /Users/jenkins/workspace/Lucene-Solr-6.x-MacOSX/solr/core/src/test-files/solr/collection1/conf/stopwords.txt to /configs/conf1/stopwords.txt
[junit4] 2> 1305285 INFO (TEST-ForceLeaderTest.testReplicasInLIRNoLeader-seed#[26A53202BC47C79E]) [ ] o.a.s.c.c.SolrZkClient makePath: /configs/conf1/stopwords.txt
[junit4] 2> 1305287 INFO (TEST-ForceLeaderTest.testReplicasInLIRNoLeader-seed#[26A53202BC47C79E]) [ ] o.a.s.c.AbstractZkTestCase put /Users/jenkins/workspace/Lucene-Solr-6.x-MacOSX/solr/core/src/test-files/solr/collection1/conf/protwords.txt to /configs/conf1/protwords.txt
[junit4] 2> 1305287 INFO (TEST-ForceLeaderTest.testReplicasInLIRNoLeader-seed#[26A53202BC47C79E]) [ ] o.a.s.c.c.SolrZkClient makePath: /configs/conf1/protwords.txt
[junit4] 2> 1305290 INFO (TEST-ForceLeaderTest.testReplicasInLIRNoLeader-seed#[26A53202BC47C79E]) [ ] o.a.s.c.AbstractZkTestCase put /Users/jenkins/workspace/Lucene-Solr-6.x-MacOSX/solr/core/src/test-files/solr/collection1/conf/currency.xml to /configs/conf1/currency.xml
[junit4] 2> 1305290 INFO (TEST-ForceLeaderTest.testReplicasInLIRNoLeader-seed#[26A53202BC47C79E]) [ ] o.a.s.c.c.SolrZkClient makePath: /configs/conf1/currency.xml
[junit4] 2> 1305293 INFO (TEST-ForceLeaderTest.testReplicasInLIRNoLeader-seed#[26A53202BC47C79E]) [ ] o.a.s.c.AbstractZkTestCase put /Users/jenkins/workspace/Lucene-Solr-6.x-MacOSX/solr/core/src/test-files/solr/collection1/conf/enumsConfig.xml to /configs/conf1/enumsConfig.xml
[junit4] 2> 1305293 INFO (TEST-ForceLeaderTest.testReplicasInLIRNoLeader-seed#[26A53202BC47C79E]) [ ] o.a.s.c.c.SolrZkClient makePath: /configs/conf1/enumsConfig.xml
[junit4] 2> 1305296 INFO (TEST-ForceLeaderTest.testReplicasInLIRNoLeader-seed#[26A53202BC47C79E]) [ ] o.a.s.c.AbstractZkTestCase put /Users/jenkins/workspace/Lucene-Solr-6.x-MacOSX/solr/core/src/test-files/solr/collection1/conf/open-exchange-rates.json to /configs/conf1/open-exchange-rates.json
[junit4] 2> 1305296 INFO (TEST-ForceLeaderTest.testReplicasInLIRNoLeader-seed#[26A53202BC47C79E]) [ ] o.a.s.c.c.SolrZkClient makePath: /configs/conf1/open-exchange-rates.json
[junit4] 2> 1305298 INFO (TEST-ForceLeaderTest.testReplicasInLIRNoLeader-seed#[26A53202BC47C79E]) [ ] o.a.s.c.AbstractZkTestCase put /Users/jenkins/workspace/Lucene-Solr-6.x-MacOSX/solr/core/src/test-files/solr/collection1/conf/mapping-ISOLatin1Accent.txt to /configs/conf1/mapping-ISOLatin1Accent.txt
[junit4] 2> 1305299 INFO (TEST-ForceLeaderTest.testReplicasInLIRNoLeader-seed#[26A53202BC47C79E]) [ ] o.a.s.c.c.SolrZkClient makePath: /configs/conf1/mapping-ISOLatin1Accent.txt
[junit4] 2> 1305301 INFO (TEST-ForceLeaderTest.testReplicasInLIRNoLeader-seed#[26A53202BC47C79E]) [ ] o.a.s.c.AbstractZkTestCase put /Users/jenkins/workspace/Lucene-Solr-6.x-MacOSX/solr/core/src/test-files/solr/collection1/conf/old_synonyms.txt to /configs/conf1/old_synonyms.txt
[junit4] 2> 1305301 INFO (TEST-ForceLeaderTest.testReplicasInLIRNoLeader-seed#[26A53202BC47C79E]) [ ] o.a.s.c.c.SolrZkClient makePath: /configs/conf1/old_synonyms.txt
[junit4] 2> 1305304 INFO (TEST-ForceLeaderTest.testReplicasInLIRNoLeader-seed#[26A53202BC47C79E]) [ ] o.a.s.c.AbstractZkTestCase put /Users/jenkins/workspace/Lucene-Solr-6.x-MacOSX/solr/core/src/test-files/solr/collection1/conf/synonyms.txt to /configs/conf1/synonyms.txt
[junit4] 2> 1305304 INFO (TEST-ForceLeaderTest.testReplicasInLIRNoLeader-seed#[26A53202BC47C79E]) [ ] o.a.s.c.c.SolrZkClient makePath: /configs/conf1/synonyms.txt
[junit4] 2> 1307121 INFO (TEST-ForceLeaderTest.testReplicasInLIRNoLeader-seed#[26A53202BC47C79E]) [ ] o.a.s.SolrTestCaseJ4 Writing core.properties file to /Users/jenkins/workspace/Lucene-Solr-6.x-MacOSX/solr/build/solr-core/test/J1/temp/solr.cloud.ForceLeaderTest_26A53202BC47C79E-001/control-001/cores/collection1
[junit4] 2> 1307127 INFO (TEST-ForceLeaderTest.testReplicasInLIRNoLeader-seed#[26A53202BC47C79E]) [ ] o.e.j.s.Server jetty-9.3.8.v20160314
[junit4] 2> 1307130 INFO (TEST-ForceLeaderTest.testReplicasInLIRNoLeader-seed#[26A53202BC47C79E]) [ ] o.e.j.s.h.ContextHandler Started o.e.j.s.ServletContextHandler@4d882c8e{/v,null,AVAILABLE}
[junit4] 2> 1307132 INFO (TEST-ForceLeaderTest.testReplicasInLIRNoLeader-seed#[26A53202BC47C79E]) [ ] o.e.j.s.ServerConnector Started ServerConnector@7035f173{HTTP/1.1,[http/1.1]}{127.0.0.1:53707}
[junit4] 2> 1307132 INFO (TEST-ForceLeaderTest.testReplicasInLIRNoLeader-seed#[26A53202BC47C79E]) [ ] o.e.j.s.Server Started @1312386ms
[junit4] 2> 1307132 INFO (TEST-ForceLeaderTest.testReplicasInLIRNoLeader-seed#[26A53202BC47C79E]) [ ] o.a.s.c.s.e.JettySolrRunner Jetty properties: {solr.data.dir=/Users/jenkins/workspace/Lucene-Solr-6.x-MacOSX/solr/build/solr-core/test/J1/temp/solr.cloud.ForceLeaderTest_26A53202BC47C79E-001/tempDir-001/control/data, hostContext=/v, hostPort=53706, coreRootDirectory=/Users/jenkins/workspace/Lucene-Solr-6.x-MacOSX/solr/build/solr-core/test/J1/temp/solr.cloud.ForceLeaderTest_26A53202BC47C79E-001/control-001/cores}
[junit4] 2> 1307133 INFO (TEST-ForceLeaderTest.testReplicasInLIRNoLeader-seed#[26A53202BC47C79E]) [ ] o.a.s.s.SolrDispatchFilter SolrDispatchFilter.init(): sun.misc.Launcher$AppClassLoader@4554617c
[junit4] 2> 1307133 INFO (TEST-ForceLeaderTest.testReplicasInLIRNoLeader-seed#[26A53202BC47C79E]) [ ] o.a.s.c.SolrResourceLoader new SolrResourceLoader for directory: '/Users/jenkins/workspace/Lucene-Solr-6.x-MacOSX/solr/build/solr-core/test/J1/temp/solr.cloud.ForceLeaderTest_26A53202BC47C79E-001/control-001'
[junit4] 2> 1307133 INFO (TEST-ForceLeaderTest.testReplicasInLIRNoLeader-seed#[26A53202BC47C79E]) [ ] o.a.s.c.SolrResourceLoader JNDI not configured for solr (NoInitialContextEx)
[junit4] 2> 1307133 INFO (TEST-ForceLeaderTest.testReplicasInLIRNoLeader-seed#[26A53202BC47C79E]) [ ] o.a.s.c.SolrResourceLoader solr home defaulted to 'solr/' (could not find system property or JNDI)
[junit4] 2> 1307134 INFO (TEST-ForceLeaderTest.testReplicasInLIRNoLeader-seed#[26A53202BC47C79E]) [ ] o.a.s.c.c.SolrZkClient Using default ZkCredentialsProvider
[junit4] 2> 1307134 INFO (TEST-ForceLeaderTest.testReplicasInLIRNoLeader-seed#[26A53202BC47C79E]) [ ] o.a.s.c.c.ConnectionManager Waiting for client to connect to ZooKeeper
[junit4] 2> 1307137 INFO (zkCallback-1263-thread-1) [ ] o.a.s.c.c.ConnectionManager Watcher org.apache.solr.common.cloud.ConnectionManager@644648a5 name:ZooKeeperConnection Watcher:127.0.0.1:53700/solr got event WatchedEvent state:SyncConnected type:None path:null path:null type:None
[junit4] 2> 1307137 INFO (TEST-ForceLeaderTest.testReplicasInLIRNoLeader-seed#[26A53202BC47C79E]) [ ] o.a.s.c.c.ConnectionManager Client is connected to ZooKeeper
[junit4] 2> 1307138 INFO (TEST-ForceLeaderTest.testReplicasInLIRNoLeader-seed#[26A53202BC47C79E]) [ ] o.a.s.c.c.SolrZkClient Using default ZkACLProvider
[junit4] 2> 1307140 INFO (TEST-ForceLeaderTest.testReplicasInLIRNoLeader-seed#[26A53202BC47C79E]) [ ] o.a.s.s.SolrDispatchFilter Loading solr.xml from SolrHome (not found in ZooKeeper)
[junit4] 2> 1307140 INFO (TEST-ForceLeaderTest.testReplicasInLIRNoLeader-seed#[26A53202BC47C79E]) [ ] o.a.s.c.SolrXmlConfig Loading container configuration from /Users/jenkins/workspace/Lucene-Solr-6.x-MacOSX/solr/build/solr-core/test/J1/temp/solr.cloud.ForceLeaderTest_26A53202BC47C79E-001/control-001/solr.xml
[junit4] 2> 1307149 INFO (TEST-ForceLeaderTest.testReplicasInLIRNoLeader-seed#[26A53202BC47C79E]) [ ] o.a.s.c.CorePropertiesLocator Config-defined core root directory: /Users/jenkins/workspace/Lucene-Solr-6.x-MacOSX/solr/build/solr-core/test/J1/temp/solr.cloud.ForceLeaderTest_26A53202BC47C79E-001/control-001/cores
[junit4] 2> 1307149 INFO (TEST-ForceLeaderTest.testReplicasInLIRNoLeader-seed#[26A53202BC47C79E]) [ ] o.a.s.c.CoreContainer New CoreContainer 1555935718
[junit4] 2> 1307150 INFO (TEST-ForceLeaderTest.testReplicasInLIRNoLeader-seed#[26A53202BC47C79E]) [ ] o.a.s.c.CoreContainer Loading cores into CoreContainer [instanceDir=/Users/jenkins/workspace/Lucene-Solr-6.x-MacOSX/solr/build/solr-core/test/J1/temp/solr.cloud.ForceLeaderTest_26A53202BC47C79E-001/control-001]
[junit4] 2> 1307150 WARN (TEST-ForceLeaderTest.testReplicasInLIRNoLeader-seed#[26A53202BC47C79E]) [ ] o.a.s.c.CoreContainer Couldn't add files from /Users/jenkins/workspace/Lucene-Solr-6.x-MacOSX/solr/build/solr-core/test/J1/temp/solr.cloud.ForceLeaderTest_26A53202BC47C79E-001/control-001/lib to classpath: /Users/jenkins/workspace/Lucene-Solr-6.x-MacOSX/solr/build/solr-core/test/J1/temp/solr.cloud.ForceLeaderTest_26A53202BC47C79E-001/control-001/lib
[junit4] 2> 1307150 INFO (TEST-ForceLeaderTest.testReplicasInLIRNoLeader-seed#[26A53202BC47C79E]) [ ] o.a.s.h.c.HttpShardHandlerFactory created with socketTimeout : 90000,urlScheme : ,connTimeout : 15000,maxConnectionsPerHost : 20,maxConnections : 10000,corePoolSize : 0,maximumPoolSize : 2147483647,maxThreadIdleTime : 5,sizeOfQueue : -1,fairnessPolicy : false,useRetries : false,connectionsEvictorSleepDelay : 5000,maxConnectionIdleTime : 40000,
[junit4] 2> 1307157 INFO (TEST-ForceLeaderTest.testReplicasInLIRNoLeader-seed#[26A53202BC47C79E]) [ ] o.a.s.u.UpdateShardHandler Creating UpdateShardHandler HTTP client with params: socketTimeout=340000&connTimeout=45000&retry=true
[junit4] 2> 1307158 INFO (TEST-ForceLeaderTest.testReplicasInLIRNoLeader-seed#[26A53202BC47C79E]) [ ] o.a.s.l.LogWatcher SLF4J impl is org.slf4j.impl.Log4jLoggerFactory
[junit4] 2> 1307158 INFO (TEST-ForceLeaderTest.testReplicasInLIRNoLeader-seed#[26A53202BC47C79E]) [ ] o.a.s.l.LogWatcher Registering Log Listener [Log4j (org.slf4j.impl.Log4jLoggerFactory)]
[junit4] 2> 1307158 INFO (TEST-ForceLeaderTest.testReplicasInLIRNoLeader-seed#[26A53202BC47C79E]) [ ] o.a.s.c.ZkContainer Zookeeper client=127.0.0.1:53700/solr
[junit4] 2> 1307158 INFO (TEST-ForceLeaderTest.testReplicasInLIRNoLeader-seed#[26A53202BC47C79E]) [ ] o.a.s.c.ZkController zkHost includes chroot
[junit4] 2> 1307158 INFO (TEST-ForceLeaderTest.testReplicasInLIRNoLeader-seed#[26A53202BC47C79E]) [ ] o.a.s.c.c.SolrZkClient Using default ZkCredentialsProvider
[junit4] 2> 1307159 INFO (TEST-ForceLeaderTest.testReplicasInLIRNoLeader-seed#[26A53202BC47C79E]) [ ] o.a.s.c.c.ConnectionManager Waiting for client to connect to ZooKeeper
[junit4] 2> 1307161 INFO (zkCallback-1266-thread-1) [ ] o.a.s.c.c.ConnectionManager Watcher org.apache.solr.common.cloud.ConnectionManager@35e21dd1 name:ZooKeeperConnection Watcher:127.0.0.1:53700 got event WatchedEvent state:SyncConnected type:None path:null path:null type:None
[junit4] 2> 1307162 INFO (TEST-ForceLeaderTest.testReplicasInLIRNoLeader-seed#[26A53202BC47C79E]) [ ] o.a.s.c.c.ConnectionManager Client is connected to ZooKeeper
[junit4] 2> 1307162 INFO (TEST-ForceLeaderTest.testReplicasInLIRNoLeader-seed#[26A53202BC47C79E]) [ ] o.a.s.c.c.SolrZkClient Using default ZkACLProvider
[junit4] 2> 1307165 INFO (TEST-ForceLeaderTest.testReplicasInLIRNoLeader-seed#[26A53202BC47C79E]) [n:127.0.0.1:53706_v ] o.a.s.c.ZkController Added new OnReconnect listener org.apache.solr.cloud.ZkController$$Lambda$74/1837588025@6f366b95
[junit4] 2> 1307166 INFO (TEST-ForceLeaderTest.testReplicasInLIRNoLeader-seed#[26A53202BC47C79E]) [n:127.0.0.1:53706_v ] o.a.s.c.c.ConnectionManager Waiting for client to connect to ZooKeeper
[junit4] 2> 1307168 INFO (zkCallback-1267-thread-1-processing-n:127.0.0.1:53706_v) [n:127.0.0.1:53706_v ] o.a.s.c.c.ConnectionManager Watcher org.apache.solr.common.cloud.ConnectionManager@1b042f5b name:ZooKeeperConnection Watcher:127.0.0.1:53700/solr got event WatchedEvent state:SyncConnected type:None path:null path:null type:None
[junit4] 2> 1307168 INFO (TEST-ForceLeaderTest.testReplicasInLIRNoLeader-seed#[26A53202BC47C79E]) [n:127.0.0.1:53706_v ] o.a.s.c.c.ConnectionManager Client is connected to ZooKeeper
[junit4] 2> 1307170 INFO (TEST-ForceLeaderTest.testReplicasInLIRNoLeader-seed#[26A53202BC47C79E]) [n:127.0.0.1:53706_v ] o.a.s.c.c.SolrZkClient makePath: /overseer/queue
[junit4] 2> 1307174 INFO (TEST-ForceLeaderTest.testReplicasInLIRNoLeader-seed#[26A53202BC47C79E]) [n:127.0.0.1:53706_v ] o.a.s.c.c.SolrZkClient makePath: /overseer/collection-queue-work
[junit4] 2> 1307181 INFO (TEST-ForceLeaderTest.testReplicasInLIRNoLeader-seed#[26A53202BC47C79E]) [n:127.0.0.1:53706_v ] o.a.s.c.c.SolrZkClient makePath: /overseer/collection-map-running
[junit4] 2> 1307185 INFO (TEST-ForceLeaderTest.testReplicasInLIRNoLeader-seed#[26A53202BC47C79E]) [n:127.0.0.1:53706_v ] o.a.s.c.c.SolrZkClient makePath: /overseer/collection-map-completed
[junit4] 2> 1307189 INFO (TEST-ForceLeaderTest.testReplicasInLIRNoLeader-seed#[26A53202BC47C79E]) [n:127.0.0.1:53706_v ] o.a.s.c.c.SolrZkClient makePath: /overseer/collection-map-failure
[junit4] 2> 1307192 INFO (TEST-ForceLeaderTest.testReplicasInLIRNoLeader-seed#[26A53202BC47C79E]) [n:127.0.0.1:53706_v ] o.a.s.c.c.SolrZkClient makePath: /live_nodes
[junit4] 2> 1307196 INFO (TEST-ForceLeaderTest.testReplicasInLIRNoLeader-seed#[26A53202BC47C79E]) [n:127.0.0.1:53706_v ] o.a.s.c.c.SolrZkClient makePath: /aliases.json
[junit4] 2> 1307198 INFO (TEST-ForceLeaderTest.testReplicasInLIRNoLeader-seed#[26A53202BC47C79E]) [n:127.0.0.1:53706_v ] o.a.s.c.c.SolrZkClient makePath: /clusterstate.json
[junit4] 2> 1307201 INFO (TEST-ForceLeaderTest.testReplicasInLIRNoLeader-seed#[26A53202BC47C79E]) [n:127.0.0.1:53706_v ] o.a.s.c.c.SolrZkClient makePath: /security.json
[junit4] 2> 1307203 INFO (TEST-ForceLeaderTest.testReplicasInLIRNoLeader-seed#[26A53202BC47C79E]) [n:127.0.0.1:53706_v ] o.a.s.c.c.ZkStateReader Updating cluster state from ZooKeeper...
[junit4] 2> 1307205 INFO (TEST-ForceLeaderTest.testReplicasInLIRNoLeader-seed#[26A53202BC47C79E]) [n:127.0.0.1:53706_v ] o.a.s.c.c.ZkStateReader Loaded empty cluster properties
[junit4] 2> 1307206 INFO (TEST-ForceLeaderTest.testReplicasInLIRNoLeader-seed#[26A53202BC47C79E]) [n:127.0.0.1:53706_v ] o.a.s.c.c.ZkStateReader Updated live nodes from ZooKeeper... (0) -> (0)
[junit4] 2> 1307212 INFO (TEST-ForceLeaderTest.testReplicasInLIRNoLeader-seed#[26A53202BC47C79E]) [n:127.0.0.1:53706_v ] o.a.s.c.c.SolrZkClient makePath: /overseer_elect
[junit4] 2> 1307215 INFO (TEST-ForceLeaderTest.testReplicasInLIRNoLeader-seed#[26A53202BC47C79E]) [n:127.0.0.1:53706_v ] o.a.s.c.c.SolrZkClient makePath: /overseer_elect/election
[junit4] 2> 1307218 INFO (TEST-ForceLeaderTest.testReplicasInLIRNoLeader-seed#[26A53202BC47C79E]) [n:127.0.0.1:53706_v ] o.a.s.c.Overseer Overseer (id=null) closing
[junit4] 2> 1307219 INFO (TEST-ForceLeaderTest.testReplicasInLIRNoLeader-seed#[26A53202BC47C79E]) [n:127.0.0.1:53706_v ] o.a.s.c.LeaderElector Joined leadership election with path: /overseer_elect/election/96590032332783620-127.0.0.1:53706_v-n_0000000000
[junit4] 2> 1307220 INFO (TEST-ForceLeaderTest.testReplicasInLIRNoLeader-seed#[26A53202BC47C79E]) [n:127.0.0.1:53706_v ] o.a.s.c.OverseerElectionContext I am going to be the leader 127.0.0.1:53706_v
[junit4] 2> 1307220 INFO (TEST-ForceLeaderTest.testReplicasInLIRNoLeader-seed#[26A53202BC47C79E]) [n:127.0.0.1:53706_v ] o.a.s.c.c.SolrZkClient makePath: /overseer_elect/leader
[junit4] 2> 1307223 INFO (TEST-ForceLeaderTest.testReplicasInLIRNoLeader-seed#[26A53202BC47C79E]) [n:127.0.0.1:53706_v ] o.a.s.c.Overseer Overseer (id=96590032332783620-127.0.0.1:53706_v-n_0000000000) starting
[junit4] 2> 1307227 INFO (TEST-ForceLeaderTest.testReplicasInLIRNoLeader-seed#[26A53202BC47C79E]) [n:127.0.0.1:53706_v ] o.a.s.c.c.SolrZkClient makePath: /overseer/queue-work
[junit4] 2> 1307241 INFO (TEST-ForceLeaderTest.testReplicasInLIRNoLeader-seed#[26A53202BC47C79E]) [n:127.0.0.1:53706_v ] o.a.s.c.OverseerAutoReplicaFailoverThread Starting OverseerAutoReplicaFailoverThread autoReplicaFailoverWorkLoopDelay=10000 autoReplicaFailoverWaitAfterExpiration=10000 autoReplicaFailoverBadNodeExpiration=60000
[junit4] 2> 1307242 INFO (OverseerCollectionConfigSetProcessor-96590032332783620-127.0.0.1:53706_v-n_0000000000) [n:127.0.0.1:53706_v ] o.a.s.c.OverseerTaskProcessor Process current queue of overseer operations
[junit4] 2> 1307244 INFO (OverseerStateUpdate-96590032332783620-127.0.0.1:53706_v-n_0000000000) [n:127.0.0.1:53706_v ] o.a.s.c.Overseer Starting to work on the main queue
[junit4] 2> 1307249 INFO (TEST-ForceLeaderTest.testReplicasInLIRNoLeader-seed#[26A53202BC47C79E]) [n:127.0.0.1:53706_v ] o.a.s.c.ZkController Register node as live in ZooKeeper:/live_nodes/127.0.0.1:53706_v
[junit4] 2> 1307249 INFO (TEST-ForceLeaderTest.testReplicasInLIRNoLeader-seed#[26A53202BC47C79E]) [n:127.0.0.1:53706_v ] o.a.s.c.c.SolrZkClient makePath: /live_nodes/127.0.0.1:53706_v
[junit4] 2> 1307253 INFO (OverseerStateUpdate-96590032332783620-127.0.0.1:53706_v-n_0000000000) [n:127.0.0.1:53706_v ] o.a.s.c.c.ZkStateReader Updated live nodes from ZooKeeper... (0) -> (0)
[junit4] 2> 1307254 INFO (zkCallback-1267-thread-1-processing-n:127.0.0.1:53706_v) [n:127.0.0.1:53706_v ] o.a.s.c.c.ZkStateReader A live node change: [WatchedEvent state:SyncConnected type:NodeChildrenChanged path:/live_nodes], has occurred - updating... (live nodes size: [0])
[junit4] 2> 1307258 INFO (zkCallback-1267-thread-1-processing-n:127.0.0.1:53706_v) [n:127.0.0.1:53706_v ] o.a.s.c.c.ZkStateReader Updated live nodes from ZooKeeper... (0) -> (1)
[junit4] 2> 1307283 INFO (TEST-ForceLeaderTest.testReplicasInLIRNoLeader-seed#[26A53202BC47C79E]) [n:127.0.0.1:53706_v ] o.a.s.c.CoreContainer Security conf doesn't exist. Skipping setup for authorization module.
[junit4] 2> 1307284 INFO (TEST-ForceLeaderTest.testReplicasInLIRNoLeader-seed#[26A53202BC47C79E]) [n:127.0.0.1:53706_v ] o.a.s.c.CoreContainer No authentication plugin used.
[junit4] 2> 1307285 INFO (TEST-ForceLeaderTest.testReplicasInLIRNoLeader-seed#[26A53202BC47C79E]) [n:127.0.0.1:53706_v ] o.a.s.c.CorePropertiesLocator Looking for core definitions underneath /Users/jenkins/workspace/Lucene-Solr-6.x-MacOSX/solr/build/solr-core/test/J1/temp/solr.cloud.ForceLeaderTest_26A53202BC47C79E-001/control-001/cores
[junit4] 2> 1307287 INFO (TEST-ForceLeaderTest.testReplicasInLIRNoLeader-seed#[26A53202BC47C79E]) [n:127.0.0.1:53706_v ] o.a.s.c.CoreDescriptor Created CoreDescriptor: {name=collection1, config=solrconfig.xml, transient=false, schema=schema.xml, loadOnStartup=true, configSetProperties=configsetprops.json, collection=control_collection, coreNodeName=, dataDir=data/, shard=}
[junit4] 2> 1307287 INFO (TEST-ForceLeaderTest.testReplicasInLIRNoLeader-seed#[26A53202BC47C79E]) [n:127.0.0.1:53706_v ] o.a.s.c.CorePropertiesLocator Found core collection1 in /Users/jenkins/workspace/Lucene-Solr-6.x-MacOSX/solr/build/solr-core/test/J1/temp/solr.cloud.ForceLeaderTest_26A53202BC47C79E-001/control-001/cores/collection1
[junit4] 2> 1307287 INFO (TEST-ForceLeaderTest.testReplicasInLIRNoLeader-seed#[26A53202BC47C79E]) [n:127.0.0.1:53706_v ] o.a.s.c.CorePropertiesLocator Found 1 core definitions
[junit4] 2> 1307289 INFO (coreLoadExecutor-3674-thread-1-processing-n:127.0.0.1:53706_v) [n:127.0.0.1:53706_v c:control_collection x:collection1] o.a.s.c.ZkController publishing state=down
[junit4] 2> 1307289 INFO (coreLoadExecutor-3674-thread-1-processing-n:127.0.0.1:53706_v) [n:127.0.0.1:53706_v c:control_collection x:collection1] o.a.s.c.ZkController numShards not found on descriptor - reading it from system property
[junit4] 2> 1307290 INFO (TEST-ForceLeaderTest.testReplicasInLIRNoLeader-seed#[26A53202BC47C79E]) [n:127.0.0.1:53706_v ] o.a.s.s.SolrDispatchFilter user.dir=/Users/jenkins/workspace/Lucene-Solr-6.x-MacOSX/solr/build/solr-core/test/J1
[junit4] 2> 1307290 INFO (TEST-ForceLeaderTest.testReplicasInLIRNoLeader-seed#[26A53202BC47C79E]) [n:127.0.0.1:53706_v ] o.a.s.s.SolrDispatchFilter SolrDispatchFilter.init() done
[junit4] 2> 1307293 INFO (coreLoadExecutor-3674-thread-1-processing-n:127.0.0.1:53706_v) [n:127.0.0.1:53706_v c:control_collection x:collection1] o.a.s.c.ZkController Collection control_collection not visible yet, but flagging it so a watch is registered when it becomes visible
[junit4] 2> 1307294 INFO (OverseerStateUpdate-96590032332783620-127.0.0.1:53706_v-n_0000000000) [n:127.0.0.1:53706_v ] o.a.s.c.Overseer processMessage: queueSize: 1, message = {
[junit4] 2> "core":"collection1",
[junit4] 2> "roles":null,
[junit4] 2> "base_url":"http://127.0.0.1:53706/v",
[junit4] 2> "node_name":"127.0.0.1:53706_v",
[junit4] 2> "numShards":"1",
[junit4] 2> "state":"down",
[junit4] 2> "shard":null,
[junit4] 2> "collection":"control_collection",
[junit4] 2> "operation":"state"} current state version: 0
[junit4] 2> 1307294 INFO (OverseerStateUpdate-96590032332783620-127.0.0.1:53706_v-n_0000000000) [n:127.0.0.1:53706_v ] o.a.s.c.o.ReplicaMutator Update state numShards=1 message={
[junit4] 2> "core":"collection1",
[junit4] 2> "roles":null,
[junit4] 2> "base_url":"http://127.0.0.1:53706/v",
[junit4] 2> "node_name":"127.0.0.1:53706_v",
[junit4] 2> "numShards":"1",
[junit4] 2> "state":"down",
[junit4] 2> "shard":null,
[junit4] 2> "collection":"control_collection",
[junit4] 2> "operation":"state"}
[junit4] 2> 1307295 INFO (coreLoadExecutor-3674-thread-1-processing-n:127.0.0.1:53706_v) [n:127.0.0.1:53706_v c:control_collection x:collection1] o.a.s.c.c.ZkStateReader Deleting data for [control_collection]
[junit4] 2> 1307295 INFO (OverseerStateUpdate-96590032332783620-127.0.0.1:53706_v-n_0000000000) [n:127.0.0.1:53706_v ] o.a.s.c.o.ClusterStateMutator building a new cName: control_collection
[junit4] 2> 1307297 INFO (OverseerStateUpdate-96590032332783620-127.0.0.1:53706_v-n_0000000000) [n:127.0.0.1:53706_v ] o.a.s.c.o.ReplicaMutator Assigning new node to shard shard=shard1
[junit4] 2> 1307298 INFO (coreLoadExecutor-3674-thread-1-processing-n:127.0.0.1:53706_v) [n:127.0.0.1:53706_v c:control_collection x:collection1] o.a.s.c.ZkController look for our core node name
[junit4] 2> 1307300 INFO (zkCallback-1267-thread-1-processing-n:127.0.0.1:53706_v) [n:127.0.0.1:53706_v ] o.a.s.c.c.ZkStateReader A cluster state change: [WatchedEvent state:SyncConnected type:NodeDataChanged path:/clusterstate.json], has occurred - updating... (live nodes size: [1])
[junit4] 2> 1308307 INFO (coreLoadExecutor-3674-thread-1-processing-n:127.0.0.1:53706_v) [n:127.0.0.1:53706_v c:control_collection x:collection1] o.a.s.c.ZkController waiting to find shard id in clusterstate for collection1
[junit4] 2> 1308307 INFO (coreLoadExecutor-3674-thread-1-processing-n:127.0.0.1:53706_v) [n:127.0.0.1:53706_v c:control_collection x:collection1] o.a.s.c.ZkController Check for collection zkNode:control_collection
[junit4] 2> 1308308 INFO (coreLoadExecutor-3674-thread-1-processing-n:127.0.0.1:53706_v) [n:127.0.0.1:53706_v c:control_collection x:collection1] o.a.s.c.ZkController Collection zkNode exists
[junit4] 2> 1308308 INFO (coreLoadExecutor-3674-thread-1-processing-n:127.0.0.1:53706_v) [n:127.0.0.1:53706_v c:control_collection x:collection1] o.a.s.c.c.ZkStateReader Load collection config from: [/collections/control_collection]
[junit4] 2> 1308309 INFO (coreLoadExecutor-3674-thread-1-processing-n:127.0.0.1:53706_v) [n:127.0.0.1:53706_v c:control_collection x:collection1] o.a.s.c.c.ZkStateReader path=[/collections/control_collection] [configName]=[conf1] specified config exists in ZooKeeper
[junit4] 2> 1308309 INFO (coreLoadExecutor-3674-thread-1-processing-n:127.0.0.1:53706_v) [n:127.0.0.1:53706_v c:control_collection x:collection1] o.a.s.c.SolrResourceLoader new SolrResourceLoader for directory: '/Users/jenkins/workspace/Lucene-Solr-6.x-MacOSX/solr/build/solr-core/test/J1/temp/solr.cloud.ForceLeaderTest_26A53202BC47C79E-001/control-001/cores/collection1'
[junit4] 2> 1308310 INFO (coreLoadExecutor-3674-thread-1-processing-n:127.0.0.1:53706_v) [n:127.0.0.1:53706_v c:control_collection x:collection1] o.a.s.c.SolrResourceLoader JNDI not configured for solr (NoInitialContextEx)
[junit4] 2> 1308310 INFO (coreLoadExecutor-3674-thread-1-processing-n:127.0.0.1:53706_v) [n:127.0.0.1:53706_v c:control_collection x:collection1] o.a.s.c.SolrResourceLoader solr home defaulted to 'solr/' (could not find system property or JNDI)
[junit4] 2> 1308313 INFO (coreLoadExecutor-3674-thread-1-processing-n:127.0.0.1:53706_v) [n:127.0.0.1:53706_v c:control_collection x:collection1] o.a.s.c.Config loaded config solrconfig.xml with version 0
[junit4] 2> 1308329 INFO (coreLoadExecutor-3674-thread-1-processing-n:127.0.0.1:53706_v) [n:127.0.0.1:53706_v c:control_collection x:collection1] o.a.s.c.SolrConfig current version of requestparams : -1
[junit4] 2> 1308333 WARN (coreLoadExecutor-3674-thread-1-processing-n:127.0.0.1:53706_v) [n:127.0.0.1:53706_v c:control_collection x:collection1] o.a.s.c.Config Beginning with Solr 5.5, <mergePolicy> is deprecated, use <mergePolicyFactory> instead.
[junit4] 2> 1308333 INFO (coreLoadExecutor-3674-thread-1-processing-n:127.0.0.1:53706_v) [n:127.0.0.1:53706_v c:control_collection x:collection1] o.a.s.c.SolrConfig Using Lucene MatchVersion: 6.3.0
[junit4] 2> 1308345 INFO (coreLoadExecutor-3674-thread-1-processing-n:127.0.0.1:53706_v) [n:127.0.0.1:53706_v c:control_collection x:collection1] o.a.s.c.SolrConfig Loaded SolrConfig: solrconfig.xml
[junit4] 2> 1308359 INFO (coreLoadExecutor-3674-thread-1-processing-n:127.0.0.1:53706_v) [n:127.0.0.1:53706_v c:control_collection x:collection1] o.a.s.s.IndexSchema [collection1] Schema name=test
[junit4] 2> 1308472 INFO (coreLoadExecutor-3674-thread-1-processing-n:127.0.0.1:53706_v) [n:127.0.0.1:53706_v c:control_collection x:collection1] o.a.s.s.OpenExchangeRatesOrgProvider Initialized with rates=open-exchange-rates.json, refreshInterval=1440.
[junit4] 2> 1308483 INFO (coreLoadExecutor-3674-thread-1-processing-n:127.0.0.1:53706_v) [n:127.0.0.1:53706_v c:control_collection x:collection1] o.a.s.s.IndexSchema default search field in schema is text
[junit4] 2> 1308485 INFO (coreLoadExecutor-3674-thread-1-processing-n:127.0.0.1:53706_v) [n:127.0.0.1:53706_v c:control_collection x:collection1] o.a.s.s.IndexSchema unique key field: id
[junit4] 2> 1308501 INFO (coreLoadExecutor-3674-thread-1-processing-n:127.0.0.1:53706_v) [n:127.0.0.1:53706_v c:control_collection x:collection1] o.a.s.s.FileExchangeRateProvider Reloading exchange rates from file currency.xml
[junit4] 2> 1308504 INFO (coreLoadExecutor-3674-thread-1-processing-n:127.0.0.1:53706_v) [n:127.0.0.1:53706_v c:control_collection x:collection1] o.a.s.s.FileExchangeRateProvider Reloading exchange rates from file currency.xml
[junit4] 2> 1308507 INFO (coreLoadExecutor-3674-thread-1-processing-n:127.0.0.1:53706_v) [n:127.0.0.1:53706_v c:control_collection x:collection1] o.a.s.s.OpenExchangeRatesOrgProvider Reloading exchange rates from open-exchange-rates.json
[junit4] 2> 1308509 INFO (coreLoadExecutor-3674-thread-1-processing-n:127.0.0.1:53706_v) [n:127.0.0.1:53706_v c:control_collection x:collection1] o.a.s.s.OpenExchangeRatesOrgProvider Reloading exchange rates from open-exchange-rates.json
[junit4] 2> 1308512 INFO (coreLoadExecutor-3674-thread-1-processing-n:127.0.0.1:53706_v) [n:127.0.0.1:53706_v c:control_collection x:collection1] o.a.s.c.ConfigSetProperties Did not find ConfigSet properties, assuming default properties: Can't find resource 'configsetprops.json' in classpath or '/configs/conf1', cwd=/Users/jenkins/workspace/Lucene-Solr-6.x-MacOSX/solr/build/solr-core/test/J1
[junit4] 2> 1308512 INFO (coreLoadExecutor-3674-thread-1-processing-n:127.0.0.1:53706_v) [n:127.0.0.1:53706_v c:control_collection x:collection1] o.a.s.c.CoreContainer Creating SolrCore 'collection1' using configuration from collection control_collection
[junit4] 2> 1308512 INFO (coreLoadExecutor-3674-thread-1-processing-n:127.0.0.1:53706_v) [n:127.0.0.1:53706_v c:control_collection s:shard1 r:core_node1 x:collection1] o.a.s.c.SolrCore org.apache.solr.core.MockDirectoryFactory
[junit4] 2> 1308513 INFO (coreLoadExecutor-3674-thread-1-processing-n:127.0.0.1:53706_v) [n:127.0.0.1:53706_v c:control_collection s:shard1 r:core_node1 x:collection1] o.a.s.c.SolrCore [[collection1] ] Opening new SolrCore at [/Users/jenkins/workspace/Lucene-Solr-6.x-MacOSX/solr/build/solr-core/test/J1/temp/solr.cloud.ForceLeaderTest_26A53202BC47C79E-001/control-001/cores/collection1], dataDir=[/Users/jenkins/workspace/Lucene-Solr-6.x-MacOSX/solr/build/solr-core/test/J1/temp/solr.cloud.ForceLeaderTest_26A53202BC47C79E-001/control-001/cores/collection1/data/]
[junit4] 2> 1308513 INFO (coreLoadExecutor-3674-thread-1-processing-n:127.0.0.1:53706_v) [n:127.0.0.1:53706_v c:control_collection s:shard1 r:core_node1 x:collection1] o.a.s.c.JmxMonitoredMap JMX monitoring is enabled. Adding Solr mbeans to JMX Server: com.sun.jmx.mbeanserver.JmxMBeanServer@16616b8a
[junit4] 2> 1308513 INFO (coreLoadExecutor-3674-thread-1-processing-n:127.0.0.1:53706_v) [n:127.0.0.1:53706_v c:control_collection s:shard1 r:core_node1 x:collection1] o.a.s.c.CachingDirectoryFactory return new directory for /Users/jenkins/workspace/Lucene-Solr-6.x-MacOSX/solr/build/solr-core/test/J1/temp/solr.cloud.ForceLeaderTest_26A53202BC47C79E-001/control-001/cores/collection1/data/snapshot_metadata
[junit4] 2> 1308513 INFO (coreLoadExecutor-3674-thread-1-processing-n:127.0.0.1:53706_v) [n:127.0.0.1:53706_v c:control_collection s:shard1 r:core_node1 x:collection1] o.a.s.c.s.SolrSnapshotMetaDataManager Loading from snapshot metadata file...
[junit4] 2> 1308514 INFO (coreLoadExecutor-3674-thread-1-processing-n:127.0.0.1:53706_v) [n:127.0.0.1:53706_v c:control_collection s:shard1 r:core_node1 x:collection1] o.a.s.c.CachingDirectoryFactory return new directory for /Users/jenkins/workspace/Lucene-Solr-6.x-MacOSX/solr/build/solr-core/test/J1/temp/solr.cloud.ForceLeaderTest_26A53202BC47C79E-001/control-001/cores/collection1/data
[junit4] 2> 1308514 INFO (coreLoadExecutor-3674-thread-1-processing-n:127.0.0.1:53706_v) [n:127.0.0.1:53706_v c:control_collection s:shard1 r:core_node1 x:collection1] o.a.s.c.SolrCore New index directory detected: old=null new=/Users/jenkins/workspace/Lucene-Solr-6.x-MacOSX/solr/build/solr-core/test/J1/temp/solr.cloud.ForceLeaderTest_26A53202BC47C79E-001/control-001/cores/collection1/data/index/
[junit4] 2> 1308514 WARN (coreLoadExecutor-3674-thread-1-processing-n:127.0.0.1:53706_v) [n:127.0.0.1:53706_v c:control_collection s:shard1 r:core_node1 x:collection1] o.a.s.c.SolrCore [collection1] Solr index directory '/Users/jenkins/workspace/Lucene-Solr-6.x-MacOSX/solr/build/solr-core/test/J1/temp/solr.cloud.ForceLeaderTest_26A53202BC47C79E-001/control-001/cores/collection1/data/index' doesn't exist. Creating new index...
[junit4] 2> 1308514 INFO (coreLoadExecutor-3674-thread-1-processing-n:127.0.0.1:53706_v) [n:127.0.0.1:53706_v c:control_collection s:shard1 r:core_node1 x:collection1] o.a.s.c.CachingDirectoryFactory return new directory for /Users/jenkins/workspace/Lucene-Solr-6.x-MacOSX/solr/build/solr-core/test/J1/temp/solr.cloud.ForceLeaderTest_26A53202BC47C79E-001/control-001/cores/collection1/data/index
[junit4] 2> 1308514 INFO (coreLoadExecutor-3674-thread-1-processing-n:127.0.0.1:53706_v) [n:127.0.0.1:53706_v c:control_collection s:shard1 r:core_node1 x:collection1] o.a.s.u.RandomMergePolicy RandomMergePolicy wrapping class org.apache.lucene.index.LogDocMergePolicy: [LogDocMergePolicy: minMergeSize=1000, mergeFactor=25, maxMergeSize=9223372036854775807, maxMergeSizeForForcedMerge=9223372036854775807, calibrateSizeByDeletes=false, maxMergeDocs=2147483647, maxCFSSegmentSizeMB=8.796093022207999E12, noCFSRatio=0.8472043970557415]
[junit4] 2> 1308515 INFO (coreLoadExecutor-3674-thread-1-processing-n:127.0.0.1:53706_v) [n:127.0.0.1:53706_v c:control_collection s:shard1 r:core_node1 x:collection1] o.a.s.c.SolrDeletionPolicy SolrDeletionPolicy.onCommit: commits: num=1
[junit4] 2> commit{dir=MockDirectoryWrapper(RAMDirectory@d0eb636 lockFactory=org.apache.lucene.store.SingleInstanceLockFactory@39a85527),segFN=segments_1,generation=1}
[junit4] 2> 1308515 INFO (coreLoadExecutor-3674-thread-1-processing-n:127.0.0.1:53706_v) [n:127.0.0.1:53706_v c:control_collection s:shard1 r:core_node1 x:collection1] o.a.s.c.SolrDeletionPolicy newest commit generation = 1
[junit4] 2> 1308515 INFO (OldIndexDirectoryCleanupThreadForCore-collection1) [n:127.0.0.1:53706_v c:control_collection s:shard1 r:core_node1 x:collection1] o.a.s.c.SolrCore Looking for old index directories to cleanup for core collection1 in /Users/jenkins/workspace/Lucene-Solr-6.x-MacOSX/solr/build/solr-core/test/J1/temp/solr.cloud.ForceLeaderTest_26A53202BC47C79E-001/control-001/cores/collection1/data/
[junit4] 2> 1308516 WARN (OldIndexDirectoryCleanupThreadForCore-collection1) [n:127.0.0.1:53706_v c:control_collection s:shard1 r:core_node1 x:collection1] o.a.s.c.DirectoryFactory /Users/jenkins/workspace/Lucene-Solr-6.x-MacOSX/solr/build/solr-core/test/J1/temp/solr.cloud.ForceLeaderTest_26A53202BC47C79E-001/control-001/cores/collection1/data/ does not point to a valid data directory; skipping clean-up of old index directories.
[junit4] 2> 1308520 INFO (coreLoadExecutor-3674-thread-1-processing-n:127.0.0.1:53706_v) [n:127.0.0.1:53706_v c:control_collection s:shard1 r:core_node1 x:collection1] o.a.s.u.p.UpdateRequestProcessorChain creating updateRequestProcessorChain "nodistrib"
[junit4] 2> 1308520 INFO (coreLoadExecutor-3674-thread-1-processing-n:127.0.0.1:53706_v) [n:127.0.0.1:53706_v c:control_collection s:shard1 r:core_node1 x:collection1] o.a.s.u.p.UpdateRequestProcessorChain creating updateRequestProcessorChain "dedupe"
[junit4] 2> 1308520 INFO (coreLoadExecutor-3674-thread-1-processing-n:127.0.0.1:53706_v) [n:127.0.0.1:53706_v c:control_collection s:shard1 r:core_node1 x:collection1] o.a.s.u.p.UpdateRequestProcessorChain inserting DistributedUpdateProcessorFactory into updateRequestProcessorChain "dedupe"
[junit4] 2> 1308520 INFO (coreLoadExecutor-3674-thread-1-processing-n:127.0.0.1:53706_v) [n:127.0.0.1:53706_v c:control_collection s:shard1 r:core_node1 x:collection1] o.a.s.u.p.UpdateRequestProcessorChain creating updateRequestProcessorChain "stored_sig"
[junit4] 2> 1308520 INFO (coreLoadExecutor-3674-thread-1-processing-n:127.0.0.1:53706_v) [n:127.0.0.1:53706_v c:control_collection s:shard1 r:core_node1 x:collection1] o.a.s.u.p.UpdateRequestProcessorChain inserting DistributedUpdateProcessorFactory into updateRequestProcessorChain "stored_sig"
[junit4] 2> 1308520 INFO (coreLoadExecutor-3674-thread-1-processing-n:127.0.0.1:53706_v) [n:127.0.0.1:53706_v c:control_collection s:shard1 r:core_node1 x:collection1] o.a.s.u.p.UpdateRequestProcessorChain creating updateRequestProcessorChain "distrib-dup-test-chain-explicit"
[junit4] 2> 1308520 INFO (coreLoadExecutor-3674-thread-1-processing-n:127.0.0.1:53706_v) [n:127.0.0.1:53706_v c:control_collection s:shard1 r:core_node1 x:collection1] o.a.s.u.p.UpdateRequestProcessorChain creating updateRequestProcessorChain "distrib-dup-test-chain-implicit"
[junit4] 2> 1308521 INFO (coreLoadExecutor-3674-thread-1-processing-n:127.0.0.1:53706_v) [n:127.0.0.1:53706_v c:control_collection s:shard1 r:core_node1 x:collection1] o.a.s.u.p.UpdateRequestProcessorChain inserting DistributedUpdateProcessorFactory into updateRequestProcessorChain "distrib-dup-test-chain-implicit"
[junit4] 2> 1308521 INFO (coreLoadExecutor-3674-thread-1-processing-n:127.0.0.1:53706_v) [n:127.0.0.1:53706_v c:control_collection s:shard1 r:core_node1 x:collection1] o.a.s.c.SolrCore no updateRequestProcessorChain defined as default, creating implicit default
[junit4] 2> 1308521 WARN (coreLoadExecutor-3674-thread-1-processing-n:127.0.0.1:53706_v) [n:127.0.0.1:53706_v c:control_collection s:shard1 r:core_node1 x:collection1] o.a.s.c.RequestHandlers INVALID paramSet a in requestHandler {type = requestHandler,name = /dump,class = DumpRequestHandler,args = {defaults={a=A,b=B}}}
[junit4] 2> 1308535 INFO (coreLoadExecutor-3674-thread-1-processing-n:127.0.0.1:53706_v) [n:127.0.0.1:53706_v c:control_collection s:shard1 r:core_node1 x:collection1] o.a.s.h.l.XMLLoader xsltCacheLifetimeSeconds=60
[junit4] 2> 1308537 INFO (coreLoadExecutor-3674-thread-1-processing-n:127.0.0.1:53706_v) [n:127.0.0.1:53706_v c:control_collection s:shard1 r:core_node1 x:collection1] o.a.s.h.l.XMLLoader xsltCacheLifetimeSeconds=60
[junit4] 2> 1308538 INFO (coreLoadExecutor-3674-thread-1-processing-n:127.0.0.1:53706_v) [n:127.0.0.1:53706_v c:control_collection s:shard1 r:core_node1 x:collection1] o.a.s.h.l.XMLLoader xsltCacheLifetimeSeconds=60
[junit4] 2> 1308540 INFO (coreLoadExecutor-3674-thread-1-processing-n:127.0.0.1:53706_v) [n:127.0.0.1:53706_v c:control_collection s:shard1 r:core_node1 x:collection1] o.a.s.h.l.XMLLoader xsltCacheLifetimeSeconds=60
[junit4] 2> 1308548 INFO (coreLoadExecutor-3674-thread-1-processing-n:127.0.0.1:53706_v) [n:127.0.0.1:53706_v c:control_collection s:shard1 r:core_node1 x:collection1] o.a.s.c.RequestHandlers Registered paths: /admin/mbeans,standard,/update/json/docs,/admin/luke,/export,/get,/admin/properties,/update/json,/admin/threads,/dump,/update/csv,/sql,/graph,/admin/segments,/admin/system,/replication,/config,/stream,/schema,/admin/plugins,/admin/logging,/admin/ping,/update,/admin/file,/terms
[junit4] 2> 1308548 INFO (coreLoadExecutor-3674-thread-1-processing-n:127.0.0.1:53706_v) [n:127.0.0.1:53706_v c:control_collection s:shard1 r:core_node1 x:collection1] o.a.s.c.SolrCore Using default statsCache cache: org.apache.solr.search.stats.LocalStatsCache
[junit4] 2> 1308550 INFO (coreLoadExecutor-3674-thread-1-processing-n:127.0.0.1:53706_v) [n:127.0.0.1:53706_v c:control_collection s:shard1 r:core_node1 x:collection1] o.a.s.u.UpdateHandler Using UpdateLog implementation: org.apache.solr.update.UpdateLog
[junit4] 2> 1308550 INFO (coreLoadExecutor-3674-thread-1-processing-n:127.0.0.1:53706_v) [n:127.0.0.1:53706_v c:control_collection s:shard1 r:core_node1 x:collection1] o.a.s.u.UpdateLog Initializing UpdateLog: dataDir= defaultSyncLevel=FLUSH numRecordsToKeep=100 maxNumLogsToKeep=10 numVersionBuckets=65536
[junit4] 2> 1308551 INFO (coreLoadExecutor-3674-thread-1-processing-n:127.0.0.1:53706_v) [n:127.0.0.1:53706_v c:control_collection s:shard1 r:core_node1 x:collection1] o.a.s.u.CommitTracker Hard AutoCommit: disabled
[junit4] 2> 1308551 INFO (coreLoadExecutor-3674-thread-1-processing-n:127.0.0.1:53706_v) [n:127.0.0.1:53706_v c:control_collection s:shard1 r:core_node1 x:collection1] o.a.s.u.CommitTracker Soft AutoCommit: disabled
[junit4] 2> 1308552 INFO (coreLoadExecutor-3674-thread-1-processing-n:127.0.0.1:53706_v) [n:127.0.0.1:53706_v c:control_collection s:shard1 r:core_node1 x:collection1] o.a.s.u.RandomMergePolicy RandomMergePolicy wrapping class org.apache.lucene.index.TieredMergePolicy: [TieredMergePolicy: maxMergeAtOnce=32, maxMergeAtOnceExplicit=22, maxMergedSegmentMB=51.748046875, floorSegmentMB=0.2646484375, forceMergeDeletesPctAllowed=5.122367355199705, segmentsPerTier=50.0, maxCFSSegmentSizeMB=8.796093022207999E12, noCFSRatio=1.0
[junit4] 2> 1308552 INFO (coreLoadExecutor-3674-thread-1-processing-n:127.0.0.1:53706_v) [n:127.0.0.1:53706_v c:control_collection s:shard1 r:core_node1 x:collection1] o.a.s.c.SolrDeletionPolicy SolrDeletionPolicy.onInit: commits: num=1
[junit4] 2> commit{dir=MockDirectoryWrapper(RAMDirectory@d0eb636 lockFactory=org.apache.lucene.store.SingleInstanceLockFactory@39a85527),segFN=segments_1,generation=1}
[junit4] 2> 1308552 INFO (coreLoadExecutor-3674-thread-1-processing-n:127.0.0.1:53706_v) [n:127.0.0.1:53706_v c:control_collection s:shard1 r:core_node1 x:collection1] o.a.s.c.SolrDeletionPolicy newest commit generation = 1
[junit4] 2> 1308552 INFO (coreLoadExecutor-3674-thread-1-processing-n:127.0.0.1:53706_v) [n:127.0.0.1:53706_v c:control_collection s:shard1 r:core_node1 x:collection1] o.a.s.s.SolrIndexSearcher Opening [Searcher@535813da[collection1] main]
[junit4] 2> 1308553 INFO (coreLoadExecutor-3674-thread-1-processing-n:127.0.0.1:53706_v) [n:127.0.0.1:53706_v c:control_collection s:shard1 r:core_node1 x:collection1] o.a.s.c.c.ZkStateReader Load collection config from: [/collections/control_collection]
[junit4] 2> 1308554 INFO (coreLoadExecutor-3674-thread-1-processing-n:127.0.0.1:53706_v) [n:127.0.0.1:53706_v c:control_collection s:shard1 r:core_node1 x:collection1] o.a.s.c.c.ZkStateReader path=[/collections/control_collection] [configName]=[conf1] specified config exists in ZooKeeper
[junit4] 2> 1308554 INFO (coreLoadExecutor-3674-thread-1-processing-n:127.0.0.1:53706_v) [n:127.0.0.1:53706_v c:control_collection s:shard1 r:core_node1 x:collection1] o.a.s.r.ManagedResourceStorage Setting up ZooKeeper-based storage for the RestManager with znodeBase: /configs/conf1
[junit4] 2> 1308555 INFO (coreLoadExecutor-3674-thread-1-processing-n:127.0.0.1:53706_v) [n:127.0.0.1:53706_v c:control_collection s:shard1 r:core_node1 x:collection1] o.a.s.r.ManagedResourceStorage Configured ZooKeeperStorageIO with znodeBase: /configs/conf1
[junit4] 2> 1308555 INFO (coreLoadExecutor-3674-thread-1-processing-n:127.0.0.1:53706_v) [n:127.0.0.1:53706_v c:control_collection s:shard1 r:core_node1 x:collection1] o.a.s.r.RestManager Initializing RestManager with initArgs: {}
[junit4] 2> 1308555 INFO (coreLoadExecutor-3674-thread-1-processing-n:127.0.0.1:53706_v) [n:127.0.0.1:53706_v c:control_collection s:shard1 r:core_node1 x:collection1] o.a.s.r.ManagedResourceStorage Reading _rest_managed.json using ZooKeeperStorageIO:path=/configs/conf1
[junit4] 2> 1308555 INFO (coreLoadExecutor-3674-thread-1-processing-n:127.0.0.1:53706_v) [n:127.0.0.1:53706_v c:control_collection s:shard1 r:core_node1 x:collection1] o.a.s.r.ManagedResourceStorage No data found for znode /configs/conf1/_rest_managed.json
[junit4] 2> 1308556 INFO (coreLoadExecutor-3674-thread-1-processing-n:127.0.0.1:53706_v) [n:127.0.0.1:53706_v c:control_collection s:shard1 r:core_node1 x:collection1] o.a.s.r.ManagedResourceStorage Loaded null at path _rest_managed.json using ZooKeeperStorageIO:path=/configs/conf1
[junit4] 2> 1308556 INFO (coreLoadExecutor-3674-thread-1-processing-n:127.0.0.1:53706_v) [n:127.0.0.1:53706_v c:control_collection s:shard1 r:core_node1 x:collection1] o.a.s.r.RestManager Initializing 0 registered ManagedResources
[junit4] 2> 1308556 INFO (coreLoadExecutor-3674-thread-1-processing-n:127.0.0.1:53706_v) [n:127.0.0.1:53706_v c:control_collection s:shard1 r:core_node1 x:collection1] o.a.s.h.ReplicationHandler Commits will be reserved for 10000
[junit4] 2> 1308557 INFO (coreLoadExecutor-3674-thread-1-processing-n:127.0.0.1:53706_v) [n:127.0.0.1:53706_v c:control_collection s:shard1 r:core_node1 x:collection1] o.a.s.u.UpdateLog Looking up max value of version field to seed version buckets
[junit4] 2> 1308557 INFO (coreLoadExecutor-3674-thread-1-processing-n:127.0.0.1:53706_v) [n:127.0.0.1:53706_v c:control_collection s:shard1 r:core_node1 x:collection1] o.a.s.u.VersionInfo Refreshing highest value of _version_ for 65536 version buckets from index
[junit4] 2> 1308557 INFO (coreLoadExecutor-3674-thread-1-processing-n:127.0.0.1:53706_v) [n:127.0.0.1:53706_v c:control_collection s:shard1 r:core_node1 x:collection1] o.a.s.u.VersionInfo No terms found for _version_, cannot seed version bucket highest value from index
[junit4] 2> 1308557 INFO (coreLoadExecutor-3674-thread-1-processing-n:127.0.0.1:53706_v) [n:127.0.0.1:53706_v c:control_collection s:shard1 r:core_node1 x:collection1] o.a.s.u.UpdateLog Could not find max version in index or recent updates, using new clock 1545440520913813504
[junit4] 2> 1308558 INFO (searcherExecutor-3675-thread-1-processing-n:127.0.0.1:53706_v x:collection1 s:shard1 c:control_collection r:core_node1) [n:127.0.0.1:53706_v c:control_collection s:shard1 r:core_node1 x:collection1] o.a.s.c.SolrCore [collection1] Registered new searcher Searcher@535813da[collection1] main{ExitableDirectoryReader(UninvertingDirectoryReader())}
[junit4] 2> 1308559 INFO (coreLoadExecutor-3674-thread-1-processing-n:127.0.0.1:53706_v) [n:127.0.0.1:53706_v c:control_collection s:shard1 r:core_node1 x:collection1] o.a.s.u.UpdateLog Took 1.0ms to seed version buckets with highest version 1545440520913813504
[junit4] 2> 1308559 INFO (coreLoadExecutor-3674-thread-1-processing-n:127.0.0.1:53706_v) [n:127.0.0.1:53706_v c:control_collection s:shard1 r:core_node1 x:collection1] o.a.s.c.ZkController watch zkdir /configs/conf1
[junit4] 2> 1308560 INFO (coreLoadExecutor-3674-thread-1-processing-n:127.0.0.1:53706_v) [n:127.0.0.1:53706_v c:control_collection s:shard1 r:core_node1 x:collection1] o.a.s.c.CoreContainer registering core: collection1
[junit4] 2> 1308560 INFO (coreZkRegister-3667-thread-1-processing-n:127.0.0.1:53706_v x:collection1 s:shard1 c:control_collection r:core_node1) [n:127.0.0.1:53706_v c:control_collection s:shard1 r:core_node1 x:collection1] o.a.s.c.ZkController Register replica - core:collection1 address:http://127.0.0.1:53706/v collection:control_collection shard:shard1
[junit4] 2> 1308563 INFO (coreZkRegister-3667-thread-1-processing-n:127.0.0.1:53706_v x:collection1 s:shard1 c:control_collection r:core_node1) [n:127.0.0.1:53706_v c:control_collection s:shard1 r:core_node1 x:collection1] o.a.s.c.c.SolrZkClient makePath: /collections/control_collection/leader_elect/shard1/election
[junit4] 2> 1308569 INFO (coreZkRegister-3667-thread-1-processing-n:127.0.0.1:53706_v x:collection1 s:shard1 c:control_collection r:core_node1) [n:127.0.0.1:53706_v c:control_collection s:shard1 r:core_node1 x:collection1] o.a.s.c.LeaderElector Joined leadership election with path: /collections/control_collection/leader_elect/shard1/election/96590032332783620-core_node1-n_0000000000
[junit4] 2> 1308570 INFO (coreZkRegister-3667-thread-1-processing-n:127.0.0.1:53706_v x:collection1 s:shard1 c:control_collection r:core_node1) [n:127.0.0.1:53706_v c:control_collection s:shard1 r:core_node1 x:collection1] o.a.s.c.ShardLeaderElectionContext Running the leader process for shard=shard1 and weAreReplacement=false and leaderVoteWait=10000
[junit4] 2> 1308573 INFO (coreZkRegister-3667-thread-1-processing-n:127.0.0.1:53706_v x:collection1 s:shard1 c:control_collection r:core_node1) [n:127.0.0.1:53706_v c:control_collection s:shard1 r:core_node1 x:collection1] o.a.s.c.ShardLeaderElectionContext Enough replicas found to continue.
[junit4] 2> 1308573 INFO (coreZkRegister-3667-thread-1-processing-n:127.0.0.1:53706_v x:collection1 s:shard1 c:control_collection r:core_node1) [n:127.0.0.1:53706_v c:control_collection s:shard1 r:core_node1 x:collection1] o.a.s.c.ShardLeaderElectionContext I may be the new leader - try and sync
[junit4] 2> 1308573 INFO (coreZkRegister-3667-thread-1-processing-n:127.0.0.1:53706_v x:collection1 s:shard1 c:control_collection r:core_node1) [n:127.0.0.1:53706_v c:control_collection s:shard1 r:core_node1 x:collection1] o.a.s.c.SyncStrategy Sync replicas to http://127.0.0.1:53706/v/collection1/
[junit4] 2> 1308574 INFO (coreZkRegister-3667-thread-1-processing-n:127.0.0.1:53706_v x:collection1 s:shard1 c:control_collection r:core_node1) [n:127.0.0.1:53706_v c:control_collection s:shard1 r:core_node1 x:collection1] o.a.s.c.SyncStrategy Sync Success - now sync replicas to me
[junit4] 2> 1308574 INFO (coreZkRegister-3667-thread-1-processing-n:127.0.0.1:53706_v x:collection1 s:shard1 c:control_collection r:core_node1) [n:127.0.0.1:53706_v c:control_collection s:shard1 r:core_node1 x:collection1] o.a.s.c.SyncStrategy http://127.0.0.1:53706/v/collection1/ has no replicas
[junit4] 2> 1308575 INFO (OverseerStateUpdate-96590032332783620-127.0.0.1:53706_v-n_0000000000) [n:127.0.0.1:53706_v ] o.a.s.c.Overseer processMessage: queueSize: 1, message = {
[junit4] 2> "operation":"leader",
[junit4] 2> "shard":"shard1",
[junit4] 2> "collection":"control_collection"} current state version: 1
[junit4] 2> 1308576 INFO (coreZkRegister-3667-thread-1-processing-n:127.0.0.1:53706_v x:collection1 s:shard1 c:control_collection r:core_node1) [n:127.0.0.1:53706_v c:control_collection s:shard1 r:core_node1 x:collection1] o.a.s.c.c.SolrZkClient makePath: /collections/control_collection/leaders/shard1
[junit4] 2> 1308581 INFO (coreZkRegister-3667-thread-1-processing-n:127.0.0.1:53706_v x:collection1 s:shard1 c:control_collection r:core_node1) [n:127.0.0.1:53706_v c:control_collection s:shard1 r:core_node1 x:collection1] o.a.s.c.ShardLeaderElectionContextBase Creating leader registration node /collections/control_collection/leaders/shard1/leader after winning as /collections/control_collection/leader_elect/shard1/election/96590032332783620-core_node1-n_0000000000
[junit4] 2> 1308585 INFO (coreZkRegister-3667-thread-1-processing-n:127.0.0.1:53706_v x:collection1 s:shard1 c:control_collection r:core_node1) [n:127.0.0.1:53706_v c:control_collection s:shard1 r:core_node1 x:collection1] o.a.s.c.ShardLeaderElectionContext I am the new leader: http://127.0.0.1:53706/v/collection1/ shard1
[junit4] 2> 1308586 INFO (OverseerStateUpdate-96590032332783620-127.0.0.1:53706_v-n_0000000000) [n:127.0.0.1:53706_v ] o.a.s.c.Overseer processMessage: queueSize: 1, message = {
[junit4] 2> "operation":"leader",
[junit4] 2> "shard":"shard1",
[junit4] 2> "collection":"control_collection",
[junit4] 2> "base_url":"http://127.0.0.1:53706/v",
[junit4] 2> "core":"collection1",
[junit4] 2> "state":"active"} current state version: 1
[junit4] 2> 1308690 INFO (zkCallback-1267-thread-2-processing-n:127.0.0.1:53706_v) [n:127.0.0.1:53706_v ] o.a.s.c.c.ZkStateReader A cluster state change: [WatchedEvent state:SyncConnected type:NodeDataChanged path:/clusterstate.json], has occurred - updating... (live nodes size: [1])
[junit4] 2> 1308748 INFO (coreZkRegister-3667-thread-1-processing-n:127.0.0.1:53706_v x:collection1 s:shard1 c:control_collection r:core_node1) [n:127.0.0.1:53706_v c:control_collection s:shard1 r:core_node1 x:collection1] o.a.s.c.ZkController We are http://127.0.0.1:53706/v/collection1/ and leader is http://127.0.0.1:53706/v/collection1/
[junit4] 2> 1308748 INFO (coreZkRegister-3667-thread-1-processing-n:127.0.0.1:53706_v x:collection1 s:shard1 c:control_collection r:core_node1) [n:127.0.0.1:53706_v c:control_collection s:shard1 r:core_node1 x:collection1] o.a.s.c.ZkController No LogReplay needed for core=collection1 baseURL=http://127.0.0.1:53706/v
[junit4] 2> 1308748 INFO (coreZkRegister-3667-thread-1-processing-n:127.0.0.1:53706_v x:collection1 s:shard1 c:control_collection r:core_node1) [n:127.0.0.1:53706_v c:control_collection s:shard1 r:core_node1 x:collection1] o.a.s.c.ZkController I am the leader, no recovery necessary
[junit4] 2> 1308748 INFO (coreZkRegister-3667-thread-1-processing-n:127.0.0.1:53706_v x:collection1 s:shard1 c:control_collection r:core_node1) [n:127.0.0.1:53706_v c:control_collection s:shard1 r:core_node1 x:collection1] o.a.s.c.ZkController publishing state=active
[junit4] 2> 1308748 INFO (coreZkRegister-3667-thread-1-processing-n:127.0.0.1:53706_v x:collection1 s:shard1 c:control_collection r:core_node1) [n:127.0.0.1:53706_v c:control_collection s:shard1 r:core_node1 x:collection1] o.a.s.c.ZkController numShards not found on descriptor - reading it from system property
[junit4] 2> 1308749 INFO (coreZkRegister-3667-thread-1-processing-n:127.0.0.1:53706_v x:collection1 s:shard1 c:control_collection r:core_node1) [n:127.0.0.1:53706_v c:control_collection s:shard1 r:core_node1 x:collection1] o.a.s.c.c.ZkStateReader Checking legacy cluster state for collection control_collection
[junit4] 2> 1308751 INFO (OverseerStateUpdate-96590032332783620-127.0.0.1:53706_v-n_0000000000) [n:127.0.0.1:53706_v ] o.a.s.c.Overseer processMessage: queueSize: 1, message = {
[junit4] 2> "core":"collection1",
[junit4] 2> "core_node_name":"core_node1",
[junit4] 2> "roles":null,
[junit4] 2> "base_url":"http://127.0.0.1:53706/v",
[junit4] 2> "node_name":"127.0.0.1:53706_v",
[junit4] 2> "numShards":"1",
[junit4] 2> "state":"active",
[junit4] 2> "shard":"shard1",
[junit4] 2> "collection":"control_collection",
[junit4] 2> "operation":"state"} current state version: 2
[junit4] 2> 1308752 INFO (OverseerStateUpdate-96590032332783620-127.0.0.1:53706_v-n_0000000000) [n:127.0.0.1:53706_v ] o.a.s.c.o.ReplicaMutator Update state numShards=1 message={
[junit4] 2> "core":"collection1",
[junit4] 2> "core_node_name":"core_node1",
[junit4] 2> "roles":null,
[junit4] 2> "base_url":"http://127.0.0.1:53706/v",
[junit4] 2> "node_name":"127.0.0.1:53706_v",
[junit4] 2> "numShards":"1",
[junit4] 2> "state":"active",
[junit4] 2> "shard":"shard1",
[junit4] 2> "collection":"control_collection",
[junit4] 2> "operation":"state"}
[junit4] 2> 1308809 INFO (TEST-ForceLeaderTest.testReplicasInLIRNoLeader-seed#[26A53202BC47C79E]) [ ] o.a.s.c.c.SolrZkClient Using default ZkCredentialsProvider
[junit4] 2> 1308810 INFO (TEST-ForceLeaderTest.testReplicasInLIRNoLeader-seed#[26A53202BC47C79E]) [ ] o.a.s.c.c.ConnectionManager Waiting for client to connect to ZooKeeper
[junit4] 2> 1308812 INFO (zkCallback-1271-thread-1) [ ] o.a.s.c.c.ConnectionManager Watcher org.apache.solr.common.cloud.ConnectionManager@6bdb4977 name:ZooKeeperConnection Watcher:127.0.0.1:53700/solr got event WatchedEvent state:SyncConnected type:None path:null path:null type:None
[junit4] 2> 1308812 INFO (TEST-ForceLeaderTest.testReplicasInLIRNoLeader-seed#[26A53202BC47C79E]) [ ] o.a.s.c.c.ConnectionManager Client is connected to ZooKeeper
[junit4] 2> 1308812 INFO (TEST-ForceLeaderTest.testReplicasInLIRNoLeader-seed#[26A53202BC47C79E]) [ ] o.a.s.c.c.SolrZkClient Using default ZkACLProvider
[junit4] 2> 1308812 INFO (TEST-ForceLeaderTest.testReplicasInLIRNoLeader-seed#[26A53202BC47C79E]) [ ] o.a.s.c.c.ZkStateReader Updating cluster state from ZooKeeper...
[junit4] 2> 1308813 INFO (TEST-ForceLeaderTest.testReplicasInLIRNoLeader-seed#[26A53202BC47C79E]) [ ] o.a.s.c.c.ZkStateReader Loaded empty cluster properties
[junit4] 2> 1308815 INFO (TEST-ForceLeaderTest.testReplicasInLIRNoLeader-seed#[26A53202BC47C79E]) [ ] o.a.s.c.c.ZkStateReader Updated live nodes from ZooKeeper... (0) -> (1)
[junit4] 2> 1308817 INFO (TEST-ForceLeaderTest.testReplicasInLIRNoLeader-seed#[26A53202BC47C79E]) [ ] o.a.s.c.ChaosMonkey monkey: init - expire sessions:false cause connection loss:false
[junit4] 2> 1308817 INFO (TEST-ForceLeaderTest.testReplicasInLIRNoLeader-seed#[26A53202BC47C79E]) [ ] o.a.s.c.AbstractFullDistribZkTestBase Creating collection1 with stateFormat=2
[junit4] 2> 1308817 INFO (TEST-ForceLeaderTest.testReplicasInLIRNoLeader-seed#[26A53202BC47C79E]) [ ] o.a.s.c.c.SolrZkClient Using default ZkCredentialsProvider
[junit4] 2> 1308818 INFO (TEST-ForceLeaderTest.testReplicasInLIRNoLeader-seed#[26A53202BC47C79E]) [ ] o.a.s.c.c.ConnectionManager Waiting for client to connect to ZooKeeper
[junit4] 2> 1308820 INFO (zkCallback-1272-thread-1) [ ] o.a.s.c.c.ConnectionManager Watcher org.apache.solr.common.cloud.ConnectionManager@3ad44a2d name:ZooKeeperConnection Watcher:127.0.0.1:53700/solr got event WatchedEvent state:SyncConnected type:None path:null path:null type:None
[junit4] 2> 1308820 INFO (TEST-ForceLeaderTest.testReplicasInLIRNoLeader-seed#[26A53202BC47C79E]) [ ] o.a.s.c.c.ConnectionManager Client is connected to ZooKeeper
[junit4] 2> 1308820 INFO (TEST-ForceLeaderTest.testReplicasInLIRNoLeader-seed#[26A53202BC47C79E]) [ ] o.a.s.c.c.SolrZkClient Using default ZkACLProvider
[junit4] 2> 1308825 INFO (OverseerStateUpdate-96590032332783620-127.0.0.1:53706_v-n_0000000000) [n:127.0.0.1:53706_v ] o.a.s.c.Overseer processMessage: queueSize: 1, message = {
[junit4] 2> "operation":"create",
[junit4] 2> "name":"collection1",
[junit4] 2> "numShards":"2",
[junit4] 2> "stateFormat":"2"} current state version: 2
[junit4] 2> 1308825 INFO (OverseerStateUpdate-96590032332783620-127.0.0.1:53706_v-n_0000000000) [n:127.0.0.1:53706_v ] o.a.s.c.o.ClusterStateMutator building a new cName: collection1
[junit4] 2> 1308827 INFO (zkCallback-1267-thread-3-processing-n:127.0.0.1:53706_v) [n:127.0.0.1:53706_v ] o.a.s.c.c.ZkStateReader A cluster state change: [WatchedEvent state:SyncConnected type:NodeDataChanged path:/clusterstate.json], has occurred - updating... (live nodes size: [1])
[junit4] 2> 1308827 INFO (zkCallback-1271-thread-1) [ ] o.a.s.c.c.ZkStateReader A cluster state change: [WatchedEvent state:SyncConnected type:NodeDataChanged path:/clusterstate.json], has occurred - updating... (live nodes size: [1])
[junit4] 2> 1308942 INFO (OverseerStateUpdate-96590032332783620-127.0.0.1:53706_v-n_0000000000) [n:127.0.0.1:53706_v ] o.a.s.c.o.ZkStateWriter going to create_collection /collections/collection1/state.json
[junit4] 2> 1309335 INFO (TEST-ForceLeaderTest.testReplicasInLIRNoLeader-seed#[26A53202BC47C79E]) [ ] o.a.s.SolrTestCaseJ4 Writing core.properties file to /Users/jenkins/workspace/Lucene-Solr-6.x-MacOSX/solr/build/solr-core/test/J1/temp/solr.cloud.ForceLeaderTest_26A53202BC47C79E-001/shard-1-001/cores/collection1
[junit4] 2> 1309337 INFO (TEST-ForceLeaderTest.testReplicasInLIRNoLeader-seed#[26A53202BC47C79E]) [ ] o.a.s.c.AbstractFullDistribZkTestBase create jetty 1 in directory /Users/jenkins/workspace/Lucene-Solr-6.x-MacOSX/solr/build/solr-core/test/J1/temp/solr.cloud.ForceLeaderTest_26A53202BC47C79E-001/shard-1-001
[junit4] 2> 1309338 INFO (TEST-ForceLeaderTest.testReplicasInLIRNoLeader-seed#[26A53202BC47C79E]) [ ] o.e.j.s.Server jetty-9.3.8.v20160314
[junit4] 2> 1309340 INFO (TEST-ForceLeaderTest.testReplicasInLIRNoLeader-seed#[26A53202BC47C79E]) [ ] o.e.j.s.h.ContextHandler Started o.e.j.s.ServletContextHandler@2574d1ae{/v,null,AVAILABLE}
[junit4] 2> 1309341 INFO (TEST-ForceLeaderTest.testReplicasInLIRNoLeader-seed#[26A53202BC47C79E]) [ ] o.e.j.s.ServerConnector Started ServerConnector@5241565f{HTTP/1.1,[http/1.1]}{127.0.0.1:53721}
[junit4] 2> 1309342 INFO (TEST-ForceLeaderTest.testReplicasInLIRNoLeader-seed#[26A53202BC47C79E]) [ ] o.e.j.s.Server Started @1314595ms
[junit4] 2> 1309342 INFO (TEST-ForceLeaderTest.testReplicasInLIRNoLeader-seed#[26A53202BC47C79E]) [ ] o.a.s.c.s.e.JettySolrRunner Jetty properties: {solr.data.dir=/Users/jenkins/workspace/Lucene-Solr-6.x-MacOSX/solr/build/solr-core/test/J1/temp/solr.cloud.ForceLeaderTest_26A53202BC47C79E-001/tempDir-001/jetty1, solrconfig=solrconfig.xml, hostContext=/v, hostPort=53719, coreRootDirectory=/Users/jenkins/workspace/Lucene-Solr-6.x-MacOSX/solr/build/solr-core/test/J1/temp/solr.cloud.ForceLeaderTest_26A53202BC47C79E-001/shard-1-001/cores}
[junit4] 2> 1309342 INFO (TEST-ForceLeaderTest.testReplicasInLIRNoLeader-seed#[26A53202BC47C79E]) [ ] o.a.s.s.SolrDispatchFilter SolrDispatchFilter.init(): sun.misc.Launcher$AppClassLoader@4554617c
[junit4] 2> 1309342 INFO (TEST-ForceLeaderTest.testReplicasInLIRNoLeader-seed#[26A53202BC47C79E]) [ ] o.a.s.c.SolrResourceLoader new SolrResourceLoader for directory: '/Users/jenkins/workspace/Lucene-Solr-6.x-MacOSX/solr/build/solr-core/test/J1/temp/solr.cloud.ForceLeaderTest_26A53202BC47C79E-001/shard-1-001'
[junit4] 2> 1309342 INFO (TEST-ForceLeaderTest.testReplicasInLIRNoLeader-seed#[26A53202BC47C79E]) [ ] o.a.s.c.SolrResourceLoader JNDI not configured for solr (NoInitialContextEx)
[junit4] 2> 1309342 INFO (TEST-ForceLeaderTest.testReplicasInLIRNoLeader-seed#[26A53202BC47C79E]) [ ] o.a.s.c.SolrResourceLoader solr home defaulted to 'solr/' (could not find system property or JNDI)
[junit4] 2> 1309343 INFO (TEST-ForceLeaderTest.testReplicasInLIRNoLeader-seed#[26A53202BC47C79E]) [ ] o.a.s.c.c.SolrZkClient Using default ZkCredentialsProvider
[junit4] 2> 1309344 INFO (TEST-ForceLeaderTest.testReplicasInLIRNoLeader-seed#[26A53202BC47C79E]) [ ] o.a.s.c.c.ConnectionManager Waiting for client to connect to ZooKeeper
[junit4] 2> 1309345 INFO (zkCallback-1273-thread-1) [ ] o.a.s.c.c.ConnectionManager Watcher org.apache.solr.common.cloud.ConnectionManager@6d473b64 name:ZooKeeperConnection Watcher:127.0.0.1:53700/solr got event WatchedEvent state:SyncConnected type:None path:null path:null type:None
[junit4] 2> 1309345 INFO (TEST-ForceLeaderTest.testReplicasInLIRNoLeader-seed#[26A53202BC47C79E]) [ ] o.a.s.c.c.ConnectionManager Client is connected to ZooKeeper
[junit4] 2> 1309346 INFO (TEST-ForceLeaderTest.testReplicasInLIRNoLeader-seed#[26A53202BC47C79E]) [ ] o.a.s.c.c.SolrZkClient Using default ZkACLProvider
[junit4] 2> 1309347 INFO (TEST-ForceLeaderTest.testReplicasInLIRNoLeader-seed#[26A53202BC47C79E]) [ ] o.a.s.s.SolrDispatchFilter Loading solr.xml from SolrHome (not found in ZooKeeper)
[junit4] 2> 1309347 INFO (TEST-ForceLeaderTest.testReplicasInLIRNoLeader-seed#[26A53202BC47C79E]) [ ] o.a.s.c.SolrXmlConfig Loading container configuration from /Users/jenkins/workspace/Lucene-Solr-6.x-MacOSX/solr/build/solr-core/test/J1/temp/solr.cloud.ForceLeaderTest_26A53202BC47C79E-001/shard-1-001/solr.xml
[junit4] 2> 1309368 INFO (TEST-ForceLeaderTest.testReplicasInLIRNoLeader-seed#[26A53202BC47C79E]) [ ] o.a.s.c.CorePropertiesLocator Config-defined core root directory: /Users/jenkins/workspace/Lucene-Solr-6.x-MacOSX/solr/build/solr-core/test/J1/temp/solr.cloud.ForceLeaderTest_26A53202BC47C79E-001/shard-1-001/cores
[junit4] 2> 1309368 INFO (TEST-ForceLeaderTest.testReplicasInLIRNoLeader-seed#[26A53202BC47C79E]) [ ] o.a.s.c.CoreContainer New CoreContainer 1878242742
[junit4] 2> 1309368 INFO (TEST-ForceLeaderTest.testReplicasInLIRNoLeader-seed#[26A53202BC47C79E]) [ ] o.a.s.c.CoreContainer Loading cores into CoreContainer [instanceDir=/Users/jenkins/workspace/Lucene-Solr-6.x-MacOSX/solr/build/solr-core/test/J1/temp/solr.cloud.ForceLeaderTest_26A53202BC47C79E-001/shard-1-001]
[junit4] 2> 1309368 WARN (TEST-ForceLeaderTest.testReplicasInLIRNoLeader-seed#[26A53202BC47C79E]) [ ] o.a.s.c.CoreContainer Couldn't add files from /Users/jenkins/workspace/Lucene-Solr-6.x-MacOSX/solr/build/solr-core/test/J1/temp/solr.cloud.ForceLeaderTest_26A53202BC47C79E-001/shard-1-001/lib to classpath: /Users/jenkins/workspace/Lucene-Solr-6.x-MacOSX/solr/build/solr-core/test/J1/temp/solr.cloud.ForceLeaderTest_26A53202BC47C79E-001/shard-1-001/lib
[junit4] 2> 1309368 INFO (TEST-ForceLeaderTest.testReplicasInLIRNoLeader-seed#[26A53202BC47C79E]) [ ] o.a.s.h.c.HttpShardHandlerFactory created with socketTimeout : 90000,urlScheme : ,connTimeout : 15000,maxConnectionsPerHost : 20,maxConnections : 10000,corePoolSize : 0,maximumPoolSize : 2147483647,maxThreadIdleTime : 5,sizeOfQueue : -1,fairnessPolicy : false,useRetries : false,connectionsEvictorSleepDelay : 5000,maxConnectionIdleTime : 40000,
[junit4] 2> 1309373 INFO (TEST-ForceLeaderTest.testReplicasInLIRNoLeader-seed#[26A53202BC47C79E]) [ ] o.a.s.u.UpdateShardHandler Creating UpdateShardHandler HTTP client with params: socketTimeout=340000&connTimeout=45000&retry=true
[junit4] 2> 1309375 INFO (TEST-ForceLeaderTest.testReplicasInLIRNoLeader-seed#[26A53202BC47C79E]) [ ] o.a.s.l.LogWatcher SLF4J impl is org.slf4j.impl.Log4jLoggerFactory
[junit4] 2> 1309375 INFO (TEST-ForceLeaderTest.testReplicasInLIRNoLeader-seed#[26A53202BC47C79E]) [ ] o.a.s.l.LogWatcher Registering Log Listener [Log4j (org.slf4j.impl.Log4jLoggerFactory)]
[junit4] 2> 1309375 INFO (TEST-ForceLeaderTest.testReplicasInLIRNoLeader-seed#[26A53202BC47C79E]) [ ] o.a.s.c.ZkContainer Zookeeper client=127.0.0.1:53700/solr
[junit4] 2> 1309375 INFO (TEST-ForceLeaderTest.testReplicasInLIRNoLeader-seed#[26A53202BC47C79E]) [ ] o.a.s.c.ZkController zkHost includes chroot
[junit4] 2> 1309375 INFO (TEST-ForceLeaderTest.testReplicasInLIRNoLeader-seed#[26A53202BC47C79E]) [ ] o.a.s.c.c.SolrZkClient Using default ZkCredentialsProvider
[junit4] 2> 1309376 INFO (TEST-ForceLeaderTest.testReplicasInLIRNoLeader-seed#[26A53202BC47C79E]) [ ] o.a.s.c.c.ConnectionManager Waiting for client to connect to ZooKeeper
[junit4] 2> 1309377 INFO (zkCallback-1276-thread-1) [ ] o.a.s.c.c.ConnectionManager Watcher org.apache.solr.common.cloud.ConnectionManager@36b6b851 name:ZooKeeperConnection Watcher:127.0.0.1:53700 got event WatchedEvent state:SyncConnected type:None path:null path:null type:None
[junit4] 2> 1309378 INFO (TEST-ForceLeaderTest.testReplicasInLIRNoLeader-seed#[26A53202BC47C79E]) [ ] o.a.s.c.c.ConnectionManager Client is connected to ZooKeeper
[junit4] 2> 1309378 INFO (TEST-ForceLeaderTest.testReplicasInLIRNoLeader-seed#[26A53202BC47C79E]) [ ] o.a.s.c.c.SolrZkClient Using default ZkACLProvider
[junit4] 2> 1309382 INFO (TEST-ForceLeaderTest.testReplicasInLIRNoLeader-seed#[26A53202BC47C79E]) [n:127.0.0.1:53719_v ] o.a.s.c.ZkController Added new OnReconnect listener org.apache.solr.cloud.ZkController$$Lambda$74/1837588025@2f238876
[junit4] 2> 1309383 INFO (TEST-ForceLeaderTest.testReplicasInLIRNoLeader-seed#[26A53202BC47C79E]) [n:127.0.0.1:53719_v ] o.a.s.c.c.ConnectionManager Waiting for client to connect to ZooKeeper
[junit4] 2> 1309384 INFO (zkCallback-1277-thread-1-processing-n:127.0.0.1:53719_v) [n:127.0.0.1:53719_v ] o.a.s.c.c.ConnectionManager Watcher org.apache.solr.common.cloud.ConnectionManager@278da925 name:ZooKeeperConnection Watcher:127.0.0.1:53700/solr got event WatchedEvent state:SyncConnected type:None path:null path:null type:None
[junit4] 2> 1309384 INFO (TEST-ForceLeaderTest.testReplicasInLIRNoLeader-seed#[26A53202BC47C79E]) [n:127.0.0.1:53719_v ] o.a.s.c.c.ConnectionManager Client is connected to ZooKeeper
[junit4] 2> 1309395 INFO (TEST-ForceLeaderTest.testReplicasInLIRNoLeader-seed#[26A53202BC47C79E]) [n:127.0.0.1:53719_v ] o.a.s.c.c.ZkStateReader Updating cluster state from ZooKeeper...
[junit4] 2> 1309396 INFO (TEST-ForceLeaderTest.testReplicasInLIRNoLeader-seed#[26A53202BC47C79E]) [n:127.0.0.1:53719_v ] o.a.s.c.c.ZkStateReader Loaded empty cluster properties
[junit4] 2> 1309398 INFO (TEST-ForceLeaderTest.testReplicasInLIRNoLeader-seed#[26A53202BC47C79E]) [n:127.0.0.1:53719_v ] o.a.s.c.c.ZkStateReader Updated live nodes from ZooKeeper... (0) -> (1)
[junit4] 2> 1309404 INFO (TEST-ForceLeaderTest.testReplicasInLIRNoLeader-seed#[26A53202BC47C79E]) [n:127.0.0.1:53719_v ] o.a.s.c.Overseer Overseer (id=null) closing
[junit4] 2> 1309405 INFO (TEST-ForceLeaderTest.testReplicasInLIRNoLeader-seed#[26A53202BC47C79E]) [n:127.0.0.1:53719_v ] o.a.s.c.LeaderElector Joined leadership election with path: /overseer_elect/election/96590032332783625-127.0.0.1:53719_v-n_0000000001
[junit4] 2> 1309406 INFO (TEST-ForceLeaderTest.testReplicasInLIRNoLeader-seed#[26A53202BC47C79E]) [n:127.0.0.1:53719_v ] o.a.s.c.LeaderElector Watching path /overseer_elect/election/96590032332783620-127.0.0.1:53706_v-n_0000000000 to know if I could be the leader
[junit4] 2> 1309407 INFO (TEST-ForceLeaderTest.testReplicasInLIRNoLeader-seed#[26A53202BC47C79E]) [n:127.0.0.1:53719_v ] o.a.s.c.ZkController Publish node=127.0.0.1:53719_v as DOWN
[junit4] 2> 1309410 INFO (TEST-ForceLeaderTest.testReplicasInLIRNoLeader-seed#[26A53202BC47C79E]) [n:127.0.0.1:53719_v ] o.a.s.c.ZkController Register node as live in ZooKeeper:/live_nodes/127.0.0.1:53719_v
[junit4] 2> 1309410 INFO (TEST-ForceLeaderTest.testReplicasInLIRNoLeader-seed#[26A53202BC47C79E]) [n:127.0.0.1:53719_v ] o.a.s.c.c.SolrZkClient makePath: /live_nodes/127.0.0.1:53719_v
[junit4] 2> 1309411 INFO (OverseerStateUpdate-96590032332783620-127.0.0.1:53706_v-n_0000000000) [n:127.0.0.1:53706_v ] o.a.s.c.Overseer processMessage: queueSize: 1, message = {
[junit4] 2> "operation":"downnode",
[junit4] 2> "node_name":"127.0.0.1:53719_v"} current state version: 3
[junit4] 2> 1309411 INFO (OverseerStateUpdate-96590032332783620-127.0.0.1:53706_v-n_0000000000) [n:127.0.0.1:53706_v ] o.a.s.c.o.NodeMutator DownNode state invoked for node: 127.0.0.1:53719_v
[junit4] 2> 1309414 INFO (zkCallback-1267-thread-1-processing-n:127.0.0.1:53706_v) [n:127.0.0.1:53706_v ] o.a.s.c.c.ZkStateReader A cluster state change: [WatchedEvent state:SyncConnected type:NodeDataChanged path:/clusterstate.json], has occurred - updating... (live nodes size: [1])
[junit4] 2> 1309415 INFO (zkCallback-1271-thread-1) [ ] o.a.s.c.c.ZkStateReader A cluster state change: [WatchedEvent state:SyncConnected type:NodeDataChanged path:/clusterstate.json], has occurred - updating... (live nodes size: [1])
[junit4] 2> 1309424 INFO (zkCallback-1277-thread-1-processing-n:127.0.0.1:53719_v) [n:127.0.0.1:53719_v ] o.a.s.c.c.ZkStateReader A cluster state change: [WatchedEvent state:SyncConnected type:NodeDataChanged path:/clusterstate.json], has occurred - updating... (live nodes size: [1])
[junit4] 2> 1309428 INFO (zkCallback-1267-thread-1-processing-n:127.0.0.1:53706_v) [n:127.0.0.1:53706_v ] o.a.s.c.c.ZkStateReader A live node change: [WatchedEvent state:SyncConnected type:NodeChildrenChanged path:/live_nodes], has occurred - updating... (live nodes size: [1])
[junit4] 2> 1309428 INFO (zkCallback-1271-thread-1) [ ] o.a.s.c.c.ZkStateReader A live node change: [WatchedEvent state:SyncConnected type:NodeChildrenChanged path:/live_nodes], has occurred - updating... (live nodes size: [1])
[junit4] 2> 1309428 INFO (zkCallback-1277-thread-1-processing-n:127.0.0.1:53719_v) [n:127.0.0.1:53719_v ] o.a.s.c.c.ZkStateReader A live node change: [WatchedEvent state:SyncConnected type:NodeChildrenChanged path:/live_nodes], has occurred - updating... (live nodes size: [1])
[junit4] 2> 1309429 INFO (zkCallback-1267-thread-1-processing-n:127.0.0.1:53706_v) [n:127.0.0.1:53706_v ] o.a.s.c.c.ZkStateReader Updated live nodes from ZooKeeper... (1) -> (2)
[junit4] 2> 1309429 INFO (zkCallback-1271-thread-1) [ ] o.a.s.c.c.ZkStateReader Updated live nodes from ZooKeeper... (1) -> (2)
[junit4] 2> 1309429 INFO (zkCallback-1277-thread-1-processing-n:127.0.0.1:53719_v) [n:127.0.0.1:53719_v ] o.a.s.c.c.ZkStateReader Updated live nodes from ZooKeeper... (1) -> (2)
[junit4] 2> 1309443 INFO (TEST-ForceLeaderTest.testReplicasInLIRNoLeader-seed#[26A53202BC47C79E]) [n:127.0.0.1:53719_v ] o.a.s.c.CoreContainer Security conf doesn't exist. Skipping setup for authorization module.
[junit4] 2> 1309443 INFO (TEST-ForceLeaderTest.testReplicasInLIRNoLeader-seed#[26A53202BC47C79E]) [n:127.0.0.1:53719_v ] o.a.s.c.CoreContainer No authentication plugin used.
[junit4] 2> 1309444 INFO (TEST-ForceLeaderTest.testReplicasInLIRNoLeader-seed#[26A53202BC47C79E]) [n:127.0.0.1:53719_v ] o.a.s.c.CorePropertiesLocator Looking for core definitions underneath /Users/jenkins/workspace/Lucene-Solr-6.x-MacOSX/solr/build/solr-core/test/J1/temp/solr.cloud.ForceLeaderTest_26A53202BC47C79E-001/shard-1-001/cores
[junit4] 2> 1309445 INFO (TEST-ForceLeaderTest.testReplicasInLIRNoLeader-seed#[26A53202BC47C79E]) [n:127.0.0.1:53719_v ] o.a.s.c.CoreDescriptor Created CoreDescriptor: {name=collection1, config=solrconfig.xml, transient=false, schema=schema.xml, loadOnStartup=true, configSetProperties=configsetprops.json, collection=collection1, coreNodeName=, dataDir=data/, shard=}
[junit4] 2> 1309445 INFO (TEST-ForceLeaderTest.testReplicasInLIRNoLeader-seed#[26A53202BC47C79E]) [n:127.0.0.1:53719_v ] o.a.s.c.CorePropertiesLocator Found core collection1 in /Users/jenkins/workspace/Lucene-Solr-6.x-MacOSX/solr/build/solr-core/test/J1/temp/solr.cloud.ForceLeaderTest_26A53202BC47C79E-001/shard-1-001/cores/collection1
[junit4] 2> 1309445 INFO (TEST-ForceLeaderTest.testReplicasInLIRNoLeader-seed#[26A53202BC47C79E]) [n:127.0.0.1:53719_v ] o.a.s.c.CorePropertiesLocator Found 1 core definitions
[junit4] 2> 1309447 INFO (coreLoadExecutor-3685-thread-1-processing-n:127.0.0.1:53719_v) [n:127.0.0.1:53719_v c:collection1 x:collection1] o.a.s.c.ZkController publishing state=down
[junit4] 2> 1309447 INFO (coreLoadExecutor-3685-thread-1-processing-n:127.0.0.1:53719_v) [n:127.0.0.1:53719_v c:collection1 x:collection1] o.a.s.c.ZkController numShards not found on descriptor - reading it from system property
[junit4] 2> 1309449 INFO (coreLoadExecutor-3685-thread-1-processing-n:127.0.0.1:53719_v) [n:127.0.0.1:53719_v c:collection1 x:collection1] o.a.s.c.ZkController Registering watch for collection collection1
[junit4] 2> 1309449 INFO (coreLoadExecutor-3685-thread-1-processing-n:127.0.0.1:53719_v) [n:127.0.0.1:53719_v c:collection1 x:collection1] o.a.s.c.c.ZkStateReader Add data for [collection1] ver [0]
[junit4] 2> 1309450 INFO (OverseerStateUpdate-96590032332783620-127.0.0.1:53706_v-n_0000000000) [n:127.0.0.1:53706_v ] o.a.s.c.Overseer processMessage: queueSize: 1, message = {
[junit4] 2> "core":"collection1",
[junit4] 2> "roles":null,
[junit4] 2> "base_url":"http://127.0.0.1:53719/v",
[junit4] 2> "node_name":"127.0.0.1:53719_v",
[junit4] 2> "numShards":"2",
[junit4] 2> "state":"down",
[junit4] 2> "shard":null,
[junit4] 2> "collection":"collection1",
[junit4] 2> "operation":"state"} current state version: 4
[junit4] 2> 1309450 INFO (coreLoadExecutor-3685-thread-1-processing-n:127.0.0.1:53719_v) [n:127.0.0.1:53719_v c:collection1 x:collection1] o.a.s.c.ZkController look for our core node name
[junit4] 2> 1309450 INFO (OverseerStateUpdate-96590032332783620-127.0.0.1:53706_v-n_0000000000) [n:127.0.0.1:53706_v ] o.a.s.c.o.ReplicaMutator Update state numShards=2 message={
[junit4] 2> "core":"collection1",
[junit4] 2> "roles":null,
[junit4] 2> "base_url":"http://127.0.0.1:53719/v",
[junit4] 2> "node_name":"127.0.0.1:53719_v",
[junit4] 2> "numShards":"2",
[junit4] 2> "state":"down",
[junit4] 2> "shard":null,
[junit4] 2> "collection":"collection1",
[junit4] 2> "operation":"state"}
[junit4] 2> 1309450 INFO (OverseerStateUpdate-96590032332783620-127.0.0.1:53706_v-n_0000000000) [n:127.0.0.1:53706_v ] o.a.s.c.o.ReplicaMutator Collection already exists with numShards=2
[junit4] 2> 1309450 INFO (OverseerStateUpdate-96590032332783620-127.0.0.1:53706_v-n_0000000000) [n:127.0.0.1:53706_v ] o.a.s.c.o.ReplicaMutator Assigning new node to shard
[...truncated too long message...]
) [n:127.0.0.1:53962_v c:collection1 s:shard2 r:core_node3 x:collection1] o.a.s.c.CachingDirectoryFactory Closing MockDirectoryFactory - 3 directories currently being tracked
[junit4] 2> 1429663 INFO (zkCallback-1324-thread-1-processing-n:127.0.0.1:53962_v) [n:127.0.0.1:53962_v c:collection1 s:shard2 r:core_node3 x:collection1] o.a.s.c.CachingDirectoryFactory looking to close /Users/jenkins/workspace/Lucene-Solr-6.x-MacOSX/solr/build/solr-core/test/J1/temp/solr.cloud.ForceLeaderTest_26A53202BC47C79E-001/shard-3-002/cores/collection1/data/index [CachedDir<<refCount=0;path=/Users/jenkins/workspace/Lucene-Solr-6.x-MacOSX/solr/build/solr-core/test/J1/temp/solr.cloud.ForceLeaderTest_26A53202BC47C79E-001/shard-3-002/cores/collection1/data/index;done=false>>]
[junit4] 2> 1429663 INFO (zkCallback-1324-thread-1-processing-n:127.0.0.1:53962_v) [n:127.0.0.1:53962_v c:collection1 s:shard2 r:core_node3 x:collection1] o.a.s.c.CachingDirectoryFactory Closing directory, CoreContainer#isShutdown=true
[junit4] 2> 1429663 INFO (zkCallback-1324-thread-1-processing-n:127.0.0.1:53962_v) [n:127.0.0.1:53962_v c:collection1 s:shard2 r:core_node3 x:collection1] o.a.s.c.CachingDirectoryFactory Closing directory: /Users/jenkins/workspace/Lucene-Solr-6.x-MacOSX/solr/build/solr-core/test/J1/temp/solr.cloud.ForceLeaderTest_26A53202BC47C79E-001/shard-3-002/cores/collection1/data/index
[junit4] 2> 1429663 INFO (zkCallback-1324-thread-1-processing-n:127.0.0.1:53962_v) [n:127.0.0.1:53962_v c:collection1 s:shard2 r:core_node3 x:collection1] o.a.s.c.CachingDirectoryFactory looking to close /Users/jenkins/workspace/Lucene-Solr-6.x-MacOSX/solr/build/solr-core/test/J1/temp/solr.cloud.ForceLeaderTest_26A53202BC47C79E-001/shard-3-002/cores/collection1/data/snapshot_metadata [CachedDir<<refCount=0;path=/Users/jenkins/workspace/Lucene-Solr-6.x-MacOSX/solr/build/solr-core/test/J1/temp/solr.cloud.ForceLeaderTest_26A53202BC47C79E-001/shard-3-002/cores/collection1/data/snapshot_metadata;done=false>>]
[junit4] 2> 1429663 INFO (zkCallback-1324-thread-1-processing-n:127.0.0.1:53962_v) [n:127.0.0.1:53962_v c:collection1 s:shard2 r:core_node3 x:collection1] o.a.s.c.CachingDirectoryFactory Closing directory, CoreContainer#isShutdown=true
[junit4] 2> 1429663 INFO (zkCallback-1324-thread-1-processing-n:127.0.0.1:53962_v) [n:127.0.0.1:53962_v c:collection1 s:shard2 r:core_node3 x:collection1] o.a.s.c.CachingDirectoryFactory Closing directory: /Users/jenkins/workspace/Lucene-Solr-6.x-MacOSX/solr/build/solr-core/test/J1/temp/solr.cloud.ForceLeaderTest_26A53202BC47C79E-001/shard-3-002/cores/collection1/data/snapshot_metadata
[junit4] 2> 1429663 INFO (zkCallback-1324-thread-1-processing-n:127.0.0.1:53962_v) [n:127.0.0.1:53962_v c:collection1 s:shard2 r:core_node3 x:collection1] o.a.s.c.CachingDirectoryFactory looking to close /Users/jenkins/workspace/Lucene-Solr-6.x-MacOSX/solr/build/solr-core/test/J1/temp/solr.cloud.ForceLeaderTest_26A53202BC47C79E-001/shard-3-002/cores/collection1/data [CachedDir<<refCount=0;path=/Users/jenkins/workspace/Lucene-Solr-6.x-MacOSX/solr/build/solr-core/test/J1/temp/solr.cloud.ForceLeaderTest_26A53202BC47C79E-001/shard-3-002/cores/collection1/data;done=false>>]
[junit4] 2> 1429663 INFO (zkCallback-1324-thread-1-processing-n:127.0.0.1:53962_v) [n:127.0.0.1:53962_v c:collection1 s:shard2 r:core_node3 x:collection1] o.a.s.c.CachingDirectoryFactory Closing directory, CoreContainer#isShutdown=true
[junit4] 2> 1429663 INFO (zkCallback-1324-thread-1-processing-n:127.0.0.1:53962_v) [n:127.0.0.1:53962_v c:collection1 s:shard2 r:core_node3 x:collection1] o.a.s.c.CachingDirectoryFactory Closing directory: /Users/jenkins/workspace/Lucene-Solr-6.x-MacOSX/solr/build/solr-core/test/J1/temp/solr.cloud.ForceLeaderTest_26A53202BC47C79E-001/shard-3-002/cores/collection1/data
[junit4] 2> 1429663 INFO (zkCallback-1324-thread-1-processing-n:127.0.0.1:53962_v) [n:127.0.0.1:53962_v c:collection1 s:shard2 r:core_node3 x:collection1] o.a.s.c.ElectionContext Canceling election /collections/collection1/leader_elect/shard2/election/96590035715096591-core_node3-n_0000000001
[junit4] 2> 1429665 INFO (TEST-ForceLeaderTest.testLastPublishedStateIsActive-seed#[26A53202BC47C79E]) [ ] o.e.j.s.ServerConnector Stopped ServerConnector@1009c58f{HTTP/1.1,[http/1.1]}{127.0.0.1:0}
[junit4] 2> 1429665 INFO (TEST-ForceLeaderTest.testLastPublishedStateIsActive-seed#[26A53202BC47C79E]) [ ] o.e.j.s.h.ContextHandler Stopped o.e.j.s.ServletContextHandler@61694105{/v,null,UNAVAILABLE}
[junit4] 2> 1429667 INFO (TEST-ForceLeaderTest.testLastPublishedStateIsActive-seed#[26A53202BC47C79E]) [ ] o.a.s.c.ChaosMonkey monkey: stop shard! 53937
[junit4] 2> 1429668 INFO (TEST-ForceLeaderTest.testLastPublishedStateIsActive-seed#[26A53202BC47C79E]) [ ] o.a.s.c.ZkTestServer connecting to 127.0.0.1:53921 53921
[junit4] 2> 1429671 INFO (Thread-1661) [ ] o.a.s.c.ZkTestServer connecting to 127.0.0.1:53921 53921
[junit4] 2> 1435317 WARN (Thread-1661) [ ] o.a.s.c.ZkTestServer Watch limit violations:
[junit4] 2> Maximum concurrent create/delete watches above limit:
[junit4] 2>
[junit4] 2> 5 /solr/aliases.json
[junit4] 2> 5 /solr/clusterprops.json
[junit4] 2> 4 /solr/security.json
[junit4] 2> 4 /solr/configs/conf1
[junit4] 2>
[junit4] 2> Maximum concurrent data watches above limit:
[junit4] 2>
[junit4] 2> 5 /solr/clusterstate.json
[junit4] 2> 3 /solr/collections/forceleader_last_published/state.json
[junit4] 2> 3 /solr/collections/collection1/state.json
[junit4] 2>
[junit4] 2> Maximum concurrent children watches above limit:
[junit4] 2>
[junit4] 2> 65 /solr/overseer/collection-queue-work
[junit4] 2> 46 /solr/overseer/queue
[junit4] 2> 10 /solr/overseer/queue-work
[junit4] 2> 5 /solr/live_nodes
[junit4] 2> 5 /solr/collections
[junit4] 2>
[junit4] 2> 1435317 WARN (TEST-ForceLeaderTest.testLastPublishedStateIsActive-seed#[26A53202BC47C79E]) [ ] o.a.s.c.SocketProxy Closing 8 connections to: http://127.0.0.1:53937/v, target: http://127.0.0.1:53938/v
[junit4] 2> 1435317 WARN (TEST-ForceLeaderTest.testLastPublishedStateIsActive-seed#[26A53202BC47C79E]) [ ] o.a.s.c.SocketProxy Closing 5 connections to: http://127.0.0.1:53954/v, target: http://127.0.0.1:53955/v
[junit4] 2> 1435318 WARN (TEST-ForceLeaderTest.testLastPublishedStateIsActive-seed#[26A53202BC47C79E]) [ ] o.a.s.c.SocketProxy Closing 7 connections to: http://127.0.0.1:53945/v, target: http://127.0.0.1:53946/v
[junit4] 2> 1435318 WARN (TEST-ForceLeaderTest.testLastPublishedStateIsActive-seed#[26A53202BC47C79E]) [ ] o.a.s.c.SocketProxy Closing 0 connections to: http://127.0.0.1:53962/v, target: http://127.0.0.1:53963/v
[junit4] 2> 1435356 INFO (SUITE-ForceLeaderTest-seed#[26A53202BC47C79E]-worker) [ ] o.a.s.SolrTestCaseJ4 ###deleteCore
[junit4] 2> NOTE: leaving temporary files on disk at: /Users/jenkins/workspace/Lucene-Solr-6.x-MacOSX/solr/build/solr-core/test/J1/temp/solr.cloud.ForceLeaderTest_26A53202BC47C79E-001
[junit4] 2> NOTE: test params are: codec=Asserting(Lucene62), sim=RandomSimilarity(queryNorm=true,coord=no): {}, locale=es-PE, timezone=Pacific/Wallis
[junit4] 2> NOTE: Mac OS X 10.11.6 x86_64/Oracle Corporation 1.8.0_102 (64-bit)/cpus=3,threads=1,free=120286776,total=433061888
[junit4] 2> NOTE: All tests run in this JVM: [TestDefaultStatsCache, CustomCollectionTest, JsonLoaderTest, HdfsRecoverLeaseTest, CacheHeaderTest, AnalyticsMergeStrategyTest, SaslZkACLProviderTest, CloudExitableDirectoryReaderTest, RankQueryTest, ZkStateReaderTest, TestFieldTypeResource, TestSystemIdResolver, GraphQueryTest, HighlighterConfigTest, TestMacros, RAMDirectoryFactoryTest, SuggesterWFSTTest, CopyFieldTest, CollectionStateFormat2Test, BlockCacheTest, TestSolrDeletionPolicy2, DeleteReplicaTest, RequestHandlersTest, TestDynamicFieldResource, TestDistributedStatsComponentCardinality, HdfsLockFactoryTest, BasicDistributedZk2Test, CircularListTest, UUIDFieldTest, TestCrossCoreJoin, TestFoldingMultitermQuery, TestJmxMonitoredMap, TestLuceneMatchVersion, DistributedFacetPivotLargeTest, MultiThreadedOCPTest, CloudMLTQParserTest, SuggesterTest, ConvertedLegacyTest, TestRandomFaceting, TestDefaultSearchFieldResource, TestClassicSimilarityFactory, PreAnalyzedUpdateProcessorTest, TestBadConfig, TestAuthenticationFramework, HdfsBasicDistributedZk2Test, ClusterStateTest, TestFieldResource, TestUninvertingReader, TestSlowCompositeReaderWrapper, HdfsCollectionsAPIDistributedZkTest, BigEndianAscendingWordSerializerTest, TestManagedSynonymFilterFactory, TestFilteredDocIdSet, ShowFileRequestHandlerTest, SpellingQueryConverterTest, TestHashQParserPlugin, TestFieldCacheSortRandom, TestCustomSort, LukeRequestHandlerTest, ScriptEngineTest, TestMiniSolrCloudClusterSSL, ResourceLoaderTest, TestRealTimeGet, TestFieldCache, TolerantUpdateProcessorTest, TestBlobHandler, UpdateRequestProcessorFactoryTest, LeaderElectionIntegrationTest, SimpleCollectionCreateDeleteTest, SortByFunctionTest, WordBreakSolrSpellCheckerTest, BooleanFieldTest, TestIndexSearcher, FieldMutatingUpdateProcessorTest, DefaultValueUpdateProcessorTest, TestHdfsBackupRestoreCore, SpellPossibilityIteratorTest, SearchHandlerTest, TestSolrQueryParser, TestExactSharedStatsCache, LeaderFailoverAfterPartitionTest, DirectUpdateHandlerOptimizeTest, RegexBoostProcessorTest, CoreAdminHandlerTest, TestSolrCloudWithKerberosAlt, TestSSLRandomization, TestScoreJoinQPScore, TestRandomFlRTGCloud, ConcurrentDeleteAndCreateCollectionTest, TestDynamicLoading, DistributedFacetPivotWhiteBoxTest, TestSizeLimitedDistributedMap, ConnectionReuseTest, CoreSorterTest, TestChildDocTransformer, TestRawResponseWriter, ForceLeaderTest]
[junit4] Completed [207/630 (1!)] on J1 in 130.36s, 3 tests, 1 error, 1 skipped <<< FAILURES!
[...truncated 61647 lines...]