You are viewing a plain text version of this content. The canonical link for it is here.
Posted to dev@lucene.apache.org by je...@sd-datasolutions.de on 2012/05/28 02:53:01 UTC

Build failed in Jenkins: Lucene-Solr-trunk-Windows-Java7-64 #152

See <http://jenkins.sd-datasolutions.de/job/Lucene-Solr-trunk-Windows-Java7-64/152/>

------------------------------------------
[...truncated 14536 lines...]
   [junit4]   2> 	at java.util.concurrent.ScheduledThreadPoolExecutor$ScheduledFutureTask.access$301(ScheduledThreadPoolExecutor.java:178)
   [junit4]   2> 	at java.util.concurrent.ScheduledThreadPoolExecutor$ScheduledFutureTask.run(ScheduledThreadPoolExecutor.java:293)
   [junit4]   2> 	at java.util.concurrent.ThreadPoolExecutor.runWorker(ThreadPoolExecutor.java:1110)
   [junit4]   2> 	at java.util.concurrent.ThreadPoolExecutor$Worker.run(ThreadPoolExecutor.java:603)
   [junit4]   2> 	at java.lang.Thread.run(Thread.java:722)
   [junit4]   2> 
   [junit4]   2> 39887 T2999 C182 REQ [collection1] webapp=/solr path=/select params={wt=javabin&q=*:*&version=2} hits=0 status=0 QTime=0 
   [junit4]   2> 39999 T2999 C182 REQ [collection1] webapp=/solr path=/select params={wt=javabin&q=*:*&version=2} hits=0 status=0 QTime=0 
   [junit4]   2> 40112 T2999 C182 REQ [collection1] webapp=/solr path=/select params={wt=javabin&q=*:*&version=2} hits=0 status=0 QTime=0 
   [junit4]   2> 40224 T2941 oas.SolrTestCaseJ4.tearDown ###Ending test
   [junit4]   2> NOTE: reproduce with: ant test -Dtestcase=TestReplicationHandler -Dtests.method=test -Dtests.seed=148E5C7A409B1375 -Dtests.locale=hu_HU -Dtests.timezone=America/Miquelon -Dargs="-Dfile.encoding=Cp1252"
   [junit4]   2>
   [junit4]    > (@AfterClass output)
   [junit4]   2> 40240 T2941 oasc.CoreContainer.shutdown Shutting down CoreContainer instance=1403130087
   [junit4]   2> 40240 T2941 oasc.SolrCore.close [collection1]  CLOSING SolrCore org.apache.solr.core.SolrCore@6297ee95
   [junit4]   2> 40241 T2941 oasc.SolrCore.closeSearcher [collection1] Closing main searcher on request.
   [junit4]   2> 40241 T2941 oasu.DirectUpdateHandler2.close closing DirectUpdateHandler2{commits=4,autocommits=0,soft autocommits=0,optimizes=0,rollbacks=0,expungeDeletes=0,docsPending=0,adds=0,deletesById=0,deletesByQuery=0,errors=0,cumulative_adds=997,cumulative_deletesById=0,cumulative_deletesByQuery=2,cumulative_errors=0}
   [junit4]   2> 40244 T2941 oejsh.ContextHandler.doStop stopped o.e.j.s.ServletContextHandler{/solr,null}
   [junit4]   2> 40296 T2941 oasc.CoreContainer.shutdown Shutting down CoreContainer instance=1438930969
   [junit4]   2> 40296 T2941 oasc.SolrCore.close [collection1]  CLOSING SolrCore org.apache.solr.core.SolrCore@5bd2bc33
   [junit4]   2> 40297 T2941 oasc.SolrCore.closeSearcher [collection1] Closing main searcher on request.
   [junit4]   2> 40297 T2941 oasu.DirectUpdateHandler2.close closing DirectUpdateHandler2{commits=8,autocommits=0,soft autocommits=0,optimizes=0,rollbacks=0,expungeDeletes=0,docsPending=0,adds=0,deletesById=0,deletesByQuery=0,errors=0,cumulative_adds=5,cumulative_deletesById=0,cumulative_deletesByQuery=0,cumulative_errors=0}
   [junit4]   2> 40299 T2941 oejsh.ContextHandler.doStop stopped o.e.j.s.ServletContextHandler{/solr,null}
   [junit4]   2> 40376 T2941 oas.SolrTestCaseJ4.deleteCore ###deleteCore
   [junit4]   2> NOTE: test params are: codec=Lucene40, sim=DefaultSimilarity, locale=hu_HU, timezone=America/Miquelon
   [junit4]   2> NOTE: Windows 7 6.1 amd64/Oracle Corporation 1.7.0_04 (64-bit)/cpus=2,threads=1,free=172938992,total=279445504
   [junit4]   2> NOTE: All tests run in this JVM: [SolrInfoMBeanTest, TestDocSet, TestSurroundQueryParser, TestQueryUtils, BadComponentTest, TestItalianLightStemFilterFactory, UUIDFieldTest, QueryElevationComponentTest, TestFoldingMultitermQuery, TestLFUCache, PrimitiveFieldTypeTest, TestCollationKeyFilterFactory, TestEnglishMinimalStemFilterFactory, TestCollationKeyRangeQueries, TestBadConfig, NotRequiredUniqueKeyTest, TestBeiderMorseFilterFactory, SOLR749Test, RequiredFieldsTest, SpellCheckCollatorTest, JsonLoaderTest, SolrCmdDistributorTest, TestPropInject, DistributedQueryElevationComponentTest, CSVRequestHandlerTest, TestGalicianMinimalStemFilterFactory, LeaderElectionTest, TestPluginEnable, SearchHandlerTest, TestKStemFilterFactory, MoreLikeThisHandlerTest, TestKeywordMarkerFilterFactory, NodeStateWatcherTest, SolrCoreTest, NumericFieldsTest, UpdateRequestProcessorFactoryTest, TestSynonymFilterFactory, TestDefaultSimilarityFactory, SpellingQueryConverterTest, TestMultiWordSynonyms, DateFieldTest, TestPhraseSuggestions, TestDistributedGrouping, TestCSVLoader, TestGermanMinimalStemFilterFactory, DocumentBuilderTest, TestGreekLowerCaseFilterFactory, SolrRequestParserTest, HighlighterTest, TestMappingCharFilterFactory, SampleTest, RequestHandlersTest, TestGalicianStemFilterFactory, ZkNodePropsTest, SpellPossibilityIteratorTest, TestRangeQuery, SolrPluginUtilsTest, TestQuerySenderNoQuery, FullSolrCloudTest, ConvertedLegacyTest, CommonGramsQueryFilterFactoryTest, DistributedSpellCheckComponentTest, TestQueryTypes, TestJapaneseTokenizerFactory, CurrencyFieldTest, TestFrenchLightStemFilterFactory, SolrCoreCheckLockOnStartupTest, TestElisionFilterFactory, SoftAutoCommitTest, SnowballPorterFilterFactoryTest, TestLRUCache, TestSolrDeletionPolicy1, HighlighterConfigTest, TestGermanStemFilterFactory, TestIBSimilarityFactory, TestPropInjectDefaults, TestSolrXMLSerializer, TestOmitPositions, TestPortugueseLightStemFilterFactory, TestBinaryResponseWriter, IndexReaderFactoryTest, DirectUpdateHandlerTest, TestTurkishLowerCaseFilterFactory, TestJapanesePartOfSpeechStopFilterFactory, SuggesterTSTTest, TestRussianLightStemFilterFactory, ZkSolrClientTest, BinaryUpdateRequestHandlerTest, TestChineseFilterFactory, TestGermanLightStemFilterFactory, SolrIndexConfigTest, TestHashPartitioner, ShowFileRequestHandlerTest, CloudStateTest, TestBinaryField, DirectUpdateHandlerOptimizeTest, TestShingleFilterFactory, TestNumberUtils, TestStemmerOverrideFilterFactory, SignatureUpdateProcessorFactoryTest, ZkControllerTest, LeaderElectionIntegrationTest, DOMUtilTest, TestPatternTokenizerFactory, TestCSVResponseWriter, TestRussianFilters, TestSearchPerf, TestStandardFactories, TestPhoneticFilterFactory, TestJmxMonitoredMap, TestPseudoReturnFields, FastVectorHighlighterTest, TestSort, TestFastLRUCache, NoCacheHeaderTest, QueryParsingTest, URLClassifyProcessorTest, TestUAX29URLEmailTokenizerFactory, UniqFieldsUpdateProcessorFactoryTest, CommonGramsFilterFactoryTest, TestReverseStringFilterFactory, TestChineseTokenizerFactory, CopyFieldTest, IndexSchemaTest, SystemInfoHandlerTest, TestLuceneMatchVersion, TestHunspellStemFilterFactory, BasicDistributedZkTest, ResourceLoaderTest, ReturnFieldsTest, XmlUpdateRequestHandlerTest, DateMathParserTest, TestThaiWordFilterFactory, PrimUtilsTest, FieldAnalysisRequestHandlerTest, TestCapitalizationFilterFactory, TestWriterPerf, TestPHPSerializedResponseWriter, TestMergePolicyConfig, TestRandomFaceting, DistanceFunctionTest, SortByFunctionTest, XsltUpdateRequestHandlerTest, TestSolrCoreProperties, FileBasedSpellCheckerTest, TestDelimitedPayloadTokenFilterFactory, BasicFunctionalityTest, LengthFilterTest, TestExtendedDismaxParser, TestCzechStemFilterFactory, BasicZkTest, TestWordDelimiterFilterFactory, TestLMDirichletSimilarityFactory, DirectSolrConnectionTest, TestCollationField, SuggesterWFSTTest, DirectSolrSpellCheckerTest, UpdateParamsTest, TestReversedWildcardFilterFactory, FileUtilsTest, MultiTermTest, DistributedTermsComponentTest, TestRealTimeGet, TestLMJelinekMercerSimilarityFactory, TestArbitraryIndexDir, TestXIncludeConfig, TestBM25SimilarityFactory, TestSwedishLightStemFilterFactory, TestConfig, PingRequestHandlerTest, TestGroupingSearch, TestDFRSimilarityFactory, PeerSyncTest, SpellCheckComponentTest, LoggingHandlerTest, TestHTMLStripCharFilterFactory, TestSynonymMap, TestNGramFilters, StandardRequestHandlerTest, TestCJKBigramFilterFactory, TestPersianNormalizationFilterFactory, TestDictionaryCompoundWordTokenFilterFactory, MBeansHandlerTest, IndexSchemaRuntimeFieldTest, TestBrazilianStemFilterFactory, TestSolrDeletionPolicy2, AutoCommitTest, TestUpdate, TestKeepFilterFactory, TestRecovery, TestMultiCoreConfBootstrap, TestPatternReplaceFilterFactory, CloudStateUpdateTest, TestHungarianLightStemFilterFactory, TestFiltering, DisMaxRequestHandlerTest, TestHindiFilters, TestGermanNormalizationFilterFactory, TermsComponentTest, TestTrimFilterFactory, PluginInfoTest, TestFinnishLightStemFilterFactory, TestSystemIdResolver, TestPerFieldSimilarity, SpatialFilterTest, LukeRequestHandlerTest, FullSolrCloudDistribCmdsTest, OverseerTest, RecoveryZkTest, TestReplicationHandler]
   [junit4]   2> 
   [junit4] Completed in 40.39s, 1 test, 1 failure <<< FAILURES!
   [junit4]  
   [junit4] Suite: org.apache.solr.TestDistributedSearch
   [junit4] Completed in 26.26s, 1 test
   [junit4]  
   [junit4] Suite: org.apache.solr.TestJoin
   [junit4] Completed in 8.40s, 2 tests
   [junit4]  
   [junit4] Suite: org.apache.solr.request.TestFaceting
   [junit4] Completed in 12.94s, 3 tests
   [junit4]  
   [junit4] Suite: org.apache.solr.request.SimpleFacetsTest
   [junit4] Completed in 5.61s, 29 tests
   [junit4]  
   [junit4] Suite: org.apache.solr.search.function.TestFunctionQuery
   [junit4] Completed in 2.64s, 14 tests
   [junit4]  
   [junit4] Suite: org.apache.solr.spelling.suggest.SuggesterFSTTest
   [junit4] Completed in 1.24s, 4 tests
   [junit4]  
   [junit4] Suite: org.apache.solr.TestTrie
   [junit4] Completed in 1.40s, 8 tests
   [junit4]  
   [junit4] Suite: org.apache.solr.schema.BadIndexSchemaTest
   [junit4] Completed in 1.12s, 6 tests
   [junit4]  
   [junit4] Suite: org.apache.solr.handler.component.StatsComponentTest
   [junit4] Completed in 5.11s, 6 tests
   [junit4]  
   [junit4] Suite: org.apache.solr.core.TestJmxIntegration
   [junit4] IGNORED 0.00s | TestJmxIntegration.testJmxOnCoreReload
   [junit4]    > Cause: Annotated @Ignore(timing problem? https://issues.apache.org/jira/browse/SOLR-2715)
   [junit4] Completed in 1.74s, 3 tests, 1 skipped
   [junit4]  
   [junit4] Suite: org.apache.solr.spelling.suggest.SuggesterTest
   [junit4] Completed in 1.26s, 4 tests
   [junit4]  
   [junit4] Suite: org.apache.solr.spelling.IndexBasedSpellCheckerTest
   [junit4] Completed in 1.12s, 5 tests
   [junit4]  
   [junit4] Suite: org.apache.solr.core.TestCoreContainer
   [junit4] Completed in 2.63s, 1 test
   [junit4]  
   [junit4] Suite: org.apache.solr.update.TestIndexingPerformance
   [junit4] Completed in 0.76s, 1 test
   [junit4]  
   [junit4] Suite: org.apache.solr.handler.admin.CoreAdminHandlerTest
   [junit4] Completed in 1.75s, 1 test
   [junit4]  
   [junit4] Suite: org.apache.solr.request.TestRemoteStreaming
   [junit4] Completed in 1.48s, 4 tests
   [junit4]  
   [junit4] Suite: org.apache.solr.schema.PolyFieldTest
   [junit4] Completed in 1.24s, 4 tests
   [junit4]  
   [junit4] Suite: org.apache.solr.handler.DocumentAnalysisRequestHandlerTest
   [junit4] Completed in 0.89s, 4 tests
   [junit4]  
   [junit4] Suite: org.apache.solr.servlet.CacheHeaderTest
   [junit4] Completed in 1.03s, 5 tests
   [junit4]  
   [junit4] Suite: org.apache.solr.update.processor.FieldMutatingUpdateProcessorTest
   [junit4] Completed in 0.83s, 20 tests
   [junit4]  
   [junit4] Suite: org.apache.solr.handler.component.DebugComponentTest
   [junit4] Completed in 0.98s, 2 tests
   [junit4]  
   [junit4] Suite: org.apache.solr.search.TestIndexSearcher
   [junit4] Completed in 1.80s, 2 tests
   [junit4]  
   [junit4] Suite: org.apache.solr.search.TestValueSourceCache
   [junit4] Completed in 0.90s, 2 tests
   [junit4]  
   [junit4] Suite: org.apache.solr.request.JSONWriterTest
   [junit4] Completed in 0.87s, 3 tests
   [junit4]  
   [junit4] Suite: org.apache.solr.search.TestSolrQueryParser
   [junit4] Completed in 0.80s, 1 test
   [junit4]  
   [junit4] Suite: org.apache.solr.handler.component.TermVectorComponentTest
   [junit4] Completed in 0.94s, 4 tests
   [junit4]  
   [junit4] Suite: org.apache.solr.core.AlternateDirectoryTest
   [junit4] Completed in 0.76s, 1 test
   [junit4]  
   [junit4] Suite: org.apache.solr.core.TestQuerySenderListener
   [junit4] Completed in 0.78s, 3 tests
   [junit4]  
   [junit4] Suite: org.apache.solr.analysis.TestJapaneseBaseFormFilterFactory
   [junit4] Completed in 0.01s, 1 test
   [junit4]  
   [junit4] Suite: org.apache.solr.OutputWriterTest
   [junit4] Completed in 0.28s, 5 tests
   [junit4]  
   [junit4] Suite: org.apache.solr.MinimalSchemaTest
   [junit4] Completed in 0.34s, 3 tests
   [junit4]  
   [junit4] Suite: org.apache.solr.analysis.LegacyHTMLStripCharFilterTest
   [junit4] IGNORED 0.00s | LegacyHTMLStripCharFilterTest.testRandom
   [junit4]    > Cause: Annotated @Ignore(broken offsets: see LUCENE-2208)
   [junit4] Completed in 0.22s, 13 tests, 1 skipped
   [junit4]  
   [junit4] Suite: org.apache.solr.EchoParamsTest
   [junit4] Completed in 0.17s, 1 test
   [junit4]  
   [junit4] Suite: org.apache.solr.analysis.TestHyphenationCompoundWordTokenFilterFactory
   [junit4] Completed in 0.20s, 2 tests
   [junit4]  
   [junit4] Suite: org.apache.solr.core.TestCodecSupport
   [junit4] Completed in 0.15s, 3 tests
   [junit4]  
   [junit4] Suite: org.apache.solr.schema.OpenExchangeRatesOrgProviderTest
   [junit4] Completed in 0.03s, 5 tests
   [junit4]  
   [junit4] Suite: org.apache.solr.analysis.TestPortugueseMinimalStemFilterFactory
   [junit4] Completed in 0.01s, 1 test
   [junit4]  
   [junit4] Suite: org.apache.solr.analysis.TestSlowSynonymFilter
   [junit4] Completed in 0.03s, 7 tests
   [junit4]  
   [junit4] Suite: org.apache.solr.analysis.TestPatternReplaceCharFilterFactory
   [junit4] Completed in 0.02s, 3 tests
   [junit4]  
   [junit4] Suite: org.apache.solr.analysis.TestPortugueseStemFilterFactory
   [junit4] Completed in 0.01s, 1 test
   [junit4]  
   [junit4] Suite: org.apache.solr.internal.csv.CSVUtilsTest
   [junit4] Completed in 0.02s, 14 tests
   [junit4]  
   [junit4] Suite: org.apache.solr.analysis.DoubleMetaphoneFilterFactoryTest
   [junit4] Completed in 0.01s, 3 tests
   [junit4]  
   [junit4] Suite: org.apache.solr.analysis.TestArabicFilters
   [junit4] Completed in 0.02s, 4 tests
   [junit4]  
   [junit4] Suite: org.apache.solr.analysis.TestLatvianStemFilterFactory
   [junit4] Completed in 0.01s, 1 test
   [junit4]  
   [junit4] Suite: org.apache.solr.analysis.TestCJKTokenizerFactory
   [junit4] Completed in 0.01s, 1 test
   [junit4]  
   [junit4] Suite: org.apache.solr.analysis.TestNorwegianLightStemFilterFactory
   [junit4] Completed in 0.01s, 1 test
   [junit4]  
   [junit4] Suite: org.apache.solr.analysis.TestTypeTokenFilterFactory
   [junit4] Completed in 0.02s, 4 tests
   [junit4]  
   [junit4] Suite: org.apache.solr.util.TestUtils
   [junit4] Completed in 0.01s, 3 tests
   [junit4]  
   [junit4] Suite: org.apache.solr.analysis.TestNorwegianMinimalStemFilterFactory
   [junit4] Completed in 0.01s, 1 test
   [junit4]  
   [junit4] Suite: org.apache.solr.analysis.TestStopFilterFactory
   [junit4] Completed in 0.01s, 1 test
   [junit4]  
   [junit4] Suite: org.apache.solr.analysis.TestWikipediaTokenizerFactory
   [junit4] Completed in 0.01s, 1 test
   [junit4]  
   [junit4] Suite: org.apache.solr.spelling.TestSuggestSpellingConverter
   [junit4] Completed in 0.01s, 2 tests
   [junit4]  
   [junit4] Suite: org.apache.solr.analysis.TestGreekStemFilterFactory
   [junit4] Completed in 0.01s, 1 test
   [junit4]  
   [junit4] Suite: org.apache.solr.analysis.TestIndonesianStemFilterFactory
   [junit4] Completed in 0.01s, 2 tests
   [junit4]  
   [junit4] Suite: org.apache.solr.analysis.TestPorterStemFilterFactory
   [junit4] Completed in 0.01s, 1 test
   [junit4]  
   [junit4] Suite: org.apache.solr.analysis.TestFrenchMinimalStemFilterFactory
   [junit4] Completed in 0.01s, 1 test
   [junit4]  
   [junit4] Suite: org.apache.solr.analysis.TestIrishLowerCaseFilterFactory
   [junit4] Completed in 0.01s, 1 test
   [junit4]  
   [junit4] Suite: org.apache.solr.analysis.TestSpanishLightStemFilterFactory
   [junit4] Completed in 0.01s, 1 test
   [junit4]  
   [junit4] Suite: org.apache.solr.internal.csv.writer.CSVConfigGuesserTest
   [junit4] Completed in 0.01s, 3 tests
   [junit4]  
   [junit4] Suite: org.apache.solr.analysis.TestBulgarianStemFilterFactory
   [junit4] Completed in 0.01s, 1 test
   [junit4]  
   [junit4] Suite: org.apache.solr.analysis.TestCJKWidthFilterFactory
   [junit4] Completed in 0.01s, 1 test
   [junit4]  
   [junit4] Suite: org.apache.solr.core.RAMDirectoryFactoryTest
   [junit4] Completed in 0.01s, 1 test
   [junit4]  
   [junit4] Suite: org.apache.solr.internal.csv.writer.CSVFieldTest
   [junit4] Completed in 0.00s, 2 tests
   [junit4]  
   [junit4] Suite: org.apache.solr.analysis.TestRemoveDuplicatesTokenFilterFactory
   [junit4] Completed in 0.01s, 1 test
   [junit4]  
   [junit4] Suite: org.apache.solr.cloud.ChaosMonkeySafeLeaderTest
   [junit4] Completed in 0.00s, 0 tests
   [junit4]  
   [junit4] Suite: org.apache.solr.util.CircularListTest
   [junit4] Completed in 0.00s, 1 test
   [junit4]  
   [junit4] Suite: org.apache.solr.util.TimeZoneUtilsTest
   [junit4] Completed in 0.14s, 5 tests
   [junit4]  
   [junit4] JVM J0:     1.10 ..   835.81 =   834.71s
   [junit4] Execution time total: 13 minutes 55 seconds
   [junit4] Tests summary: 286 suites, 972 tests, 1 failure, 10 ignored (5 assumptions)

BUILD FAILED
<http://jenkins.sd-datasolutions.de/job/Lucene-Solr-trunk-Windows-Java7-64/ws/build.xml>:29: The following error occurred while executing this line:
<http://jenkins.sd-datasolutions.de/job/Lucene-Solr-trunk-Windows-Java7-64/ws/solr\build.xml>:144: The following error occurred while executing this line:
<http://jenkins.sd-datasolutions.de/job/Lucene-Solr-trunk-Windows-Java7-64/ws/lucene\module-build.xml>:62: The following error occurred while executing this line:
<http://jenkins.sd-datasolutions.de/job/Lucene-Solr-trunk-Windows-Java7-64/ws/lucene\common-build.xml>:1019: The following error occurred while executing this line:
<http://jenkins.sd-datasolutions.de/job/Lucene-Solr-trunk-Windows-Java7-64/ws/lucene\common-build.xml>:745: There were test failures: 286 suites, 972 tests, 1 failure, 10 ignored (5 assumptions)

Total time: 28 minutes 49 seconds
Build step 'Invoke Ant' marked build as failure
Recording test results

---------------------------------------------------------------------
To unsubscribe, e-mail: dev-unsubscribe@lucene.apache.org
For additional commands, e-mail: dev-help@lucene.apache.org


Jenkins build is back to normal : Lucene-Solr-trunk-Windows-Java7-64 #154

Posted by je...@sd-datasolutions.de.
See <http://jenkins.sd-datasolutions.de/job/Lucene-Solr-trunk-Windows-Java7-64/154/>


---------------------------------------------------------------------
To unsubscribe, e-mail: dev-unsubscribe@lucene.apache.org
For additional commands, e-mail: dev-help@lucene.apache.org


Build failed in Jenkins: Lucene-Solr-trunk-Windows-Java7-64 #153

Posted by je...@sd-datasolutions.de.
See <http://jenkins.sd-datasolutions.de/job/Lucene-Solr-trunk-Windows-Java7-64/153/>

------------------------------------------
[...truncated 14407 lines...]
   [junit4]   2> 38548 T2780 oas.SolrTestCaseJ4.tearDown ###Ending test
   [junit4]   2> NOTE: reproduce with: ant test -Dtestcase=TestReplicationHandler -Dtests.method=test -Dtests.seed=A0205DC7D142A099 -Dtests.locale=nl -Dtests.timezone=Pacific/Guadalcanal -Dargs="-Dfile.encoding=Cp1252"
   [junit4]   2>
   [junit4]    > (@AfterClass output)
   [junit4]   2> 38559 T2780 oasc.CoreContainer.shutdown Shutting down CoreContainer instance=416505195
   [junit4]   2> 38559 T2780 oasc.SolrCore.close [collection1]  CLOSING SolrCore org.apache.solr.core.SolrCore@74079b36
   [junit4]   2> 38560 T2780 oasc.SolrCore.closeSearcher [collection1] Closing main searcher on request.
   [junit4]   2> 38560 T2780 oasu.DirectUpdateHandler2.close closing DirectUpdateHandler2{commits=4,autocommits=0,soft autocommits=0,optimizes=0,rollbacks=0,expungeDeletes=0,docsPending=0,adds=0,deletesById=0,deletesByQuery=0,errors=0,cumulative_adds=997,cumulative_deletesById=0,cumulative_deletesByQuery=2,cumulative_errors=0}
   [junit4]   2> 38564 T2780 oejsh.ContextHandler.doStop stopped o.e.j.s.ServletContextHandler{/solr,null}
   [junit4]   2> 38616 T2780 oasc.CoreContainer.shutdown Shutting down CoreContainer instance=2100141439
   [junit4]   2> 38616 T2780 oasc.SolrCore.close [collection1]  CLOSING SolrCore org.apache.solr.core.SolrCore@6f1b3955
   [junit4]   2> 38618 T2780 oasc.SolrCore.closeSearcher [collection1] Closing main searcher on request.
   [junit4]   2> 38618 T2780 oasu.DirectUpdateHandler2.close closing DirectUpdateHandler2{commits=8,autocommits=0,soft autocommits=0,optimizes=0,rollbacks=0,expungeDeletes=0,docsPending=0,adds=0,deletesById=0,deletesByQuery=0,errors=0,cumulative_adds=5,cumulative_deletesById=0,cumulative_deletesByQuery=0,cumulative_errors=0}
   [junit4]   2> 38618 T2780 oejsh.ContextHandler.doStop stopped o.e.j.s.ServletContextHandler{/solr,null}
   [junit4]   2> 38683 T2780 oas.SolrTestCaseJ4.deleteCore ###deleteCore
   [junit4]   2> NOTE: test params are: codec=Lucene40, sim=RandomSimilarityProvider(queryNorm=true,coord=false): {}, locale=nl, timezone=Pacific/Guadalcanal
   [junit4]   2> NOTE: Windows 7 6.1 amd64/Oracle Corporation 1.7.0_04 (64-bit)/cpus=2,threads=1,free=172175576,total=289996800
   [junit4]   2> NOTE: All tests run in this JVM: [TestSolrDeletionPolicy2, TestNGramFilters, TestPhraseSuggestions, TestXIncludeConfig, SearchHandlerTest, TestCollationKeyRangeQueries, TestLatvianStemFilterFactory, TestGreekLowerCaseFilterFactory, TestGreekStemFilterFactory, AutoCommitTest, TestSurroundQueryParser, SpellPossibilityIteratorTest, TestMergePolicyConfig, DocumentAnalysisRequestHandlerTest, QueryParsingTest, CommonGramsFilterFactoryTest, TestChineseFilterFactory, LoggingHandlerTest, TestFrenchMinimalStemFilterFactory, TestPropInject, ConvertedLegacyTest, NumericFieldsTest, TestReversedWildcardFilterFactory, TestWordDelimiterFilterFactory, TestJapanesePartOfSpeechStopFilterFactory, PrimitiveFieldTypeTest, TestValueSourceCache, StatsComponentTest, OpenExchangeRatesOrgProviderTest, IndexSchemaRuntimeFieldTest, NoCacheHeaderTest, SortByFunctionTest, TestIrishLowerCaseFilterFactory, IndexBasedSpellCheckerTest, QueryElevationComponentTest, SpellingQueryConverterTest, TestStopFilterFactory, TestConfig, TestRussianFilters, TestFunctionQuery, TestTypeTokenFilterFactory, TestSolrXMLSerializer, UpdateRequestProcessorFactoryTest, DirectUpdateHandlerTest, TestGalicianStemFilterFactory, FieldMutatingUpdateProcessorTest, RecoveryZkTest, DebugComponentTest, TestQueryUtils, DOMUtilTest, TestUAX29URLEmailTokenizerFactory, TestDelimitedPayloadTokenFilterFactory, TestBeiderMorseFilterFactory, TestJoin, CommonGramsQueryFilterFactoryTest, TestExtendedDismaxParser, TestShingleFilterFactory, PluginInfoTest, DistributedSpellCheckComponentTest, SimpleFacetsTest, TestJapaneseTokenizerFactory, ResourceLoaderTest, TestTurkishLowerCaseFilterFactory, MoreLikeThisHandlerTest, TestPortugueseMinimalStemFilterFactory, TestSearchPerf, LeaderElectionIntegrationTest, ZkControllerTest, UUIDFieldTest, DisMaxRequestHandlerTest, CloudStateUpdateTest, TestPatternReplaceFilterFactory, TestDocSet, TestSpanishLightStemFilterFactory, TestStandardFactories, TestPseudoReturnFields, TestPatternReplaceCharFilterFactory, DirectSolrSpellCheckerTest, TestCollationField, TestChineseTokenizerFactory, BadIndexSchemaTest, TestLRUCache, DoubleMetaphoneFilterFactoryTest, PrimUtilsTest, ZkSolrClientTest, TestHTMLStripCharFilterFactory, RequestHandlersTest, TestNumberUtils, TestCapitalizationFilterFactory, TestGermanStemFilterFactory, TestSystemIdResolver, TestMultiCoreConfBootstrap, LeaderElectionTest, FieldAnalysisRequestHandlerTest, TestQuerySenderListener, SuggesterTest, TestThaiWordFilterFactory, TestPHPSerializedResponseWriter, TestHyphenationCompoundWordTokenFilterFactory, TestHashPartitioner, DirectUpdateHandlerOptimizeTest, FastVectorHighlighterTest, TestBadConfig, PingRequestHandlerTest, TestSlowSynonymFilter, EchoParamsTest, TestGermanMinimalStemFilterFactory, ReturnFieldsTest, TestSuggestSpellingConverter, TestCollationKeyFilterFactory, TestOmitPositions, BasicDistributedZkTest, JSONWriterTest, SolrIndexConfigTest, SolrPluginUtilsTest, TestSynonymFilterFactory, TestCJKBigramFilterFactory, TestEnglishMinimalStemFilterFactory, TestIndonesianStemFilterFactory, DistanceFunctionTest, TestBinaryField, DocumentBuilderTest, TestFiltering, TestBM25SimilarityFactory, StandardRequestHandlerTest, TestCzechStemFilterFactory, TestMappingCharFilterFactory, TestBulgarianStemFilterFactory, PeerSyncTest, TestPortugueseStemFilterFactory, SystemInfoHandlerTest, URLClassifyProcessorTest, TestCJKTokenizerFactory, TestArbitraryIndexDir, TestLuceneMatchVersion, SolrCoreCheckLockOnStartupTest, TestHungarianLightStemFilterFactory, BasicZkTest, TestIBSimilarityFactory, TestRemoveDuplicatesTokenFilterFactory, FullSolrCloudDistribCmdsTest, TimeZoneUtilsTest, TestNorwegianLightStemFilterFactory, JsonLoaderTest, TestPhoneticFilterFactory, TestMultiWordSynonyms, SolrCmdDistributorTest, LukeRequestHandlerTest, DistributedTermsComponentTest, SpellCheckCollatorTest, TestJmxIntegration, BadComponentTest, MBeansHandlerTest, SpellCheckComponentTest, ShowFileRequestHandlerTest, TestReverseStringFilterFactory, CurrencyFieldTest, TestSolrDeletionPolicy1, TestCoreContainer, TestSynonymMap, TestIndexSearcher, TermsComponentTest, SnowballPorterFilterFactoryTest, TestRandomFaceting, TestGalicianMinimalStemFilterFactory, TestPluginEnable, TestTrimFilterFactory, SolrCoreTest, TestSort, TestLMDirichletSimilarityFactory, OverseerTest, LegacyHTMLStripCharFilterTest, TestRecovery, TestWriterPerf, UpdateParamsTest, HighlighterTest, XmlUpdateRequestHandlerTest, SoftAutoCommitTest, TestGermanLightStemFilterFactory, TestBrazilianStemFilterFactory, TestHunspellStemFilterFactory, TestDFRSimilarityFactory, RequiredFieldsTest, TestPersianNormalizationFilterFactory, TestTrie, TestUtils, TestArabicFilters, DateMathParserTest, TestDefaultSimilarityFactory, SolrInfoMBeanTest, TestUpdate, SolrRequestParserTest, DistributedQueryElevationComponentTest, NodeStateWatcherTest, TermVectorComponentTest, TestRealTimeGet, TestSolrQueryParser, TestCSVResponseWriter, TestFaceting, TestSwedishLightStemFilterFactory, OutputWriterTest, TestKeywordMarkerFilterFactory, MinimalSchemaTest, TestRemoteStreaming, TestFoldingMultitermQuery, TestReplicationHandler]
   [junit4]   2> 
   [junit4] Completed in 38.69s, 1 test, 1 failure <<< FAILURES!
   [junit4]  
   [junit4] Suite: org.apache.solr.TestDistributedSearch
   [junit4] Completed in 27.64s, 1 test
   [junit4]  
   [junit4] Suite: org.apache.solr.TestDistributedGrouping
   [junit4] Completed in 22.37s, 1 test
   [junit4]  
   [junit4] Suite: org.apache.solr.TestGroupingSearch
   [junit4] Completed in 4.43s, 12 tests
   [junit4]  
   [junit4] Suite: org.apache.solr.search.TestRangeQuery
   [junit4] Completed in 7.75s, 2 tests
   [junit4]  
   [junit4] Suite: org.apache.solr.spelling.suggest.SuggesterFSTTest
   [junit4] Completed in 1.27s, 4 tests
   [junit4]  
   [junit4] Suite: org.apache.solr.BasicFunctionalityTest
   [junit4] IGNORED 0.00s | BasicFunctionalityTest.testDeepPaging
   [junit4]    > Cause: Annotated @Ignore(See SOLR-1726)
   [junit4] Completed in 3.03s, 23 tests, 1 skipped
   [junit4]  
   [junit4] Suite: org.apache.solr.update.processor.SignatureUpdateProcessorFactoryTest
   [junit4] Completed in 1.22s, 6 tests
   [junit4]  
   [junit4] Suite: org.apache.solr.update.TestIndexingPerformance
   [junit4] Completed in 0.89s, 1 test
   [junit4]  
   [junit4] Suite: org.apache.solr.handler.CSVRequestHandlerTest
   [junit4] Completed in 0.93s, 1 test
   [junit4]  
   [junit4] Suite: org.apache.solr.update.processor.UniqFieldsUpdateProcessorFactoryTest
   [junit4] Completed in 0.92s, 1 test
   [junit4]  
   [junit4] Suite: org.apache.solr.handler.admin.CoreAdminHandlerTest
   [junit4] Completed in 2.00s, 1 test
   [junit4]  
   [junit4] Suite: org.apache.solr.handler.XsltUpdateRequestHandlerTest
   [junit4] Completed in 1.01s, 1 test
   [junit4]  
   [junit4] Suite: org.apache.solr.spelling.suggest.SuggesterTSTTest
   [junit4] Completed in 1.88s, 4 tests
   [junit4]  
   [junit4] Suite: org.apache.solr.search.SpatialFilterTest
   [junit4] Completed in 1.72s, 3 tests
   [junit4]  
   [junit4] Suite: org.apache.solr.schema.PolyFieldTest
   [junit4] Completed in 1.30s, 4 tests
   [junit4]  
   [junit4] Suite: org.apache.solr.request.TestBinaryResponseWriter
   [junit4] Completed in 1.54s, 2 tests
   [junit4]  
   [junit4] Suite: org.apache.solr.spelling.suggest.SuggesterWFSTTest
   [junit4] Completed in 1.26s, 4 tests
   [junit4]  
   [junit4] Suite: org.apache.solr.servlet.CacheHeaderTest
   [junit4] Completed in 1.02s, 5 tests
   [junit4]  
   [junit4] Suite: org.apache.solr.schema.CopyFieldTest
   [junit4] Completed in 0.63s, 6 tests
   [junit4]  
   [junit4] Suite: org.apache.solr.internal.csv.CSVPrinterTest
   [junit4] Completed in 0.49s, 6 tests
   [junit4]  
   [junit4] Suite: org.apache.solr.search.TestQueryTypes
   [junit4] Completed in 0.80s, 1 test
   [junit4]  
   [junit4] Suite: org.apache.solr.handler.TestCSVLoader
   [junit4] Completed in 1.13s, 5 tests
   [junit4]  
   [junit4] Suite: org.apache.solr.spelling.FileBasedSpellCheckerTest
   [junit4] Completed in 0.98s, 3 tests
   [junit4]  
   [junit4] Suite: org.apache.solr.core.IndexReaderFactoryTest
   [junit4] Completed in 0.75s, 1 test
   [junit4]  
   [junit4] Suite: org.apache.solr.highlight.HighlighterConfigTest
   [junit4] Completed in 0.71s, 1 test
   [junit4]  
   [junit4] Suite: org.apache.solr.schema.IndexSchemaTest
   [junit4] Completed in 0.78s, 3 tests
   [junit4]  
   [junit4] Suite: org.apache.solr.handler.BinaryUpdateRequestHandlerTest
   [junit4] Completed in 0.74s, 1 test
   [junit4]  
   [junit4] Suite: org.apache.solr.core.TestPropInjectDefaults
   [junit4] Completed in 0.67s, 2 tests
   [junit4]  
   [junit4] Suite: org.apache.solr.core.AlternateDirectoryTest
   [junit4] Completed in 0.70s, 1 test
   [junit4]  
   [junit4] Suite: org.apache.solr.schema.MultiTermTest
   [junit4] Completed in 0.38s, 3 tests
   [junit4]  
   [junit4] Suite: org.apache.solr.search.TestLFUCache
   [junit4] Completed in 0.71s, 5 tests
   [junit4]  
   [junit4] Suite: org.apache.solr.core.TestQuerySenderNoQuery
   [junit4] Completed in 0.66s, 3 tests
   [junit4]  
   [junit4] Suite: org.apache.solr.core.SOLR749Test
   [junit4] Completed in 0.67s, 1 test
   [junit4]  
   [junit4] Suite: org.apache.solr.analysis.TestJapaneseBaseFormFilterFactory
   [junit4] Completed in 0.01s, 1 test
   [junit4]  
   [junit4] Suite: org.apache.solr.SampleTest
   [junit4] Completed in 0.27s, 2 tests
   [junit4]  
   [junit4] Suite: org.apache.solr.core.TestJmxMonitoredMap
   [junit4] Completed in 0.19s, 2 tests
   [junit4]  
   [junit4] Suite: org.apache.solr.TestSolrCoreProperties
   [junit4] Completed in 0.24s, 1 test
   [junit4]  
   [junit4] Suite: org.apache.solr.servlet.DirectSolrConnectionTest
   [junit4] Completed in 0.33s, 2 tests
   [junit4]  
   [junit4] Suite: org.apache.solr.schema.NotRequiredUniqueKeyTest
   [junit4] Completed in 0.23s, 1 test
   [junit4]  
   [junit4] Suite: org.apache.solr.analysis.TestKStemFilterFactory
   [junit4] Completed in 0.12s, 1 test
   [junit4]  
   [junit4] Suite: org.apache.solr.search.similarities.TestPerFieldSimilarity
   [junit4] Completed in 0.18s, 7 tests
   [junit4]  
   [junit4] Suite: org.apache.solr.core.TestCodecSupport
   [junit4] Completed in 0.15s, 3 tests
   [junit4]  
   [junit4] Suite: org.apache.solr.search.similarities.TestLMJelinekMercerSimilarityFactory
   [junit4] Completed in 0.17s, 2 tests
   [junit4]  
   [junit4] Suite: org.apache.solr.search.TestFastLRUCache
   [junit4] Completed in 0.04s, 7 tests
   [junit4]  
   [junit4] Suite: org.apache.solr.internal.csv.CSVParserTest
   [junit4] Completed in 0.04s, 23 tests
   [junit4]  
   [junit4] Suite: org.apache.solr.schema.DateFieldTest
   [junit4] IGNORED 0.00s | DateFieldTest.testRoundTripNonPositiveYear
   [junit4]    > Cause: Annotated @Ignore(SOLR-2773: Non-Positive years don't work)
   [junit4] Completed in 0.02s, 8 tests, 1 skipped
   [junit4]  
   [junit4] Suite: org.apache.solr.cloud.ZkNodePropsTest
   [junit4] Completed in 0.01s, 1 test
   [junit4]  
   [junit4] Suite: org.apache.solr.analysis.TestRussianLightStemFilterFactory
   [junit4] Completed in 0.01s, 1 test
   [junit4]  
   [junit4] Suite: org.apache.solr.analysis.TestHindiFilters
   [junit4] Completed in 0.01s, 3 tests
   [junit4]  
   [junit4] Suite: org.apache.solr.analysis.TestElisionFilterFactory
   [junit4] Completed in 0.02s, 3 tests
   [junit4]  
   [junit4] Suite: org.apache.solr.analysis.TestFrenchLightStemFilterFactory
   [junit4] Completed in 0.01s, 1 test
   [junit4]  
   [junit4] Suite: org.apache.solr.analysis.TestPortugueseLightStemFilterFactory
   [junit4] Completed in 0.01s, 1 test
   [junit4]  
   [junit4] Suite: org.apache.solr.analysis.TestDictionaryCompoundWordTokenFilterFactory
   [junit4] Completed in 0.01s, 1 test
   [junit4]  
   [junit4] Suite: org.apache.solr.analysis.TestNorwegianMinimalStemFilterFactory
   [junit4] Completed in 0.01s, 1 test
   [junit4]  
   [junit4] Suite: org.apache.solr.analysis.TestWikipediaTokenizerFactory
   [junit4] Completed in 0.02s, 1 test
   [junit4]  
   [junit4] Suite: org.apache.solr.analysis.LengthFilterTest
   [junit4] Completed in 0.01s, 1 test
   [junit4]  
   [junit4] Suite: org.apache.solr.analysis.TestFinnishLightStemFilterFactory
   [junit4] Completed in 0.01s, 1 test
   [junit4]  
   [junit4] Suite: org.apache.solr.analysis.TestKeepFilterFactory
   [junit4] Completed in 0.01s, 1 test
   [junit4]  
   [junit4] Suite: org.apache.solr.analysis.TestPorterStemFilterFactory
   [junit4] Completed in 0.01s, 1 test
   [junit4]  
   [junit4] Suite: org.apache.solr.analysis.TestPatternTokenizerFactory
   [junit4] Completed in 0.01s, 1 test
   [junit4]  
   [junit4] Suite: org.apache.solr.analysis.TestStemmerOverrideFilterFactory
   [junit4] Completed in 0.01s, 2 tests
   [junit4]  
   [junit4] Suite: org.apache.solr.analysis.TestCJKWidthFilterFactory
   [junit4] Completed in 0.01s, 1 test
   [junit4]  
   [junit4] Suite: org.apache.solr.cloud.CloudStateTest
   [junit4] Completed in 0.02s, 1 test
   [junit4]  
   [junit4] Suite: org.apache.solr.analysis.TestGermanNormalizationFilterFactory
   [junit4] Completed in 0.01s, 1 test
   [junit4]  
   [junit4] Suite: org.apache.solr.analysis.TestItalianLightStemFilterFactory
   [junit4] Completed in 0.01s, 1 test
   [junit4]  
   [junit4] Suite: org.apache.solr.core.RAMDirectoryFactoryTest
   [junit4] Completed in 0.01s, 1 test
   [junit4]  
   [junit4] Suite: org.apache.solr.internal.csv.writer.CSVFieldTest
   [junit4] Completed in 0.00s, 2 tests
   [junit4]  
   [junit4] Suite: org.apache.solr.util.FileUtilsTest
   [junit4] Completed in 0.01s, 1 test
   [junit4]  
   [junit4] Suite: org.apache.solr.cloud.FullSolrCloudTest
   [junit4] Completed in 61.76s, 1 test
   [junit4]  
   [junit4] Suite: org.apache.solr.schema.PreAnalyzedFieldTest
   [junit4] Completed in 0.02s, 3 tests
   [junit4]  
   [junit4] JVM J0:     1.16 ..   874.17 =   873.01s
   [junit4] Execution time total: 14 minutes 34 seconds
   [junit4] Tests summary: 286 suites, 972 tests, 1 failure, 10 ignored (5 assumptions)

BUILD FAILED
<http://jenkins.sd-datasolutions.de/job/Lucene-Solr-trunk-Windows-Java7-64/ws/build.xml>:29: The following error occurred while executing this line:
<http://jenkins.sd-datasolutions.de/job/Lucene-Solr-trunk-Windows-Java7-64/ws/solr\build.xml>:144: The following error occurred while executing this line:
<http://jenkins.sd-datasolutions.de/job/Lucene-Solr-trunk-Windows-Java7-64/ws/lucene\module-build.xml>:62: The following error occurred while executing this line:
<http://jenkins.sd-datasolutions.de/job/Lucene-Solr-trunk-Windows-Java7-64/ws/lucene\common-build.xml>:1019: The following error occurred while executing this line:
<http://jenkins.sd-datasolutions.de/job/Lucene-Solr-trunk-Windows-Java7-64/ws/lucene\common-build.xml>:745: There were test failures: 286 suites, 972 tests, 1 failure, 10 ignored (5 assumptions)

Total time: 29 minutes 37 seconds
Build step 'Invoke Ant' marked build as failure
Recording test results

---------------------------------------------------------------------
To unsubscribe, e-mail: dev-unsubscribe@lucene.apache.org
For additional commands, e-mail: dev-help@lucene.apache.org