You are viewing a plain text version of this content. The canonical link for it is here.
Posted to commits@sling.apache.org by Apache Jenkins Server <je...@builds.apache.org> on 2018/10/19 16:37:53 UTC

Build failed in Jenkins: sling-org-apache-sling-launchpad-testing-10 #190

See <https://builds.apache.org/job/sling-org-apache-sling-launchpad-testing-10/190/display/redirect?page=changes>

Changes:

[rombert] SLING-7907 - Update local starter references to 11 or 12-SNAPSHOT

------------------------------------------
Started by an SCM change
[EnvInject] - Loading node environment variables.
Building remotely on ubuntu-4 (ubuntu trusty) in workspace <https://builds.apache.org/job/sling-org-apache-sling-launchpad-testing-10/ws/>
[WS-CLEANUP] Deleting project workspace...
[WS-CLEANUP] Done
Cloning the remote Git repository
Cloning repository https://github.com/apache/sling-org-apache-sling-launchpad-testing.git
 > git init <https://builds.apache.org/job/sling-org-apache-sling-launchpad-testing-10/ws/> # timeout=10
Fetching upstream changes from https://github.com/apache/sling-org-apache-sling-launchpad-testing.git
 > git --version # timeout=10
 > git fetch --tags --progress https://github.com/apache/sling-org-apache-sling-launchpad-testing.git +refs/heads/*:refs/remotes/origin/*
 > git config remote.origin.url https://github.com/apache/sling-org-apache-sling-launchpad-testing.git # timeout=10
 > git config --add remote.origin.fetch +refs/heads/*:refs/remotes/origin/* # timeout=10
 > git config remote.origin.url https://github.com/apache/sling-org-apache-sling-launchpad-testing.git # timeout=10
Fetching upstream changes from https://github.com/apache/sling-org-apache-sling-launchpad-testing.git
 > git fetch --tags --progress https://github.com/apache/sling-org-apache-sling-launchpad-testing.git +refs/heads/*:refs/remotes/origin/*
 > git rev-parse origin/master^{commit} # timeout=10
Checking out Revision 138ff27264968dfab0e4ea4fa254838990e8e4b3 (origin/master)
 > git config core.sparsecheckout # timeout=10
 > git checkout -f 138ff27264968dfab0e4ea4fa254838990e8e4b3
Commit message: "SLING-7907 - Update local starter references to 11 or 12-SNAPSHOT"
 > git rev-list --no-walk f81dee3381b92930ac4b3603f326ef263e4134c0 # timeout=10
Parsing POMs
Established TCP socket on 42000
maven33-agent.jar already up to date
maven33-interceptor.jar already up to date
maven3-interceptor-commons.jar already up to date
[sling-org-apache-sling-launchpad-testing-10] $ /home/jenkins/tools/java/latest10/bin/java -Xmx4g -Xms4g -cp /home/jenkins/jenkins-slave/maven33-agent.jar:/home/jenkins/tools/maven/apache-maven-3.3.9/boot/plexus-classworlds-2.5.2.jar:/home/jenkins/tools/maven/apache-maven-3.3.9/conf/logging jenkins.maven3.agent.Maven33Main /home/jenkins/tools/maven/apache-maven-3.3.9 /home/jenkins/jenkins-slave/slave.jar /home/jenkins/jenkins-slave/maven33-interceptor.jar /home/jenkins/jenkins-slave/maven3-interceptor-commons.jar 42000
<===[JENKINS REMOTING CAPACITY]===>   channel started
Executing Maven:  -B -f <https://builds.apache.org/job/sling-org-apache-sling-launchpad-testing-10/ws/pom.xml> -Dmaven.repo.local=/home/jenkins/jenkins-slave/maven-repositories/0 -U clean verify
[INFO] Scanning for projects...
[INFO] Downloading: https://repo.maven.apache.org/maven2/org/apache/sling/org.apache.sling.launchpad.test-bundles/0.0.6/org.apache.sling.launchpad.test-bundles-0.0.6.txt
[ERROR] Unable to get artifact for Dependency {groupId=org.apache.sling, artifactId=org.apache.sling.launchpad.test-bundles, version=0.0.6, type=slingfeature}: Could not find artifact org.apache.sling:org.apache.sling.launchpad.test-bundles:txt:0.0.6 in central (https://repo.maven.apache.org/maven2)
[ERROR] 
[ERROR] Try downloading the file manually from the project website.
[ERROR] 
[ERROR] Then, install it using the command:
[ERROR] mvn install:install-file -DgroupId=org.apache.sling -DartifactId=org.apache.sling.launchpad.test-bundles -Dversion=0.0.6 -Dpackaging=slingfeature -Dfile=/path/to/file
[ERROR] 
[ERROR] Alternatively, if you host your own repository you can deploy the file there:
[ERROR] mvn deploy:deploy-file -DgroupId=org.apache.sling -DartifactId=org.apache.sling.launchpad.test-bundles -Dversion=0.0.6 -Dpackaging=slingfeature -Dfile=/path/to/file -Durl=[url] -DrepositoryId=[id]
[ERROR] 
[ERROR] 
[ERROR] org.apache.sling:org.apache.sling.launchpad.test-bundles:slingfeature:0.0.6
[ERROR] 
[ERROR] from the specified remote repositories:
[ERROR] Nexus (http://repository.apache.org/snapshots, releases=false, snapshots=true),
[ERROR] central (https://repo.maven.apache.org/maven2, releases=true, snapshots=false)
[ERROR] -> [Help 1]
[ERROR] 
[ERROR] To see the full stack trace of the errors, re-run Maven with the -e switch.
[ERROR] Re-run Maven using the -X switch to enable full debug logging.
[ERROR] 
[ERROR] For more information about the errors and possible solutions, please read the following articles:
[ERROR] [Help 1] http://cwiki.apache.org/confluence/display/MAVEN/MavenExecutionException
channel stopped
Archiving artifacts
Recording test results

Jenkins build is back to stable : sling-org-apache-sling-launchpad-testing-10 #214

Posted by Apache Jenkins Server <je...@builds.apache.org>.
See <https://builds.apache.org/job/sling-org-apache-sling-launchpad-testing-10/214/display/redirect?page=changes>


Jenkins build is still unstable: sling-org-apache-sling-launchpad-testing-10 #213

Posted by Apache Jenkins Server <je...@builds.apache.org>.
See <https://builds.apache.org/job/sling-org-apache-sling-launchpad-testing-10/213/display/redirect>


Jenkins build is still unstable: sling-org-apache-sling-launchpad-testing-10 #212

Posted by Apache Jenkins Server <je...@builds.apache.org>.
See <https://builds.apache.org/job/sling-org-apache-sling-launchpad-testing-10/212/display/redirect>


Jenkins build is still unstable: sling-org-apache-sling-launchpad-testing-10 #211

Posted by Apache Jenkins Server <je...@builds.apache.org>.
See <https://builds.apache.org/job/sling-org-apache-sling-launchpad-testing-10/211/display/redirect>


Jenkins build is still unstable: sling-org-apache-sling-launchpad-testing-10 #210

Posted by Apache Jenkins Server <je...@builds.apache.org>.
See <https://builds.apache.org/job/sling-org-apache-sling-launchpad-testing-10/210/display/redirect>


Jenkins build is still unstable: sling-org-apache-sling-launchpad-testing-10 #209

Posted by Apache Jenkins Server <je...@builds.apache.org>.
See <https://builds.apache.org/job/sling-org-apache-sling-launchpad-testing-10/209/display/redirect>


Jenkins build is still unstable: sling-org-apache-sling-launchpad-testing-10 #208

Posted by Apache Jenkins Server <je...@builds.apache.org>.
See <https://builds.apache.org/job/sling-org-apache-sling-launchpad-testing-10/208/display/redirect>


Jenkins build is still unstable: sling-org-apache-sling-launchpad-testing-10 #207

Posted by Apache Jenkins Server <je...@builds.apache.org>.
See <https://builds.apache.org/job/sling-org-apache-sling-launchpad-testing-10/207/display/redirect>


Jenkins build is still unstable: sling-org-apache-sling-launchpad-testing-10 #206

Posted by Apache Jenkins Server <je...@builds.apache.org>.
See <https://builds.apache.org/job/sling-org-apache-sling-launchpad-testing-10/206/display/redirect>


Jenkins build is still unstable: sling-org-apache-sling-launchpad-testing-10 #205

Posted by Apache Jenkins Server <je...@builds.apache.org>.
See <https://builds.apache.org/job/sling-org-apache-sling-launchpad-testing-10/205/display/redirect>


Jenkins build is still unstable: sling-org-apache-sling-launchpad-testing-10 #204

Posted by Apache Jenkins Server <je...@builds.apache.org>.
See <https://builds.apache.org/job/sling-org-apache-sling-launchpad-testing-10/204/display/redirect>


Jenkins build is still unstable: sling-org-apache-sling-launchpad-testing-10 #203

Posted by Apache Jenkins Server <je...@builds.apache.org>.
See <https://builds.apache.org/job/sling-org-apache-sling-launchpad-testing-10/203/display/redirect>


Jenkins build is still unstable: sling-org-apache-sling-launchpad-testing-10 #202

Posted by Apache Jenkins Server <je...@builds.apache.org>.
See <https://builds.apache.org/job/sling-org-apache-sling-launchpad-testing-10/202/display/redirect>


Jenkins build is still unstable: sling-org-apache-sling-launchpad-testing-10 #201

Posted by Apache Jenkins Server <je...@builds.apache.org>.
See <https://builds.apache.org/job/sling-org-apache-sling-launchpad-testing-10/201/display/redirect>


Jenkins build is still unstable: sling-org-apache-sling-launchpad-testing-10 #200

Posted by Apache Jenkins Server <je...@builds.apache.org>.
See <https://builds.apache.org/job/sling-org-apache-sling-launchpad-testing-10/200/display/redirect>


Jenkins build is still unstable: sling-org-apache-sling-launchpad-testing-10 #199

Posted by Apache Jenkins Server <je...@builds.apache.org>.
See <https://builds.apache.org/job/sling-org-apache-sling-launchpad-testing-10/199/display/redirect>


Jenkins build is still unstable: sling-org-apache-sling-launchpad-testing-10 #198

Posted by Apache Jenkins Server <je...@builds.apache.org>.
See <https://builds.apache.org/job/sling-org-apache-sling-launchpad-testing-10/198/display/redirect>


Jenkins build is unstable: sling-org-apache-sling-launchpad-testing-10 #197

Posted by Apache Jenkins Server <je...@builds.apache.org>.
See <https://builds.apache.org/job/sling-org-apache-sling-launchpad-testing-10/197/display/redirect>


Build failed in Jenkins: sling-org-apache-sling-launchpad-testing-10 #196

Posted by Apache Jenkins Server <je...@builds.apache.org>.
See <https://builds.apache.org/job/sling-org-apache-sling-launchpad-testing-10/196/display/redirect>

------------------------------------------
[...truncated 211.04 KB...]
[INFO] Downloaded: https://repo.maven.apache.org/maven2/org/gagravarr/vorbis-java-tika/0.8/vorbis-java-tika-0.8.jar (25 KB at 18.0 KB/sec)
[INFO] Downloading: https://repo.maven.apache.org/maven2/org/tallison/jmatio/1.5/jmatio-1.5.jar
[INFO] Downloaded: https://repo.maven.apache.org/maven2/com/healthmarketscience/jackcess/jackcess-encrypt/2.1.4/jackcess-encrypt-2.1.4.jar (85 KB at 62.1 KB/sec)
[INFO] Downloading: https://repo.maven.apache.org/maven2/org/apache/james/apache-mime4j-core/0.8.2/apache-mime4j-core-0.8.2.jar
[INFO] Downloaded: https://repo.maven.apache.org/maven2/org/tallison/jmatio/1.5/jmatio-1.5.jar (74 KB at 53.9 KB/sec)
[INFO] Downloading: https://repo.maven.apache.org/maven2/org/apache/james/apache-mime4j-dom/0.8.2/apache-mime4j-dom-0.8.2.jar
[INFO] Downloaded: https://repo.maven.apache.org/maven2/org/apache/james/apache-mime4j-core/0.8.2/apache-mime4j-core-0.8.2.jar (102 KB at 73.4 KB/sec)
[INFO] Downloading: https://repo.maven.apache.org/maven2/org/apache/commons/commons-compress/1.18/commons-compress-1.18.jar
[INFO] Downloaded: https://repo.maven.apache.org/maven2/org/glassfish/jaxb/jaxb-runtime/2.3.0.1/jaxb-runtime-2.3.0.1.jar (934 KB at 672.4 KB/sec)
[INFO] Downloading: https://repo.maven.apache.org/maven2/com/epam/parso/2.0.9/parso-2.0.9.jar
[INFO] Downloaded: https://repo.maven.apache.org/maven2/com/healthmarketscience/jackcess/jackcess/2.1.12/jackcess-2.1.12.jar (869 KB at 620.6 KB/sec)
[INFO] Downloading: https://repo.maven.apache.org/maven2/org/brotli/dec/0.1.2/dec-0.1.2.jar
[INFO] Downloaded: https://repo.maven.apache.org/maven2/org/apache/james/apache-mime4j-dom/0.8.2/apache-mime4j-dom-0.8.2.jar (323 KB at 230.7 KB/sec)
[INFO] Downloading: https://repo.maven.apache.org/maven2/org/apache/pdfbox/pdfbox-tools/2.0.12/pdfbox-tools-2.0.12.jar
[INFO] Downloaded: https://repo.maven.apache.org/maven2/com/epam/parso/2.0.9/parso-2.0.9.jar (54 KB at 38.3 KB/sec)
[INFO] Downloading: https://repo.maven.apache.org/maven2/org/bouncycastle/bcmail-jdk15on/1.60/bcmail-jdk15on-1.60.jar
[INFO] Downloaded: https://repo.maven.apache.org/maven2/org/apache/commons/commons-compress/1.18/commons-compress-1.18.jar (578 KB at 411.0 KB/sec)
[INFO] Downloading: https://repo.maven.apache.org/maven2/org/bouncycastle/bcpkix-jdk15on/1.60/bcpkix-jdk15on-1.60.jar
[INFO] Downloaded: https://repo.maven.apache.org/maven2/org/apache/pdfbox/pdfbox-tools/2.0.12/pdfbox-tools-2.0.12.jar (72 KB at 50.4 KB/sec)
[INFO] Downloading: https://repo.maven.apache.org/maven2/org/bouncycastle/bcprov-jdk15on/1.60/bcprov-jdk15on-1.60.jar
[INFO] Downloaded: https://repo.maven.apache.org/maven2/org/brotli/dec/0.1.2/dec-0.1.2.jar (96 KB at 67.8 KB/sec)
[INFO] Downloading: https://repo.maven.apache.org/maven2/org/apache/poi/poi/4.0.0/poi-4.0.0.jar
[INFO] Downloaded: https://repo.maven.apache.org/maven2/org/bouncycastle/bcmail-jdk15on/1.60/bcmail-jdk15on-1.60.jar (106 KB at 74.5 KB/sec)
[INFO] Downloading: https://repo.maven.apache.org/maven2/org/apache/poi/poi-scratchpad/4.0.0/poi-scratchpad-4.0.0.jar
[INFO] Downloaded: https://repo.maven.apache.org/maven2/org/bouncycastle/bcpkix-jdk15on/1.60/bcpkix-jdk15on-1.60.jar (778 KB at 541.3 KB/sec)
[INFO] Downloading: https://repo.maven.apache.org/maven2/org/apache/poi/poi-ooxml/4.0.0/poi-ooxml-4.0.0.jar
[INFO] Downloaded: https://repo.maven.apache.org/maven2/org/apache/poi/poi-scratchpad/4.0.0/poi-scratchpad-4.0.0.jar (1351 KB at 905.2 KB/sec)
[INFO] Downloading: https://repo.maven.apache.org/maven2/org/apache/poi/poi-ooxml-schemas/4.0.0/poi-ooxml-schemas-4.0.0.jar
[INFO] Downloaded: https://repo.maven.apache.org/maven2/org/apache/poi/poi-ooxml/4.0.0/poi-ooxml-4.0.0.jar (1717 KB at 1140.8 KB/sec)
[INFO] Downloading: https://repo.maven.apache.org/maven2/org/apache/xmlbeans/xmlbeans/3.0.1/xmlbeans-3.0.1.jar
[INFO] Downloaded: https://repo.maven.apache.org/maven2/org/apache/pdfbox/jempbox/1.8.16/jempbox-1.8.16.jar (51 KB at 33.5 KB/sec)
[INFO] Downloading: https://repo.maven.apache.org/maven2/com/github/virtuald/curvesapi/1.04/curvesapi-1.04.jar
[INFO] Downloaded: https://repo.maven.apache.org/maven2/org/apache/poi/poi/4.0.0/poi-4.0.0.jar (2653 KB at 1742.5 KB/sec)
[INFO] Downloading: https://repo.maven.apache.org/maven2/org/ccil/cowan/tagsoup/tagsoup/1.2.1/tagsoup-1.2.1.jar
[INFO] Downloaded: https://repo.maven.apache.org/maven2/com/github/virtuald/curvesapi/1.04/curvesapi-1.04.jar (97 KB at 63.1 KB/sec)
[INFO] Downloading: https://repo.maven.apache.org/maven2/org/ow2/asm/asm/6.2/asm-6.2.jar
[INFO] Downloaded: https://repo.maven.apache.org/maven2/org/bouncycastle/bcprov-jdk15on/1.60/bcprov-jdk15on-1.60.jar (4092 KB at 2677.8 KB/sec)
[INFO] Downloading: https://repo.maven.apache.org/maven2/com/googlecode/mp4parser/isoparser/1.1.22/isoparser-1.1.22.jar
[INFO] Downloaded: https://repo.maven.apache.org/maven2/org/ccil/cowan/tagsoup/tagsoup/1.2.1/tagsoup-1.2.1.jar (89 KB at 57.6 KB/sec)
[INFO] Downloading: https://repo.maven.apache.org/maven2/com/drewnoakes/metadata-extractor/2.11.0/metadata-extractor-2.11.0.jar
[INFO] Downloaded: https://repo.maven.apache.org/maven2/org/ow2/asm/asm/6.2/asm-6.2.jar (109 KB at 70.5 KB/sec)
[INFO] Downloading: https://repo.maven.apache.org/maven2/com/adobe/xmp/xmpcore/5.1.3/xmpcore-5.1.3.jar
[INFO] Downloaded: https://repo.maven.apache.org/maven2/com/adobe/xmp/xmpcore/5.1.3/xmpcore-5.1.3.jar (90 KB at 57.2 KB/sec)
[INFO] Downloading: https://repo.maven.apache.org/maven2/com/rometools/rome/1.5.1/rome-1.5.1.jar
[INFO] Downloaded: https://repo.maven.apache.org/maven2/com/drewnoakes/metadata-extractor/2.11.0/metadata-extractor-2.11.0.jar (657 KB at 417.9 KB/sec)
[INFO] Downloading: https://repo.maven.apache.org/maven2/com/rometools/rome-utils/1.5.1/rome-utils-1.5.1.jar
[INFO] Downloaded: https://repo.maven.apache.org/maven2/com/rometools/rome-utils/1.5.1/rome-utils-1.5.1.jar (7 KB at 4.2 KB/sec)
[INFO] Downloading: https://repo.maven.apache.org/maven2/org/gagravarr/vorbis-java-core/0.8/vorbis-java-core-0.8.jar
[INFO] Downloaded: https://repo.maven.apache.org/maven2/com/googlecode/mp4parser/isoparser/1.1.22/isoparser-1.1.22.jar (1037 KB at 653.3 KB/sec)
[INFO] Downloading: https://repo.maven.apache.org/maven2/com/googlecode/juniversalchardet/juniversalchardet/1.0.3/juniversalchardet-1.0.3.jar
[INFO] Downloaded: https://repo.maven.apache.org/maven2/com/rometools/rome/1.5.1/rome-1.5.1.jar (238 KB at 149.3 KB/sec)
[INFO] Downloading: https://repo.maven.apache.org/maven2/org/codelibs/jhighlight/1.0.3/jhighlight-1.0.3.jar
[INFO] Downloaded: https://repo.maven.apache.org/maven2/org/apache/xmlbeans/xmlbeans/3.0.1/xmlbeans-3.0.1.jar (2522 KB at 1585.0 KB/sec)
[INFO] Downloading: https://repo.maven.apache.org/maven2/com/pff/java-libpst/0.8.1/java-libpst-0.8.1.jar
[INFO] Downloaded: https://repo.maven.apache.org/maven2/org/gagravarr/vorbis-java-core/0.8/vorbis-java-core-0.8.jar (119 KB at 73.9 KB/sec)
[INFO] Downloading: https://repo.maven.apache.org/maven2/com/github/junrar/junrar/2.0.0/junrar-2.0.0.jar
[INFO] Downloaded: https://repo.maven.apache.org/maven2/com/googlecode/juniversalchardet/juniversalchardet/1.0.3/juniversalchardet-1.0.3.jar (216 KB at 134.4 KB/sec)
[INFO] Downloading: https://repo.maven.apache.org/maven2/org/apache/cxf/cxf-rt-rs-client/3.2.6/cxf-rt-rs-client-3.2.6.jar
[INFO] Downloaded: https://repo.maven.apache.org/maven2/com/pff/java-libpst/0.8.1/java-libpst-0.8.1.jar (84 KB at 51.9 KB/sec)
[INFO] Downloading: https://repo.maven.apache.org/maven2/org/apache/cxf/cxf-rt-transports-http/3.2.6/cxf-rt-transports-http-3.2.6.jar
[INFO] Downloaded: https://repo.maven.apache.org/maven2/org/codelibs/jhighlight/1.0.3/jhighlight-1.0.3.jar (229 KB at 142.0 KB/sec)
[INFO] Downloading: https://repo.maven.apache.org/maven2/org/apache/cxf/cxf-core/3.2.6/cxf-core-3.2.6.jar
[INFO] Downloaded: https://repo.maven.apache.org/maven2/com/github/junrar/junrar/2.0.0/junrar-2.0.0.jar (160 KB at 98.6 KB/sec)
[INFO] Downloading: https://repo.maven.apache.org/maven2/com/fasterxml/woodstox/woodstox-core/5.1.0/woodstox-core-5.1.0.jar
[INFO] Downloaded: https://repo.maven.apache.org/maven2/org/apache/cxf/cxf-rt-rs-client/3.2.6/cxf-rt-rs-client-3.2.6.jar (176 KB at 108.2 KB/sec)
[INFO] Downloading: https://repo.maven.apache.org/maven2/org/codehaus/woodstox/stax2-api/4.1/stax2-api-4.1.jar
[INFO] Downloaded: https://repo.maven.apache.org/maven2/org/apache/cxf/cxf-rt-transports-http/3.2.6/cxf-rt-transports-http-3.2.6.jar (355 KB at 217.2 KB/sec)
[INFO] Downloading: https://repo.maven.apache.org/maven2/org/apache/ws/xmlschema/xmlschema-core/2.2.3/xmlschema-core-2.2.3.jar
[INFO] Downloaded: https://repo.maven.apache.org/maven2/org/codehaus/woodstox/stax2-api/4.1/stax2-api-4.1.jar (166 KB at 100.8 KB/sec)
[INFO] Downloading: https://repo.maven.apache.org/maven2/org/apache/cxf/cxf-rt-frontend-jaxrs/3.2.6/cxf-rt-frontend-jaxrs-3.2.6.jar
[INFO] Downloaded: https://repo.maven.apache.org/maven2/org/apache/ws/xmlschema/xmlschema-core/2.2.3/xmlschema-core-2.2.3.jar (169 KB at 102.3 KB/sec)
[INFO] Downloading: https://repo.maven.apache.org/maven2/javax/ws/rs/javax.ws.rs-api/2.1/javax.ws.rs-api-2.1.jar
[INFO] Downloaded: https://repo.maven.apache.org/maven2/org/apache/cxf/cxf-core/3.2.6/cxf-core-3.2.6.jar (1368 KB at 825.3 KB/sec)
[INFO] Downloading: https://repo.maven.apache.org/maven2/javax/annotation/javax.annotation-api/1.3/javax.annotation-api-1.3.jar
[INFO] Downloaded: https://repo.maven.apache.org/maven2/com/fasterxml/woodstox/woodstox-core/5.1.0/woodstox-core-5.1.0.jar (502 KB at 301.8 KB/sec)
[INFO] Downloading: https://repo.maven.apache.org/maven2/org/apache/commons/commons-exec/1.3/commons-exec-1.3.jar
[INFO] Downloaded: https://repo.maven.apache.org/maven2/javax/ws/rs/javax.ws.rs-api/2.1/javax.ws.rs-api-2.1.jar (125 KB at 74.7 KB/sec)
[INFO] Downloading: https://repo.maven.apache.org/maven2/org/apache/opennlp/opennlp-tools/1.9.0/opennlp-tools-1.9.0.jar
[INFO] Downloaded: https://repo.maven.apache.org/maven2/javax/annotation/javax.annotation-api/1.3/javax.annotation-api-1.3.jar (26 KB at 15.5 KB/sec)
[INFO] Downloading: https://repo.maven.apache.org/maven2/com/googlecode/json-simple/json-simple/1.1.1/json-simple-1.1.1.jar
[INFO] Downloaded: https://repo.maven.apache.org/maven2/org/apache/cxf/cxf-rt-frontend-jaxrs/3.2.6/cxf-rt-frontend-jaxrs-3.2.6.jar (665 KB at 397.2 KB/sec)
[INFO] Downloading: https://repo.maven.apache.org/maven2/com/github/openjson/openjson/1.0.10/openjson-1.0.10.jar
[INFO] Downloaded: https://repo.maven.apache.org/maven2/org/apache/commons/commons-exec/1.3/commons-exec-1.3.jar (54 KB at 31.7 KB/sec)
[INFO] Downloading: https://repo.maven.apache.org/maven2/com/google/code/gson/gson/2.8.5/gson-2.8.5.jar
[INFO] Downloaded: https://repo.maven.apache.org/maven2/org/apache/poi/poi-ooxml-schemas/4.0.0/poi-ooxml-schemas-4.0.0.jar (6326 KB at 3769.7 KB/sec)
[INFO] Downloading: https://repo.maven.apache.org/maven2/org/slf4j/jul-to-slf4j/1.7.25/jul-to-slf4j-1.7.25.jar
[INFO] Downloaded: https://repo.maven.apache.org/maven2/org/slf4j/jul-to-slf4j/1.7.25/jul-to-slf4j-1.7.25.jar (0 B at 0.0 KB/sec)
[INFO] Downloading: https://repo.maven.apache.org/maven2/edu/ucar/netcdf4/4.5.5/netcdf4-4.5.5.jar
[INFO] Downloaded: https://repo.maven.apache.org/maven2/com/googlecode/json-simple/json-simple/1.1.1/json-simple-1.1.1.jar (24 KB at 13.9 KB/sec)
[INFO] Downloading: https://repo.maven.apache.org/maven2/edu/ucar/grib/4.5.5/grib-4.5.5.jar
[INFO] Downloaded: https://repo.maven.apache.org/maven2/com/github/openjson/openjson/1.0.10/openjson-1.0.10.jar (27 KB at 15.8 KB/sec)
[INFO] Downloading: https://repo.maven.apache.org/maven2/org/itadaki/bzip2/0.9.1/bzip2-0.9.1.jar
[INFO] Downloaded: https://repo.maven.apache.org/maven2/com/google/code/gson/gson/2.8.5/gson-2.8.5.jar (236 KB at 139.4 KB/sec)
[INFO] Downloading: https://repo.maven.apache.org/maven2/net/java/dev/jna/jna/4.3.0/jna-4.3.0.jar
[INFO] Downloaded: https://repo.maven.apache.org/maven2/edu/ucar/netcdf4/4.5.5/netcdf4-4.5.5.jar (61 KB at 35.7 KB/sec)
[INFO] Downloading: https://repo.maven.apache.org/maven2/org/jsoup/jsoup/1.11.3/jsoup-1.11.3.jar
[INFO] Downloaded: https://repo.maven.apache.org/maven2/org/itadaki/bzip2/0.9.1/bzip2-0.9.1.jar (49 KB at 28.6 KB/sec)
[INFO] Downloading: https://repo.maven.apache.org/maven2/edu/ucar/cdm/4.5.5/cdm-4.5.5.jar
[INFO] Downloaded: https://repo.maven.apache.org/maven2/org/apache/opennlp/opennlp-tools/1.9.0/opennlp-tools-1.9.0.jar (1217 KB at 704.0 KB/sec)
[INFO] Downloading: https://repo.maven.apache.org/maven2/edu/ucar/udunits/4.5.5/udunits-4.5.5.jar
[INFO] Downloaded: https://repo.maven.apache.org/maven2/org/jsoup/jsoup/1.11.3/jsoup-1.11.3.jar (387 KB at 223.7 KB/sec)
[INFO] Downloading: https://repo.maven.apache.org/maven2/joda-time/joda-time/2.2/joda-time-2.2.jar
[INFO] Downloaded: https://repo.maven.apache.org/maven2/edu/ucar/udunits/4.5.5/udunits-4.5.5.jar (122 KB at 69.5 KB/sec)
[INFO] Downloading: https://repo.maven.apache.org/maven2/net/sf/ehcache/ehcache-core/2.6.2/ehcache-core-2.6.2.jar
[INFO] Downloaded: https://repo.maven.apache.org/maven2/net/java/dev/jna/jna/4.3.0/jna-4.3.0.jar (924 KB at 524.0 KB/sec)
[INFO] Downloading: https://repo.maven.apache.org/maven2/edu/ucar/httpservices/4.5.5/httpservices-4.5.5.jar
[INFO] Downloaded: https://repo.maven.apache.org/maven2/joda-time/joda-time/2.2/joda-time-2.2.jar (561 KB at 315.9 KB/sec)
[INFO] Downloading: https://repo.maven.apache.org/maven2/org/apache/commons/commons-csv/1.5/commons-csv-1.5.jar
[INFO] Downloaded: https://repo.maven.apache.org/maven2/edu/ucar/httpservices/4.5.5/httpservices-4.5.5.jar (61 KB at 33.6 KB/sec)
[INFO] Downloading: https://repo.maven.apache.org/maven2/org/apache/sis/core/sis-utility/0.8/sis-utility-0.8.jar
[INFO] Downloaded: https://repo.maven.apache.org/maven2/org/apache/commons/commons-csv/1.5/commons-csv-1.5.jar (41 KB at 22.6 KB/sec)
[INFO] Downloading: https://repo.maven.apache.org/maven2/javax/measure/unit-api/1.0/unit-api-1.0.jar
[INFO] Downloaded: https://repo.maven.apache.org/maven2/net/sf/ehcache/ehcache-core/2.6.2/ehcache-core-2.6.2.jar (1307 KB at 723.2 KB/sec)
[INFO] Downloading: https://repo.maven.apache.org/maven2/org/apache/sis/storage/sis-netcdf/0.8/sis-netcdf-0.8.jar
[INFO] Downloaded: https://repo.maven.apache.org/maven2/javax/measure/unit-api/1.0/unit-api-1.0.jar (28 KB at 14.9 KB/sec)
[INFO] Downloading: https://repo.maven.apache.org/maven2/org/apache/sis/storage/sis-storage/0.8/sis-storage-0.8.jar
[INFO] Downloaded: https://repo.maven.apache.org/maven2/org/apache/sis/storage/sis-storage/0.8/sis-storage-0.8.jar (189 KB at 102.6 KB/sec)
[INFO] Downloading: https://repo.maven.apache.org/maven2/org/apache/sis/core/sis-feature/0.8/sis-feature-0.8.jar
[INFO] Downloaded: https://repo.maven.apache.org/maven2/org/apache/sis/storage/sis-netcdf/0.8/sis-netcdf-0.8.jar (72 KB at 38.8 KB/sec)
[INFO] Downloading: https://repo.maven.apache.org/maven2/org/apache/sis/core/sis-referencing/0.8/sis-referencing-0.8.jar
[INFO] Downloaded: https://repo.maven.apache.org/maven2/edu/ucar/cdm/4.5.5/cdm-4.5.5.jar (4084 KB at 2217.1 KB/sec)
[INFO] Downloading: https://repo.maven.apache.org/maven2/org/apache/sis/core/sis-metadata/0.8/sis-metadata-0.8.jar
[INFO] Downloaded: https://repo.maven.apache.org/maven2/org/apache/sis/core/sis-utility/0.8/sis-utility-0.8.jar (813 KB at 441.2 KB/sec)
[INFO] Downloading: https://repo.maven.apache.org/maven2/org/opengis/geoapi/3.0.1/geoapi-3.0.1.jar
[INFO] Downloaded: https://repo.maven.apache.org/maven2/edu/ucar/grib/4.5.5/grib-4.5.5.jar (5007 KB at 2698.9 KB/sec)
[INFO] Downloading: https://repo.maven.apache.org/maven2/edu/usc/ir/sentiment-analysis-parser/0.1/sentiment-analysis-parser-0.1.jar
[INFO] Downloaded: https://repo.maven.apache.org/maven2/org/apache/sis/core/sis-feature/0.8/sis-feature-0.8.jar (141 KB at 75.9 KB/sec)
[INFO] Downloading: https://repo.maven.apache.org/maven2/org/apache/uima/uimafit-core/2.2.0/uimafit-core-2.2.0.jar
[INFO] Downloaded: https://repo.maven.apache.org/maven2/org/opengis/geoapi/3.0.1/geoapi-3.0.1.jar (212 KB at 113.5 KB/sec)
[INFO] Downloading: https://repo.maven.apache.org/maven2/org/apache/uima/uimaj-core/2.9.0/uimaj-core-2.9.0.jar
[INFO] Downloaded: https://repo.maven.apache.org/maven2/edu/usc/ir/sentiment-analysis-parser/0.1/sentiment-analysis-parser-0.1.jar (29 KB at 15.0 KB/sec)
[INFO] Downloading: https://repo.maven.apache.org/maven2/org/jdom/jdom2/2.0.6/jdom2-2.0.6.jar
[INFO] Downloaded: https://repo.maven.apache.org/maven2/org/apache/uima/uimafit-core/2.2.0/uimafit-core-2.2.0.jar (168 KB at 89.5 KB/sec)
[INFO] Downloading: https://repo.maven.apache.org/maven2/org/apache/pdfbox/jbig2-imageio/3.0.2/jbig2-imageio-3.0.2.jar
[INFO] Downloaded: https://repo.maven.apache.org/maven2/org/apache/sis/core/sis-metadata/0.8/sis-metadata-0.8.jar (628 KB at 333.5 KB/sec)
[INFO] Downloading: https://repo.maven.apache.org/maven2/com/github/jai-imageio/jai-imageio-core/1.4.0/jai-imageio-core-1.4.0.jar
[INFO] Downloaded: https://repo.maven.apache.org/maven2/org/jdom/jdom2/2.0.6/jdom2-2.0.6.jar (298 KB at 157.4 KB/sec)
[INFO] Downloading: https://repo.maven.apache.org/maven2/io/dropwizard/metrics/metrics-core/3.2.6/metrics-core-3.2.6.jar
[INFO] Downloaded: https://repo.maven.apache.org/maven2/org/apache/sis/core/sis-referencing/0.8/sis-referencing-0.8.jar (1093 KB at 577.2 KB/sec)
[INFO] Downloading: https://repo.maven.apache.org/maven2/org/apache/jackrabbit/jackrabbit-api/2.16.3/jackrabbit-api-2.16.3.jar
[INFO] Downloaded: https://repo.maven.apache.org/maven2/org/apache/pdfbox/jbig2-imageio/3.0.2/jbig2-imageio-3.0.2.jar (149 KB at 78.1 KB/sec)
[INFO] Downloading: https://repo.maven.apache.org/maven2/org/apache/jackrabbit/jackrabbit-data/2.16.3/jackrabbit-data-2.16.3.jar
[INFO] Downloaded: https://repo.maven.apache.org/maven2/io/dropwizard/metrics/metrics-core/3.2.6/metrics-core-3.2.6.jar (134 KB at 69.8 KB/sec)
[INFO] Downloading: https://repo.maven.apache.org/maven2/org/apache/jackrabbit/jackrabbit-jcr-commons/2.16.3/jackrabbit-jcr-commons-2.16.3.jar
[INFO] Downloaded: https://repo.maven.apache.org/maven2/org/apache/jackrabbit/jackrabbit-api/2.16.3/jackrabbit-api-2.16.3.jar (42 KB at 21.7 KB/sec)
[INFO] Downloading: https://repo.maven.apache.org/maven2/org/apache/jackrabbit/jackrabbit-jcr-rmi/2.16.3/jackrabbit-jcr-rmi-2.16.3.jar
[INFO] Downloaded: https://repo.maven.apache.org/maven2/com/github/jai-imageio/jai-imageio-core/1.4.0/jai-imageio-core-1.4.0.jar (614 KB at 319.4 KB/sec)
[INFO] Downloading: https://repo.maven.apache.org/maven2/org/apache/jackrabbit/jackrabbit-spi-commons/2.16.3/jackrabbit-spi-commons-2.16.3.jar
[INFO] Downloaded: https://repo.maven.apache.org/maven2/org/apache/jackrabbit/jackrabbit-data/2.16.3/jackrabbit-data-2.16.3.jar (169 KB at 87.9 KB/sec)
[INFO] Downloading: https://repo.maven.apache.org/maven2/org/apache/jackrabbit/jackrabbit-spi/2.16.3/jackrabbit-spi-2.16.3.jar
[INFO] Downloaded: https://repo.maven.apache.org/maven2/org/apache/jackrabbit/jackrabbit-jcr-rmi/2.16.3/jackrabbit-jcr-rmi-2.16.3.jar (227 KB at 117.2 KB/sec)
[INFO] Downloading: https://repo.maven.apache.org/maven2/org/apache/jackrabbit/jackrabbit-webdav/2.16.3/jackrabbit-webdav-2.16.3.jar
[INFO] Downloaded: https://repo.maven.apache.org/maven2/org/apache/jackrabbit/jackrabbit-spi/2.16.3/jackrabbit-spi-2.16.3.jar (28 KB at 14.4 KB/sec)
[INFO] Downloading: https://repo.maven.apache.org/maven2/org/apache/sling/org.apache.sling.commons.metrics/1.2.6/org.apache.sling.commons.metrics-1.2.6.jar
[INFO] Downloaded: https://repo.maven.apache.org/maven2/org/apache/jackrabbit/jackrabbit-jcr-commons/2.16.3/jackrabbit-jcr-commons-2.16.3.jar (394 KB at 202.8 KB/sec)
[INFO] Downloading: https://repo.maven.apache.org/maven2/org/apache/sling/org.apache.sling.jcr.base/3.0.4/org.apache.sling.jcr.base-3.0.4.jar
[INFO] Downloaded: https://repo.maven.apache.org/maven2/org/apache/uima/uimaj-core/2.9.0/uimaj-core-2.9.0.jar (1554 KB at 799.2 KB/sec)
[INFO] Downloading: https://repo.maven.apache.org/maven2/org/apache/sling/org.apache.sling.jcr.davex/1.3.10/org.apache.sling.jcr.davex-1.3.10.jar
[INFO] Downloaded: https://repo.maven.apache.org/maven2/org/apache/jackrabbit/jackrabbit-spi-commons/2.16.3/jackrabbit-spi-commons-2.16.3.jar (785 KB at 401.6 KB/sec)
[INFO] Downloading: https://repo.maven.apache.org/maven2/org/apache/sling/org.apache.sling.jcr.jackrabbit.accessmanager/3.0.2/org.apache.sling.jcr.jackrabbit.accessmanager-3.0.2.jar
[INFO] Downloaded: https://repo.maven.apache.org/maven2/org/apache/sling/org.apache.sling.commons.metrics/1.2.6/org.apache.sling.commons.metrics-1.2.6.jar (63 KB at 32.2 KB/sec)
[INFO] Downloading: https://repo.maven.apache.org/maven2/org/apache/sling/org.apache.sling.jcr.jackrabbit.usermanager/2.2.8/org.apache.sling.jcr.jackrabbit.usermanager-2.2.8.jar
[INFO] Downloaded: https://repo.maven.apache.org/maven2/org/apache/jackrabbit/jackrabbit-webdav/2.16.3/jackrabbit-webdav-2.16.3.jar (319 KB at 162.8 KB/sec)
[INFO] Downloading: https://repo.maven.apache.org/maven2/org/apache/sling/org.apache.sling.jcr.registration/1.0.6/org.apache.sling.jcr.registration-1.0.6.jar
[INFO] Downloaded: https://repo.maven.apache.org/maven2/org/apache/sling/org.apache.sling.jcr.base/3.0.4/org.apache.sling.jcr.base-3.0.4.jar (60 KB at 30.2 KB/sec)
[INFO] Downloading: https://repo.maven.apache.org/maven2/org/apache/sling/org.apache.sling.caconfig.api/1.1.2/org.apache.sling.caconfig.api-1.1.2.jar
[INFO] Downloaded: https://repo.maven.apache.org/maven2/org/apache/sling/org.apache.sling.jcr.davex/1.3.10/org.apache.sling.jcr.davex-1.3.10.jar (268 KB at 135.7 KB/sec)
[INFO] Downloading: https://repo.maven.apache.org/maven2/org/apache/sling/org.apache.sling.caconfig.impl/1.4.14/org.apache.sling.caconfig.impl-1.4.14.jar
[INFO] Downloaded: https://repo.maven.apache.org/maven2/org/apache/sling/org.apache.sling.jcr.jackrabbit.accessmanager/3.0.2/org.apache.sling.jcr.jackrabbit.accessmanager-3.0.2.jar (51 KB at 25.5 KB/sec)
[INFO] Downloading: https://repo.maven.apache.org/maven2/org/apache/sling/org.apache.sling.caconfig.spi/1.3.4/org.apache.sling.caconfig.spi-1.3.4.jar
[INFO] Downloaded: https://repo.maven.apache.org/maven2/org/apache/sling/org.apache.sling.jcr.jackrabbit.usermanager/2.2.8/org.apache.sling.jcr.jackrabbit.usermanager-2.2.8.jar (94 KB at 47.3 KB/sec)
[INFO] Downloading: https://repo.maven.apache.org/maven2/org/apache/sling/org.apache.sling.discovery.base/2.0.8/org.apache.sling.discovery.base-2.0.8.jar
[INFO] Downloaded: https://repo.maven.apache.org/maven2/org/apache/sling/org.apache.sling.jcr.registration/1.0.6/org.apache.sling.jcr.registration-1.0.6.jar (33 KB at 16.5 KB/sec)
[INFO] Downloading: https://repo.maven.apache.org/maven2/org/apache/sling/org.apache.sling.discovery.oak/1.2.28/org.apache.sling.discovery.oak-1.2.28.jar
[INFO] Downloaded: https://repo.maven.apache.org/maven2/org/apache/sling/org.apache.sling.caconfig.api/1.1.2/org.apache.sling.caconfig.api-1.1.2.jar (13 KB at 6.4 KB/sec)
[INFO] Downloading: https://repo.maven.apache.org/maven2/org/apache/sling/org.apache.sling.discovery.support/1.0.4/org.apache.sling.discovery.support-1.0.4.jar
[INFO] Downloaded: https://repo.maven.apache.org/maven2/org/apache/sling/org.apache.sling.caconfig.spi/1.3.4/org.apache.sling.caconfig.spi-1.3.4.jar (26 KB at 12.9 KB/sec)
[INFO] Downloading: https://repo.maven.apache.org/maven2/org/apache/sling/org.apache.sling.event/4.2.12/org.apache.sling.event-4.2.12.jar
[INFO] Downloaded: https://repo.maven.apache.org/maven2/org/apache/sling/org.apache.sling.caconfig.impl/1.4.14/org.apache.sling.caconfig.impl-1.4.14.jar (201 KB at 100.7 KB/sec)
[INFO] Downloaded: https://repo.maven.apache.org/maven2/org/apache/sling/org.apache.sling.discovery.base/2.0.8/org.apache.sling.discovery.base-2.0.8.jar (84 KB at 41.8 KB/sec)
[INFO] Downloading: https://repo.maven.apache.org/maven2/org/apache/sling/org.apache.sling.event.api/1.0.0/org.apache.sling.event.api-1.0.0.jar
[INFO] Downloading: https://repo.maven.apache.org/maven2/org/apache/sling/org.apache.sling.validation.core/1.0.4/org.apache.sling.validation.core-1.0.4.jar
[INFO] Downloaded: https://repo.maven.apache.org/maven2/org/apache/sling/org.apache.sling.discovery.oak/1.2.28/org.apache.sling.discovery.oak-1.2.28.jar (75 KB at 37.7 KB/sec)
[INFO] Downloading: https://repo.maven.apache.org/maven2/org/apache/sling/org.apache.sling.sample.slingshot/0.9.0/org.apache.sling.sample.slingshot-0.9.0.jar
[INFO] Downloaded: https://repo.maven.apache.org/maven2/org/apache/sling/org.apache.sling.discovery.support/1.0.4/org.apache.sling.discovery.support-1.0.4.jar (14 KB at 6.6 KB/sec)
[INFO] Downloading: https://repo.maven.apache.org/maven2/org/apache/felix/org.apache.felix.http.jetty/4.0.6/org.apache.felix.http.jetty-4.0.6.jar
[INFO] Downloaded: https://repo.maven.apache.org/maven2/org/apache/sling/org.apache.sling.event.api/1.0.0/org.apache.sling.event.api-1.0.0.jar (26 KB at 12.7 KB/sec)
[INFO] Downloading: https://repo.maven.apache.org/maven2/org/eclipse/jetty/jetty-servlet/9.4.12.v20180830/jetty-servlet-9.4.12.v20180830.jar
[INFO] Downloaded: https://repo.maven.apache.org/maven2/org/apache/sling/org.apache.sling.validation.core/1.0.4/org.apache.sling.validation.core-1.0.4.jar (67 KB at 33.2 KB/sec)
[INFO] Downloading: https://repo.maven.apache.org/maven2/org/eclipse/jetty/jetty-server/9.4.12.v20180830/jetty-server-9.4.12.v20180830.jar
[INFO] Downloaded: https://repo.maven.apache.org/maven2/org/apache/sling/org.apache.sling.event/4.2.12/org.apache.sling.event-4.2.12.jar (315 KB at 156.6 KB/sec)
[INFO] Downloading: https://repo.maven.apache.org/maven2/org/eclipse/jetty/jetty-http/9.4.12.v20180830/jetty-http-9.4.12.v20180830.jar
[INFO] Downloaded: https://repo.maven.apache.org/maven2/org/eclipse/jetty/jetty-servlet/9.4.12.v20180830/jetty-servlet-9.4.12.v20180830.jar (109 KB at 53.6 KB/sec)
[INFO] Downloading: https://repo.maven.apache.org/maven2/org/eclipse/jetty/jetty-io/9.4.12.v20180830/jetty-io-9.4.12.v20180830.jar
[INFO] Downloaded: https://repo.maven.apache.org/maven2/org/eclipse/jetty/jetty-http/9.4.12.v20180830/jetty-http-9.4.12.v20180830.jar (192 KB at 94.1 KB/sec)
[INFO] Downloading: https://repo.maven.apache.org/maven2/org/eclipse/jetty/jetty-util/9.4.12.v20180830/jetty-util-9.4.12.v20180830.jar
[INFO] Downloaded: https://repo.maven.apache.org/maven2/org/eclipse/jetty/jetty-server/9.4.12.v20180830/jetty-server-9.4.12.v20180830.jar (596 KB at 292.7 KB/sec)
[INFO] Downloading: https://repo.maven.apache.org/maven2/org/eclipse/jetty/jetty-jmx/9.4.12.v20180830/jetty-jmx-9.4.12.v20180830.jar
[INFO] Downloaded: https://repo.maven.apache.org/maven2/org/eclipse/jetty/jetty-io/9.4.12.v20180830/jetty-io-9.4.12.v20180830.jar (137 KB at 66.8 KB/sec)
[INFO] Downloading: https://repo.maven.apache.org/maven2/org/eclipse/jetty/jetty-security/9.4.12.v20180830/jetty-security-9.4.12.v20180830.jar
[INFO] Downloaded: https://repo.maven.apache.org/maven2/org/eclipse/jetty/jetty-jmx/9.4.12.v20180830/jetty-jmx-9.4.12.v20180830.jar (25 KB at 12.1 KB/sec)
[INFO] Downloading: https://repo.maven.apache.org/maven2/org/eclipse/jetty/jetty-webapp/9.4.12.v20180830/jetty-webapp-9.4.12.v20180830.jar
[INFO] Downloaded: https://repo.maven.apache.org/maven2/org/eclipse/jetty/jetty-security/9.4.12.v20180830/jetty-security-9.4.12.v20180830.jar (91 KB at 44.2 KB/sec)
[INFO] Downloading: https://repo.maven.apache.org/maven2/org/eclipse/jetty/jetty-xml/9.4.12.v20180830/jetty-xml-9.4.12.v20180830.jar
[INFO] Downloaded: https://repo.maven.apache.org/maven2/org/eclipse/jetty/jetty-util/9.4.12.v20180830/jetty-util-9.4.12.v20180830.jar (492 KB at 238.3 KB/sec)
[INFO] Downloading: https://repo.maven.apache.org/maven2/org/eclipse/jetty/websocket/websocket-servlet/9.4.12.v20180830/websocket-servlet-9.4.12.v20180830.jar
[INFO] Downloaded: https://repo.maven.apache.org/maven2/org/eclipse/jetty/jetty-webapp/9.4.12.v20180830/jetty-webapp-9.4.12.v20180830.jar (126 KB at 60.7 KB/sec)
[INFO] Downloading: https://repo.maven.apache.org/maven2/org/eclipse/jetty/websocket/websocket-api/9.4.12.v20180830/websocket-api-9.4.12.v20180830.jar
[INFO] Downloaded: https://repo.maven.apache.org/maven2/org/eclipse/jetty/jetty-xml/9.4.12.v20180830/jetty-xml-9.4.12.v20180830.jar (51 KB at 24.5 KB/sec)
[INFO] Downloading: https://repo.maven.apache.org/maven2/org/eclipse/jetty/websocket/websocket-server/9.4.12.v20180830/websocket-server-9.4.12.v20180830.jar
[INFO] Downloaded: https://repo.maven.apache.org/maven2/org/eclipse/jetty/websocket/websocket-servlet/9.4.12.v20180830/websocket-servlet-9.4.12.v20180830.jar (21 KB at 10.0 KB/sec)
[INFO] Downloading: https://repo.maven.apache.org/maven2/org/eclipse/jetty/websocket/websocket-common/9.4.12.v20180830/websocket-common-9.4.12.v20180830.jar
[INFO] Downloaded: https://repo.maven.apache.org/maven2/org/eclipse/jetty/websocket/websocket-api/9.4.12.v20180830/websocket-api-9.4.12.v20180830.jar (43 KB at 20.5 KB/sec)
[INFO] Downloading: https://repo.maven.apache.org/maven2/org/eclipse/jetty/websocket/websocket-client/9.4.12.v20180830/websocket-client-9.4.12.v20180830.jar
[INFO] Downloaded: https://repo.maven.apache.org/maven2/org/eclipse/jetty/websocket/websocket-server/9.4.12.v20180830/websocket-server-9.4.12.v20180830.jar (35 KB at 16.6 KB/sec)
[INFO] Downloading: https://repo.maven.apache.org/maven2/org/eclipse/jetty/jetty-client/9.4.12.v20180830/jetty-client-9.4.12.v20180830.jar
[INFO] Downloaded: https://repo.maven.apache.org/maven2/org/eclipse/jetty/websocket/websocket-common/9.4.12.v20180830/websocket-common-9.4.12.v20180830.jar (193 KB at 91.6 KB/sec)
[INFO] Downloading: https://repo.maven.apache.org/maven2/org/apache/felix/org.apache.felix.http.base/4.0.4/org.apache.felix.http.base-4.0.4.jar
[INFO] Downloaded: https://repo.maven.apache.org/maven2/org/eclipse/jetty/websocket/websocket-client/9.4.12.v20180830/websocket-client-9.4.12.v20180830.jar (36 KB at 16.8 KB/sec)
[INFO] Downloading: https://repo.maven.apache.org/maven2/org/apache/tomcat/tomcat-servlet-api/8.0.9/tomcat-servlet-api-8.0.9.jar
[INFO] Downloaded: https://repo.maven.apache.org/maven2/org/apache/felix/org.apache.felix.http.jetty/4.0.6/org.apache.felix.http.jetty-4.0.6.jar (2911 KB at 1374.0 KB/sec)
[INFO] Downloading: https://repo.maven.apache.org/maven2/org/apache/felix/org.apache.felix.http.bridge/4.0.4/org.apache.felix.http.bridge-4.0.4.jar
[INFO] Downloaded: https://repo.maven.apache.org/maven2/org/eclipse/jetty/jetty-client/9.4.12.v20180830/jetty-client-9.4.12.v20180830.jar (274 KB at 129.2 KB/sec)
[INFO] Downloaded: https://repo.maven.apache.org/maven2/org/apache/tomcat/tomcat-servlet-api/8.0.9/tomcat-servlet-api-8.0.9.jar (239 KB at 112.1 KB/sec)
[INFO] Downloaded: https://repo.maven.apache.org/maven2/org/apache/felix/org.apache.felix.http.base/4.0.4/org.apache.felix.http.base-4.0.4.jar (238 KB at 110.7 KB/sec)
[INFO] Downloaded: https://repo.maven.apache.org/maven2/org/apache/felix/org.apache.felix.http.bridge/4.0.4/org.apache.felix.http.bridge-4.0.4.jar (493 KB at 229.0 KB/sec)
[INFO] Downloaded: https://repo.maven.apache.org/maven2/org/apache/sling/org.apache.sling.sample.slingshot/0.9.0/org.apache.sling.sample.slingshot-0.9.0.jar (4952 KB at 2257.9 KB/sec)
[WARNING] Attempt to (de-)serialize anonymous class hudson.maven.reporters.MavenArtifactArchiver$2; see: https://jenkins.io/redirect/serialization-of-anonymous-classes/
[JENKINS] Archiving disabled
[WARNING] Attempt to (de-)serialize anonymous class hudson.maven.reporters.MavenFingerprinter$1; see: https://jenkins.io/redirect/serialization-of-anonymous-classes/
[JENKINS] Archiving disabled
[INFO] ------------------------------------------------------------------------
[INFO] BUILD FAILURE
[INFO] ------------------------------------------------------------------------
[INFO] Total time: 30.076 s
[INFO] Finished at: 2018-10-22T06:27:03+00:00
[INFO] Final Memory: 33M/4096M
[INFO] ------------------------------------------------------------------------
Waiting for Jenkins to finish collecting data
[ERROR] Failed to execute goal on project org.apache.sling.launchpad.testing: Could not resolve dependencies for project org.apache.sling:org.apache.sling.launchpad.testing:slingstart:12-SNAPSHOT: Could not find artifact org.apache.sling:org.apache.sling.launchpad.integration-tests:jar:12-SNAPSHOT in Nexus (http://repository.apache.org/snapshots) -> [Help 1]
[ERROR] 
[ERROR] To see the full stack trace of the errors, re-run Maven with the -e switch.
[ERROR] Re-run Maven using the -X switch to enable full debug logging.
[ERROR] 
[ERROR] For more information about the errors and possible solutions, please read the following articles:
[ERROR] [Help 1] http://cwiki.apache.org/confluence/display/MAVEN/DependencyResolutionException
channel stopped
Archiving artifacts
Recording test results

Build failed in Jenkins: sling-org-apache-sling-launchpad-testing-10 #195

Posted by Apache Jenkins Server <je...@builds.apache.org>.
See <https://builds.apache.org/job/sling-org-apache-sling-launchpad-testing-10/195/display/redirect>

------------------------------------------
[...truncated 276.50 KB...]
[INFO] Downloaded: https://repo.maven.apache.org/maven2/org/apache/poi/poi-ooxml/4.0.0/poi-ooxml-4.0.0.jar (1717 KB at 1045.6 KB/sec)
[INFO] Downloading: https://repo.maven.apache.org/maven2/org/apache/xmlbeans/xmlbeans/3.0.1/xmlbeans-3.0.1.jar
[INFO] Downloaded: https://repo.maven.apache.org/maven2/org/apache/poi/poi-scratchpad/4.0.0/poi-scratchpad-4.0.0.jar (1351 KB at 821.5 KB/sec)
[INFO] Downloading: https://repo.maven.apache.org/maven2/com/github/virtuald/curvesapi/1.04/curvesapi-1.04.jar
[INFO] Downloaded: https://repo.maven.apache.org/maven2/org/apache/poi/poi/4.0.0/poi-4.0.0.jar (2653 KB at 1601.5 KB/sec)
[INFO] Downloading: https://repo.maven.apache.org/maven2/org/ccil/cowan/tagsoup/tagsoup/1.2.1/tagsoup-1.2.1.jar
[INFO] Downloaded: https://repo.maven.apache.org/maven2/com/github/virtuald/curvesapi/1.04/curvesapi-1.04.jar (97 KB at 57.8 KB/sec)
[INFO] Downloading: https://repo.maven.apache.org/maven2/org/ow2/asm/asm/6.2/asm-6.2.jar
[INFO] Downloaded: https://repo.maven.apache.org/maven2/org/ccil/cowan/tagsoup/tagsoup/1.2.1/tagsoup-1.2.1.jar (89 KB at 52.6 KB/sec)
[INFO] Downloading: https://repo.maven.apache.org/maven2/com/googlecode/mp4parser/isoparser/1.1.22/isoparser-1.1.22.jar
[INFO] Downloaded: https://repo.maven.apache.org/maven2/org/ow2/asm/asm/6.2/asm-6.2.jar (109 KB at 64.2 KB/sec)
[INFO] Downloading: https://repo.maven.apache.org/maven2/com/drewnoakes/metadata-extractor/2.11.0/metadata-extractor-2.11.0.jar
[INFO] Downloaded: https://repo.maven.apache.org/maven2/org/bouncycastle/bcprov-jdk15on/1.60/bcprov-jdk15on-1.60.jar (4092 KB at 2409.7 KB/sec)
[INFO] Downloading: https://repo.maven.apache.org/maven2/com/adobe/xmp/xmpcore/5.1.3/xmpcore-5.1.3.jar
[INFO] Downloaded: https://repo.maven.apache.org/maven2/com/adobe/xmp/xmpcore/5.1.3/xmpcore-5.1.3.jar (90 KB at 52.1 KB/sec)
[INFO] Downloading: https://repo.maven.apache.org/maven2/de/l3s/boilerpipe/boilerpipe/1.1.0/boilerpipe-1.1.0.jar
[INFO] Downloaded: https://repo.maven.apache.org/maven2/org/apache/xmlbeans/xmlbeans/3.0.1/xmlbeans-3.0.1.jar (2522 KB at 1451.8 KB/sec)
[INFO] Downloading: https://repo.maven.apache.org/maven2/com/rometools/rome/1.5.1/rome-1.5.1.jar
[INFO] Downloaded: https://repo.maven.apache.org/maven2/de/l3s/boilerpipe/boilerpipe/1.1.0/boilerpipe-1.1.0.jar (90 KB at 51.7 KB/sec)
[INFO] Downloading: https://repo.maven.apache.org/maven2/com/rometools/rome-utils/1.5.1/rome-utils-1.5.1.jar
[INFO] Downloaded: https://repo.maven.apache.org/maven2/com/drewnoakes/metadata-extractor/2.11.0/metadata-extractor-2.11.0.jar (657 KB at 377.1 KB/sec)
[INFO] Downloading: https://repo.maven.apache.org/maven2/org/gagravarr/vorbis-java-core/0.8/vorbis-java-core-0.8.jar
[INFO] Downloaded: https://repo.maven.apache.org/maven2/com/rometools/rome-utils/1.5.1/rome-utils-1.5.1.jar (7 KB at 3.8 KB/sec)
[INFO] Downloading: https://repo.maven.apache.org/maven2/com/googlecode/juniversalchardet/juniversalchardet/1.0.3/juniversalchardet-1.0.3.jar
[INFO] Downloaded: https://repo.maven.apache.org/maven2/com/googlecode/mp4parser/isoparser/1.1.22/isoparser-1.1.22.jar (1037 KB at 590.0 KB/sec)
[INFO] Downloading: https://repo.maven.apache.org/maven2/org/codelibs/jhighlight/1.0.3/jhighlight-1.0.3.jar
[INFO] Downloaded: https://repo.maven.apache.org/maven2/com/rometools/rome/1.5.1/rome-1.5.1.jar (238 KB at 135.0 KB/sec)
[INFO] Downloading: https://repo.maven.apache.org/maven2/com/pff/java-libpst/0.8.1/java-libpst-0.8.1.jar
[INFO] Downloaded: https://repo.maven.apache.org/maven2/org/gagravarr/vorbis-java-core/0.8/vorbis-java-core-0.8.jar (119 KB at 67.3 KB/sec)
[INFO] Downloading: https://repo.maven.apache.org/maven2/com/github/junrar/junrar/2.0.0/junrar-2.0.0.jar
[INFO] Downloaded: https://repo.maven.apache.org/maven2/com/googlecode/juniversalchardet/juniversalchardet/1.0.3/juniversalchardet-1.0.3.jar (216 KB at 121.6 KB/sec)
[INFO] Downloading: https://repo.maven.apache.org/maven2/org/apache/cxf/cxf-rt-rs-client/3.2.6/cxf-rt-rs-client-3.2.6.jar
[INFO] Downloaded: https://repo.maven.apache.org/maven2/com/pff/java-libpst/0.8.1/java-libpst-0.8.1.jar (84 KB at 47.0 KB/sec)
[INFO] Downloading: https://repo.maven.apache.org/maven2/org/apache/cxf/cxf-rt-transports-http/3.2.6/cxf-rt-transports-http-3.2.6.jar
[INFO] Downloaded: https://repo.maven.apache.org/maven2/org/codelibs/jhighlight/1.0.3/jhighlight-1.0.3.jar (229 KB at 128.7 KB/sec)
[INFO] Downloading: https://repo.maven.apache.org/maven2/org/apache/cxf/cxf-core/3.2.6/cxf-core-3.2.6.jar
[INFO] Downloaded: https://repo.maven.apache.org/maven2/org/apache/poi/poi-ooxml-schemas/4.0.0/poi-ooxml-schemas-4.0.0.jar (6326 KB at 3559.7 KB/sec)
[INFO] Downloading: https://repo.maven.apache.org/maven2/com/fasterxml/woodstox/woodstox-core/5.1.0/woodstox-core-5.1.0.jar
[INFO] Downloaded: https://repo.maven.apache.org/maven2/com/github/junrar/junrar/2.0.0/junrar-2.0.0.jar (160 KB at 89.9 KB/sec)
[INFO] Downloading: https://repo.maven.apache.org/maven2/org/codehaus/woodstox/stax2-api/4.1/stax2-api-4.1.jar
[INFO] Downloaded: https://repo.maven.apache.org/maven2/org/apache/cxf/cxf-rt-rs-client/3.2.6/cxf-rt-rs-client-3.2.6.jar (176 KB at 97.7 KB/sec)
[INFO] Downloading: https://repo.maven.apache.org/maven2/org/apache/ws/xmlschema/xmlschema-core/2.2.3/xmlschema-core-2.2.3.jar
[INFO] Downloaded: https://repo.maven.apache.org/maven2/org/codehaus/woodstox/stax2-api/4.1/stax2-api-4.1.jar (166 KB at 92.1 KB/sec)
[INFO] Downloading: https://repo.maven.apache.org/maven2/org/apache/cxf/cxf-rt-frontend-jaxrs/3.2.6/cxf-rt-frontend-jaxrs-3.2.6.jar
[INFO] Downloaded: https://repo.maven.apache.org/maven2/org/apache/cxf/cxf-rt-transports-http/3.2.6/cxf-rt-transports-http-3.2.6.jar (355 KB at 196.6 KB/sec)
[INFO] Downloading: https://repo.maven.apache.org/maven2/javax/ws/rs/javax.ws.rs-api/2.1/javax.ws.rs-api-2.1.jar
[INFO] Downloaded: https://repo.maven.apache.org/maven2/com/fasterxml/woodstox/woodstox-core/5.1.0/woodstox-core-5.1.0.jar (502 KB at 277.1 KB/sec)
[INFO] Downloading: https://repo.maven.apache.org/maven2/javax/annotation/javax.annotation-api/1.3/javax.annotation-api-1.3.jar
[INFO] Downloaded: https://repo.maven.apache.org/maven2/javax/ws/rs/javax.ws.rs-api/2.1/javax.ws.rs-api-2.1.jar (125 KB at 68.5 KB/sec)
[INFO] Downloading: https://repo.maven.apache.org/maven2/org/apache/commons/commons-exec/1.3/commons-exec-1.3.jar
[INFO] Downloaded: https://repo.maven.apache.org/maven2/org/apache/ws/xmlschema/xmlschema-core/2.2.3/xmlschema-core-2.2.3.jar (169 KB at 92.8 KB/sec)
[INFO] Downloading: https://repo.maven.apache.org/maven2/org/apache/opennlp/opennlp-tools/1.9.0/opennlp-tools-1.9.0.jar
[INFO] Downloaded: https://repo.maven.apache.org/maven2/javax/annotation/javax.annotation-api/1.3/javax.annotation-api-1.3.jar (26 KB at 14.1 KB/sec)
[INFO] Downloading: https://repo.maven.apache.org/maven2/com/googlecode/json-simple/json-simple/1.1.1/json-simple-1.1.1.jar
[INFO] Downloaded: https://repo.maven.apache.org/maven2/org/apache/commons/commons-exec/1.3/commons-exec-1.3.jar (54 KB at 29.0 KB/sec)
[INFO] Downloading: https://repo.maven.apache.org/maven2/com/github/openjson/openjson/1.0.10/openjson-1.0.10.jar
[INFO] Downloaded: https://repo.maven.apache.org/maven2/com/googlecode/json-simple/json-simple/1.1.1/json-simple-1.1.1.jar (24 KB at 12.7 KB/sec)
[INFO] Downloading: https://repo.maven.apache.org/maven2/com/google/code/gson/gson/2.8.5/gson-2.8.5.jar
[INFO] Downloaded: https://repo.maven.apache.org/maven2/org/apache/cxf/cxf-rt-frontend-jaxrs/3.2.6/cxf-rt-frontend-jaxrs-3.2.6.jar (665 KB at 360.8 KB/sec)
[INFO] Downloading: https://repo.maven.apache.org/maven2/org/slf4j/jul-to-slf4j/1.7.25/jul-to-slf4j-1.7.25.jar
[INFO] Downloaded: https://repo.maven.apache.org/maven2/com/github/openjson/openjson/1.0.10/openjson-1.0.10.jar (27 KB at 14.4 KB/sec)
[INFO] Downloading: https://repo.maven.apache.org/maven2/edu/ucar/netcdf4/4.5.5/netcdf4-4.5.5.jar
[INFO] Downloaded: https://repo.maven.apache.org/maven2/org/apache/cxf/cxf-core/3.2.6/cxf-core-3.2.6.jar (1368 KB at 738.0 KB/sec)
[INFO] Downloading: https://repo.maven.apache.org/maven2/edu/ucar/grib/4.5.5/grib-4.5.5.jar
[INFO] Downloaded: https://repo.maven.apache.org/maven2/org/slf4j/jul-to-slf4j/1.7.25/jul-to-slf4j-1.7.25.jar (5 KB at 2.4 KB/sec)
[INFO] Downloading: https://repo.maven.apache.org/maven2/com/google/protobuf/protobuf-java/2.5.0/protobuf-java-2.5.0.jar
[INFO] Downloaded: https://repo.maven.apache.org/maven2/com/google/code/gson/gson/2.8.5/gson-2.8.5.jar (236 KB at 126.8 KB/sec)
[INFO] Downloading: https://repo.maven.apache.org/maven2/org/itadaki/bzip2/0.9.1/bzip2-0.9.1.jar
[INFO] Downloaded: https://repo.maven.apache.org/maven2/edu/ucar/netcdf4/4.5.5/netcdf4-4.5.5.jar (61 KB at 32.5 KB/sec)
[INFO] Downloading: https://repo.maven.apache.org/maven2/net/java/dev/jna/jna/4.3.0/jna-4.3.0.jar
[INFO] Downloaded: https://repo.maven.apache.org/maven2/org/itadaki/bzip2/0.9.1/bzip2-0.9.1.jar (49 KB at 25.9 KB/sec)
[INFO] Downloading: https://repo.maven.apache.org/maven2/org/jsoup/jsoup/1.11.3/jsoup-1.11.3.jar
[INFO] Downloaded: https://repo.maven.apache.org/maven2/com/google/protobuf/protobuf-java/2.5.0/protobuf-java-2.5.0.jar (521 KB at 276.5 KB/sec)
[INFO] Downloading: https://repo.maven.apache.org/maven2/edu/ucar/cdm/4.5.5/cdm-4.5.5.jar
[INFO] Downloaded: https://repo.maven.apache.org/maven2/org/apache/opennlp/opennlp-tools/1.9.0/opennlp-tools-1.9.0.jar (1217 KB at 643.7 KB/sec)
[INFO] Downloading: https://repo.maven.apache.org/maven2/edu/ucar/udunits/4.5.5/udunits-4.5.5.jar
[INFO] Downloaded: https://repo.maven.apache.org/maven2/org/jsoup/jsoup/1.11.3/jsoup-1.11.3.jar (387 KB at 202.9 KB/sec)
[INFO] Downloading: https://repo.maven.apache.org/maven2/joda-time/joda-time/2.2/joda-time-2.2.jar
[INFO] Downloaded: https://repo.maven.apache.org/maven2/edu/ucar/udunits/4.5.5/udunits-4.5.5.jar (122 KB at 63.9 KB/sec)
[INFO] Downloading: https://repo.maven.apache.org/maven2/net/sf/ehcache/ehcache-core/2.6.2/ehcache-core-2.6.2.jar
[INFO] Downloaded: https://repo.maven.apache.org/maven2/net/java/dev/jna/jna/4.3.0/jna-4.3.0.jar (924 KB at 482.2 KB/sec)
[INFO] Downloading: https://repo.maven.apache.org/maven2/edu/ucar/httpservices/4.5.5/httpservices-4.5.5.jar
[INFO] Downloaded: https://repo.maven.apache.org/maven2/edu/ucar/httpservices/4.5.5/httpservices-4.5.5.jar (61 KB at 31.0 KB/sec)
[INFO] Downloading: https://repo.maven.apache.org/maven2/org/apache/commons/commons-csv/1.5/commons-csv-1.5.jar
[INFO] Downloaded: https://repo.maven.apache.org/maven2/joda-time/joda-time/2.2/joda-time-2.2.jar (561 KB at 289.6 KB/sec)
[INFO] Downloading: https://repo.maven.apache.org/maven2/org/apache/sis/core/sis-utility/0.8/sis-utility-0.8.jar
[INFO] Downloaded: https://repo.maven.apache.org/maven2/org/apache/commons/commons-csv/1.5/commons-csv-1.5.jar (41 KB at 20.8 KB/sec)
[INFO] Downloading: https://repo.maven.apache.org/maven2/javax/measure/unit-api/1.0/unit-api-1.0.jar
[INFO] Downloaded: https://repo.maven.apache.org/maven2/net/sf/ehcache/ehcache-core/2.6.2/ehcache-core-2.6.2.jar (1307 KB at 665.7 KB/sec)
[INFO] Downloading: https://repo.maven.apache.org/maven2/org/apache/sis/storage/sis-netcdf/0.8/sis-netcdf-0.8.jar
[INFO] Downloaded: https://repo.maven.apache.org/maven2/javax/measure/unit-api/1.0/unit-api-1.0.jar (28 KB at 13.8 KB/sec)
[INFO] Downloading: https://repo.maven.apache.org/maven2/org/apache/sis/storage/sis-storage/0.8/sis-storage-0.8.jar
[INFO] Downloaded: https://repo.maven.apache.org/maven2/org/apache/sis/core/sis-utility/0.8/sis-utility-0.8.jar (813 KB at 410.2 KB/sec)
[INFO] Downloading: https://repo.maven.apache.org/maven2/org/apache/sis/core/sis-feature/0.8/sis-feature-0.8.jar
[INFO] Downloaded: https://repo.maven.apache.org/maven2/org/apache/sis/storage/sis-netcdf/0.8/sis-netcdf-0.8.jar (72 KB at 35.9 KB/sec)
[INFO] Downloading: https://repo.maven.apache.org/maven2/org/apache/sis/core/sis-referencing/0.8/sis-referencing-0.8.jar
[INFO] Downloaded: https://repo.maven.apache.org/maven2/org/apache/sis/storage/sis-storage/0.8/sis-storage-0.8.jar (189 KB at 94.4 KB/sec)
[INFO] Downloading: https://repo.maven.apache.org/maven2/org/apache/sis/core/sis-metadata/0.8/sis-metadata-0.8.jar
[INFO] Downloaded: https://repo.maven.apache.org/maven2/org/apache/sis/core/sis-feature/0.8/sis-feature-0.8.jar (141 KB at 70.4 KB/sec)
[INFO] Downloading: https://repo.maven.apache.org/maven2/org/opengis/geoapi/3.0.1/geoapi-3.0.1.jar
[INFO] Downloaded: https://repo.maven.apache.org/maven2/edu/ucar/cdm/4.5.5/cdm-4.5.5.jar (4084 KB at 2023.7 KB/sec)
[INFO] Downloading: https://repo.maven.apache.org/maven2/edu/usc/ir/sentiment-analysis-parser/0.1/sentiment-analysis-parser-0.1.jar
[INFO] Downloaded: https://repo.maven.apache.org/maven2/org/opengis/geoapi/3.0.1/geoapi-3.0.1.jar (212 KB at 104.4 KB/sec)
[INFO] Downloading: https://repo.maven.apache.org/maven2/org/apache/uima/uimafit-core/2.2.0/uimafit-core-2.2.0.jar
[INFO] Downloaded: https://repo.maven.apache.org/maven2/edu/usc/ir/sentiment-analysis-parser/0.1/sentiment-analysis-parser-0.1.jar (29 KB at 13.8 KB/sec)
[INFO] Downloading: https://repo.maven.apache.org/maven2/org/apache/uima/uimaj-core/2.9.0/uimaj-core-2.9.0.jar
[INFO] Downloaded: https://repo.maven.apache.org/maven2/org/apache/sis/core/sis-referencing/0.8/sis-referencing-0.8.jar (1093 KB at 537.2 KB/sec)
[INFO] Downloading: https://repo.maven.apache.org/maven2/org/jdom/jdom2/2.0.6/jdom2-2.0.6.jar
[INFO] Downloaded: https://repo.maven.apache.org/maven2/org/apache/uima/uimafit-core/2.2.0/uimafit-core-2.2.0.jar (168 KB at 81.9 KB/sec)
[INFO] Downloading: https://repo.maven.apache.org/maven2/org/apache/pdfbox/jbig2-imageio/3.0.2/jbig2-imageio-3.0.2.jar
[INFO] Downloaded: https://repo.maven.apache.org/maven2/org/apache/sis/core/sis-metadata/0.8/sis-metadata-0.8.jar (628 KB at 305.8 KB/sec)
[INFO] Downloading: https://repo.maven.apache.org/maven2/com/github/jai-imageio/jai-imageio-core/1.4.0/jai-imageio-core-1.4.0.jar
[INFO] Downloaded: https://repo.maven.apache.org/maven2/org/jdom/jdom2/2.0.6/jdom2-2.0.6.jar (298 KB at 144.7 KB/sec)
[INFO] Downloading: https://repo.maven.apache.org/maven2/com/google/guava/guava/15.0/guava-15.0.jar
[INFO] Downloaded: https://repo.maven.apache.org/maven2/org/apache/pdfbox/jbig2-imageio/3.0.2/jbig2-imageio-3.0.2.jar (149 KB at 71.3 KB/sec)
[INFO] Downloading: https://repo.maven.apache.org/maven2/io/dropwizard/metrics/metrics-core/3.2.6/metrics-core-3.2.6.jar
[INFO] Downloaded: https://repo.maven.apache.org/maven2/com/github/jai-imageio/jai-imageio-core/1.4.0/jai-imageio-core-1.4.0.jar (614 KB at 291.8 KB/sec)
[INFO] Downloaded: https://repo.maven.apache.org/maven2/io/dropwizard/metrics/metrics-core/3.2.6/metrics-core-3.2.6.jar (134 KB at 63.4 KB/sec)
[INFO] Downloading: https://repo.maven.apache.org/maven2/org/apache/jackrabbit/jackrabbit-api/2.16.3/jackrabbit-api-2.16.3.jar
[INFO] Downloading: https://repo.maven.apache.org/maven2/org/jetbrains/annotations/16.0.2/annotations-16.0.2.jar
[INFO] Downloaded: https://repo.maven.apache.org/maven2/org/apache/uima/uimaj-core/2.9.0/uimaj-core-2.9.0.jar (1554 KB at 736.0 KB/sec)
[INFO] Downloading: https://repo.maven.apache.org/maven2/org/apache/jackrabbit/jackrabbit-data/2.16.3/jackrabbit-data-2.16.3.jar
[INFO] Downloaded: https://repo.maven.apache.org/maven2/org/apache/jackrabbit/jackrabbit-api/2.16.3/jackrabbit-api-2.16.3.jar (42 KB at 19.6 KB/sec)
[INFO] Downloading: https://repo.maven.apache.org/maven2/org/apache/jackrabbit/jackrabbit-jcr-commons/2.16.3/jackrabbit-jcr-commons-2.16.3.jar
[INFO] Downloaded: https://repo.maven.apache.org/maven2/org/jetbrains/annotations/16.0.2/annotations-16.0.2.jar (19 KB at 8.5 KB/sec)
[INFO] Downloading: https://repo.maven.apache.org/maven2/org/apache/jackrabbit/jackrabbit-jcr-rmi/2.16.3/jackrabbit-jcr-rmi-2.16.3.jar
[INFO] Downloaded: https://repo.maven.apache.org/maven2/edu/ucar/grib/4.5.5/grib-4.5.5.jar (5007 KB at 2347.1 KB/sec)
[INFO] Downloading: https://repo.maven.apache.org/maven2/org/apache/jackrabbit/jackrabbit-spi-commons/2.16.3/jackrabbit-spi-commons-2.16.3.jar
[INFO] Downloaded: https://repo.maven.apache.org/maven2/org/apache/jackrabbit/jackrabbit-data/2.16.3/jackrabbit-data-2.16.3.jar (169 KB at 79.2 KB/sec)
[INFO] Downloading: https://repo.maven.apache.org/maven2/org/apache/jackrabbit/jackrabbit-spi/2.16.3/jackrabbit-spi-2.16.3.jar
[INFO] Downloaded: https://repo.maven.apache.org/maven2/com/google/guava/guava/15.0/guava-15.0.jar (2122 KB at 988.5 KB/sec)
[INFO] Downloading: https://repo.maven.apache.org/maven2/org/apache/jackrabbit/jackrabbit-webdav/2.16.3/jackrabbit-webdav-2.16.3.jar
[INFO] Downloaded: https://repo.maven.apache.org/maven2/org/apache/jackrabbit/jackrabbit-jcr-rmi/2.16.3/jackrabbit-jcr-rmi-2.16.3.jar (227 KB at 105.4 KB/sec)
[INFO] Downloading: https://repo.maven.apache.org/maven2/org/apache/sling/org.apache.sling.commons.metrics/1.2.6/org.apache.sling.commons.metrics-1.2.6.jar
[INFO] Downloaded: https://repo.maven.apache.org/maven2/org/apache/jackrabbit/jackrabbit-spi/2.16.3/jackrabbit-spi-2.16.3.jar (28 KB at 13.0 KB/sec)
[INFO] Downloading: https://repo.maven.apache.org/maven2/org/apache/sling/org.apache.sling.jcr.api/2.4.0/org.apache.sling.jcr.api-2.4.0.jar
[INFO] Downloaded: https://repo.maven.apache.org/maven2/org/apache/jackrabbit/jackrabbit-jcr-commons/2.16.3/jackrabbit-jcr-commons-2.16.3.jar (394 KB at 182.6 KB/sec)
[INFO] Downloading: https://repo.maven.apache.org/maven2/org/apache/sling/org.apache.sling.jcr.base/3.0.4/org.apache.sling.jcr.base-3.0.4.jar
[INFO] Downloaded: https://repo.maven.apache.org/maven2/org/apache/sling/org.apache.sling.jcr.api/2.4.0/org.apache.sling.jcr.api-2.4.0.jar (14 KB at 6.1 KB/sec)
[INFO] Downloading: https://repo.maven.apache.org/maven2/org/apache/sling/org.apache.sling.jcr.davex/1.3.10/org.apache.sling.jcr.davex-1.3.10.jar
[INFO] Downloaded: https://repo.maven.apache.org/maven2/org/apache/sling/org.apache.sling.commons.metrics/1.2.6/org.apache.sling.commons.metrics-1.2.6.jar (63 KB at 29.1 KB/sec)
[INFO] Downloading: https://repo.maven.apache.org/maven2/org/apache/sling/org.apache.sling.jcr.jackrabbit.accessmanager/3.0.2/org.apache.sling.jcr.jackrabbit.accessmanager-3.0.2.jar
[INFO] Downloaded: https://repo.maven.apache.org/maven2/org/apache/jackrabbit/jackrabbit-spi-commons/2.16.3/jackrabbit-spi-commons-2.16.3.jar (785 KB at 361.8 KB/sec)
[INFO] Downloading: https://repo.maven.apache.org/maven2/org/apache/sling/org.apache.sling.jcr.jackrabbit.usermanager/2.2.8/org.apache.sling.jcr.jackrabbit.usermanager-2.2.8.jar
[INFO] Downloaded: https://repo.maven.apache.org/maven2/org/apache/sling/org.apache.sling.jcr.base/3.0.4/org.apache.sling.jcr.base-3.0.4.jar (60 KB at 27.2 KB/sec)
[INFO] Downloading: https://repo.maven.apache.org/maven2/org/apache/sling/org.apache.sling.jcr.jcr-wrapper/2.0.0/org.apache.sling.jcr.jcr-wrapper-2.0.0.jar
[INFO] Downloaded: https://repo.maven.apache.org/maven2/org/apache/jackrabbit/jackrabbit-webdav/2.16.3/jackrabbit-webdav-2.16.3.jar (319 KB at 146.4 KB/sec)
[INFO] Downloading: https://repo.maven.apache.org/maven2/org/apache/sling/org.apache.sling.jcr.registration/1.0.6/org.apache.sling.jcr.registration-1.0.6.jar
[INFO] Downloaded: https://repo.maven.apache.org/maven2/org/apache/sling/org.apache.sling.jcr.jackrabbit.accessmanager/3.0.2/org.apache.sling.jcr.jackrabbit.accessmanager-3.0.2.jar (51 KB at 23.0 KB/sec)
[INFO] Downloading: https://repo.maven.apache.org/maven2/org/apache/sling/org.apache.sling.jcr.webconsole/1.0.2/org.apache.sling.jcr.webconsole-1.0.2.jar
[INFO] Downloaded: https://repo.maven.apache.org/maven2/org/apache/sling/org.apache.sling.jcr.jackrabbit.usermanager/2.2.8/org.apache.sling.jcr.jackrabbit.usermanager-2.2.8.jar (94 KB at 42.6 KB/sec)
[INFO] Downloading: https://repo.maven.apache.org/maven2/org/apache/sling/org.apache.sling.jcr.webdav/2.3.8/org.apache.sling.jcr.webdav-2.3.8.jar
[INFO] Downloaded: https://repo.maven.apache.org/maven2/org/apache/sling/org.apache.sling.jcr.davex/1.3.10/org.apache.sling.jcr.davex-1.3.10.jar (268 KB at 121.8 KB/sec)
[INFO] Downloading: https://repo.maven.apache.org/maven2/org/apache/sling/org.apache.sling.caconfig.api/1.1.2/org.apache.sling.caconfig.api-1.1.2.jar
[INFO] Downloaded: https://repo.maven.apache.org/maven2/org/apache/sling/org.apache.sling.jcr.registration/1.0.6/org.apache.sling.jcr.registration-1.0.6.jar (33 KB at 14.8 KB/sec)
[INFO] Downloading: https://repo.maven.apache.org/maven2/org/apache/sling/org.apache.sling.caconfig.impl/1.4.14/org.apache.sling.caconfig.impl-1.4.14.jar
[INFO] Downloaded: https://repo.maven.apache.org/maven2/org/apache/sling/org.apache.sling.jcr.jcr-wrapper/2.0.0/org.apache.sling.jcr.jcr-wrapper-2.0.0.jar (73 KB at 33.1 KB/sec)
[INFO] Downloading: https://repo.maven.apache.org/maven2/org/apache/sling/org.apache.sling.caconfig.spi/1.3.4/org.apache.sling.caconfig.spi-1.3.4.jar
[INFO] Downloaded: https://repo.maven.apache.org/maven2/org/apache/sling/org.apache.sling.caconfig.api/1.1.2/org.apache.sling.caconfig.api-1.1.2.jar (13 KB at 5.7 KB/sec)
[INFO] Downloading: https://repo.maven.apache.org/maven2/org/apache/sling/org.apache.sling.discovery.api/1.0.4/org.apache.sling.discovery.api-1.0.4.jar
[INFO] Downloaded: https://repo.maven.apache.org/maven2/org/apache/sling/org.apache.sling.jcr.webdav/2.3.8/org.apache.sling.jcr.webdav-2.3.8.jar (163 KB at 73.4 KB/sec)
[INFO] Downloading: https://repo.maven.apache.org/maven2/org/apache/sling/org.apache.sling.discovery.base/2.0.8/org.apache.sling.discovery.base-2.0.8.jar
[INFO] Downloaded: https://repo.maven.apache.org/maven2/org/apache/sling/org.apache.sling.jcr.webconsole/1.0.2/org.apache.sling.jcr.webconsole-1.0.2.jar (20 KB at 8.6 KB/sec)
[INFO] Downloading: https://repo.maven.apache.org/maven2/org/apache/sling/org.apache.sling.discovery.commons/1.0.20/org.apache.sling.discovery.commons-1.0.20.jar
[INFO] Downloaded: https://repo.maven.apache.org/maven2/org/apache/sling/org.apache.sling.caconfig.spi/1.3.4/org.apache.sling.caconfig.spi-1.3.4.jar (26 KB at 11.5 KB/sec)
[INFO] Downloading: https://repo.maven.apache.org/maven2/org/apache/sling/org.apache.sling.discovery.oak/1.2.28/org.apache.sling.discovery.oak-1.2.28.jar
[INFO] Downloaded: https://repo.maven.apache.org/maven2/org/apache/sling/org.apache.sling.caconfig.impl/1.4.14/org.apache.sling.caconfig.impl-1.4.14.jar (201 KB at 90.3 KB/sec)
[INFO] Downloading: https://repo.maven.apache.org/maven2/org/apache/sling/org.apache.sling.discovery.support/1.0.4/org.apache.sling.discovery.support-1.0.4.jar
[INFO] Downloaded: https://repo.maven.apache.org/maven2/org/apache/sling/org.apache.sling.discovery.base/2.0.8/org.apache.sling.discovery.base-2.0.8.jar (84 KB at 37.3 KB/sec)
[INFO] Downloading: https://repo.maven.apache.org/maven2/org/apache/sling/org.apache.sling.event.dea/1.1.2/org.apache.sling.event.dea-1.1.2.jar
[INFO] Downloaded: https://repo.maven.apache.org/maven2/org/apache/sling/org.apache.sling.discovery.api/1.0.4/org.apache.sling.discovery.api-1.0.4.jar (14 KB at 5.9 KB/sec)
[INFO] Downloaded: https://repo.maven.apache.org/maven2/org/apache/sling/org.apache.sling.discovery.commons/1.0.20/org.apache.sling.discovery.commons-1.0.20.jar (91 KB at 40.6 KB/sec)
[INFO] Downloading: https://repo.maven.apache.org/maven2/org/apache/sling/org.apache.sling.event/4.2.12/org.apache.sling.event-4.2.12.jar
[INFO] Downloading: https://repo.maven.apache.org/maven2/org/apache/sling/org.apache.sling.event.api/1.0.0/org.apache.sling.event.api-1.0.0.jar
[INFO] Downloaded: https://repo.maven.apache.org/maven2/org/apache/sling/org.apache.sling.discovery.oak/1.2.28/org.apache.sling.discovery.oak-1.2.28.jar (75 KB at 33.5 KB/sec)
[INFO] Downloaded: https://repo.maven.apache.org/maven2/org/apache/sling/org.apache.sling.discovery.support/1.0.4/org.apache.sling.discovery.support-1.0.4.jar (14 KB at 5.9 KB/sec)
[INFO] Downloading: https://repo.maven.apache.org/maven2/org/apache/sling/org.apache.sling.validation.api/1.0.0/org.apache.sling.validation.api-1.0.0.jar
[INFO] Downloading: https://repo.maven.apache.org/maven2/org/apache/sling/org.apache.sling.validation.core/1.0.4/org.apache.sling.validation.core-1.0.4.jar
[INFO] Downloaded: https://repo.maven.apache.org/maven2/org/apache/sling/org.apache.sling.event.api/1.0.0/org.apache.sling.event.api-1.0.0.jar (26 KB at 11.3 KB/sec)
[INFO] Downloaded: https://repo.maven.apache.org/maven2/org/apache/sling/org.apache.sling.event.dea/1.1.2/org.apache.sling.event.dea-1.1.2.jar (29 KB at 12.7 KB/sec)
[INFO] Downloading: https://repo.maven.apache.org/maven2/org/apache/sling/org.apache.sling.sample.slingshot/0.9.0/org.apache.sling.sample.slingshot-0.9.0.jar
[INFO] Downloading: https://repo.maven.apache.org/maven2/org/apache/felix/org.apache.felix.http.jetty/4.0.6/org.apache.felix.http.jetty-4.0.6.jar
[INFO] Downloaded: https://repo.maven.apache.org/maven2/org/apache/sling/org.apache.sling.validation.core/1.0.4/org.apache.sling.validation.core-1.0.4.jar (67 KB at 29.6 KB/sec)
[INFO] Downloading: https://repo.maven.apache.org/maven2/org/eclipse/jetty/jetty-servlet/9.4.12.v20180830/jetty-servlet-9.4.12.v20180830.jar
[INFO] Downloaded: https://repo.maven.apache.org/maven2/org/apache/sling/org.apache.sling.validation.api/1.0.0/org.apache.sling.validation.api-1.0.0.jar (21 KB at 9.0 KB/sec)
[INFO] Downloading: https://repo.maven.apache.org/maven2/org/eclipse/jetty/jetty-server/9.4.12.v20180830/jetty-server-9.4.12.v20180830.jar
[INFO] Downloaded: https://repo.maven.apache.org/maven2/org/apache/sling/org.apache.sling.event/4.2.12/org.apache.sling.event-4.2.12.jar (315 KB at 139.5 KB/sec)
[INFO] Downloading: https://repo.maven.apache.org/maven2/javax/servlet/javax.servlet-api/3.1.0/javax.servlet-api-3.1.0.jar
[INFO] Downloaded: https://repo.maven.apache.org/maven2/org/eclipse/jetty/jetty-servlet/9.4.12.v20180830/jetty-servlet-9.4.12.v20180830.jar (109 KB at 47.7 KB/sec)
[INFO] Downloading: https://repo.maven.apache.org/maven2/org/eclipse/jetty/jetty-http/9.4.12.v20180830/jetty-http-9.4.12.v20180830.jar
[INFO] Downloaded: https://repo.maven.apache.org/maven2/javax/servlet/javax.servlet-api/3.1.0/javax.servlet-api-3.1.0.jar (94 KB at 41.0 KB/sec)
[INFO] Downloading: https://repo.maven.apache.org/maven2/org/eclipse/jetty/jetty-io/9.4.12.v20180830/jetty-io-9.4.12.v20180830.jar
[INFO] Downloaded: https://repo.maven.apache.org/maven2/org/eclipse/jetty/jetty-server/9.4.12.v20180830/jetty-server-9.4.12.v20180830.jar (596 KB at 259.9 KB/sec)
[INFO] Downloading: https://repo.maven.apache.org/maven2/org/eclipse/jetty/jetty-util/9.4.12.v20180830/jetty-util-9.4.12.v20180830.jar
[INFO] Downloaded: https://repo.maven.apache.org/maven2/org/eclipse/jetty/jetty-http/9.4.12.v20180830/jetty-http-9.4.12.v20180830.jar (192 KB at 83.1 KB/sec)
[INFO] Downloading: https://repo.maven.apache.org/maven2/org/eclipse/jetty/jetty-jmx/9.4.12.v20180830/jetty-jmx-9.4.12.v20180830.jar
[INFO] Downloaded: https://repo.maven.apache.org/maven2/org/eclipse/jetty/jetty-io/9.4.12.v20180830/jetty-io-9.4.12.v20180830.jar (137 KB at 59.0 KB/sec)
[INFO] Downloading: https://repo.maven.apache.org/maven2/org/eclipse/jetty/jetty-security/9.4.12.v20180830/jetty-security-9.4.12.v20180830.jar
[INFO] Downloaded: https://repo.maven.apache.org/maven2/org/eclipse/jetty/jetty-jmx/9.4.12.v20180830/jetty-jmx-9.4.12.v20180830.jar (25 KB at 10.7 KB/sec)
[INFO] Downloading: https://repo.maven.apache.org/maven2/org/eclipse/jetty/jetty-webapp/9.4.12.v20180830/jetty-webapp-9.4.12.v20180830.jar
[INFO] Downloaded: https://repo.maven.apache.org/maven2/org/eclipse/jetty/jetty-util/9.4.12.v20180830/jetty-util-9.4.12.v20180830.jar (492 KB at 211.3 KB/sec)
[INFO] Downloading: https://repo.maven.apache.org/maven2/org/eclipse/jetty/jetty-xml/9.4.12.v20180830/jetty-xml-9.4.12.v20180830.jar
[INFO] Downloaded: https://repo.maven.apache.org/maven2/org/eclipse/jetty/jetty-security/9.4.12.v20180830/jetty-security-9.4.12.v20180830.jar (91 KB at 39.1 KB/sec)
[INFO] Downloading: https://repo.maven.apache.org/maven2/org/eclipse/jetty/websocket/websocket-servlet/9.4.12.v20180830/websocket-servlet-9.4.12.v20180830.jar
[INFO] Downloaded: https://repo.maven.apache.org/maven2/org/eclipse/jetty/jetty-webapp/9.4.12.v20180830/jetty-webapp-9.4.12.v20180830.jar (126 KB at 53.8 KB/sec)
[INFO] Downloading: https://repo.maven.apache.org/maven2/org/eclipse/jetty/websocket/websocket-api/9.4.12.v20180830/websocket-api-9.4.12.v20180830.jar
[INFO] Downloaded: https://repo.maven.apache.org/maven2/org/eclipse/jetty/websocket/websocket-servlet/9.4.12.v20180830/websocket-servlet-9.4.12.v20180830.jar (21 KB at 8.9 KB/sec)
[INFO] Downloading: https://repo.maven.apache.org/maven2/org/eclipse/jetty/websocket/websocket-server/9.4.12.v20180830/websocket-server-9.4.12.v20180830.jar
[INFO] Downloaded: https://repo.maven.apache.org/maven2/org/eclipse/jetty/jetty-xml/9.4.12.v20180830/jetty-xml-9.4.12.v20180830.jar (51 KB at 21.6 KB/sec)
[INFO] Downloading: https://repo.maven.apache.org/maven2/org/eclipse/jetty/websocket/websocket-common/9.4.12.v20180830/websocket-common-9.4.12.v20180830.jar
[INFO] Downloaded: https://repo.maven.apache.org/maven2/org/eclipse/jetty/websocket/websocket-api/9.4.12.v20180830/websocket-api-9.4.12.v20180830.jar (43 KB at 18.2 KB/sec)
[INFO] Downloading: https://repo.maven.apache.org/maven2/org/eclipse/jetty/websocket/websocket-client/9.4.12.v20180830/websocket-client-9.4.12.v20180830.jar
[INFO] Downloaded: https://repo.maven.apache.org/maven2/org/eclipse/jetty/websocket/websocket-server/9.4.12.v20180830/websocket-server-9.4.12.v20180830.jar (35 KB at 14.6 KB/sec)
[INFO] Downloading: https://repo.maven.apache.org/maven2/org/eclipse/jetty/jetty-client/9.4.12.v20180830/jetty-client-9.4.12.v20180830.jar
[INFO] Downloaded: https://repo.maven.apache.org/maven2/org/eclipse/jetty/websocket/websocket-client/9.4.12.v20180830/websocket-client-9.4.12.v20180830.jar (36 KB at 14.8 KB/sec)
[INFO] Downloading: https://repo.maven.apache.org/maven2/org/apache/felix/org.apache.felix.http.base/4.0.4/org.apache.felix.http.base-4.0.4.jar
[INFO] Downloaded: https://repo.maven.apache.org/maven2/org/eclipse/jetty/websocket/websocket-common/9.4.12.v20180830/websocket-common-9.4.12.v20180830.jar (193 KB at 80.7 KB/sec)
[INFO] Downloading: https://repo.maven.apache.org/maven2/org/apache/felix/org.apache.felix.http.servlet-api/1.1.2/org.apache.felix.http.servlet-api-1.1.2.jar
[INFO] Downloaded: https://repo.maven.apache.org/maven2/org/apache/felix/org.apache.felix.http.jetty/4.0.6/org.apache.felix.http.jetty-4.0.6.jar (2911 KB at 1217.1 KB/sec)
[INFO] Downloading: https://repo.maven.apache.org/maven2/org/apache/tomcat/tomcat-servlet-api/8.0.9/tomcat-servlet-api-8.0.9.jar
[INFO] Downloaded: https://repo.maven.apache.org/maven2/org/eclipse/jetty/jetty-client/9.4.12.v20180830/jetty-client-9.4.12.v20180830.jar (274 KB at 113.8 KB/sec)
[INFO] Downloading: https://repo.maven.apache.org/maven2/org/apache/felix/org.apache.felix.http.bridge/4.0.4/org.apache.felix.http.bridge-4.0.4.jar
[INFO] Downloaded: https://repo.maven.apache.org/maven2/org/apache/felix/org.apache.felix.http.servlet-api/1.1.2/org.apache.felix.http.servlet-api-1.1.2.jar (238 KB at 98.1 KB/sec)
[INFO] Downloaded: https://repo.maven.apache.org/maven2/org/apache/tomcat/tomcat-servlet-api/8.0.9/tomcat-servlet-api-8.0.9.jar (239 KB at 98.4 KB/sec)
[INFO] Downloaded: https://repo.maven.apache.org/maven2/org/apache/felix/org.apache.felix.http.bridge/4.0.4/org.apache.felix.http.bridge-4.0.4.jar (493 KB at 201.3 KB/sec)
[INFO] Downloaded: https://repo.maven.apache.org/maven2/org/apache/sling/org.apache.sling.sample.slingshot/0.9.0/org.apache.sling.sample.slingshot-0.9.0.jar (4952 KB at 2005.5 KB/sec)
[INFO] Downloaded: https://repo.maven.apache.org/maven2/org/apache/felix/org.apache.felix.http.base/4.0.4/org.apache.felix.http.base-4.0.4.jar (238 KB at 95.8 KB/sec)
[WARNING] Attempt to (de-)serialize anonymous class hudson.maven.reporters.MavenArtifactArchiver$2; see: https://jenkins.io/redirect/serialization-of-anonymous-classes/
[JENKINS] Archiving disabled
[WARNING] Attempt to (de-)serialize anonymous class hudson.maven.reporters.MavenFingerprinter$1; see: https://jenkins.io/redirect/serialization-of-anonymous-classes/
[JENKINS] Archiving disabled
[INFO] ------------------------------------------------------------------------
[INFO] BUILD FAILURE
[INFO] ------------------------------------------------------------------------
[INFO] Total time: 33.310 s
[INFO] Finished at: 2018-10-21T00:18:22+00:00
[INFO] Final Memory: 33M/4096M
[INFO] ------------------------------------------------------------------------
Waiting for Jenkins to finish collecting data
[ERROR] Failed to execute goal on project org.apache.sling.launchpad.testing: Could not resolve dependencies for project org.apache.sling:org.apache.sling.launchpad.testing:slingstart:12-SNAPSHOT: Could not find artifact org.apache.sling:org.apache.sling.launchpad.integration-tests:jar:12-SNAPSHOT in Nexus (http://repository.apache.org/snapshots) -> [Help 1]
[ERROR] 
[ERROR] To see the full stack trace of the errors, re-run Maven with the -e switch.
[ERROR] Re-run Maven using the -X switch to enable full debug logging.
[ERROR] 
[ERROR] For more information about the errors and possible solutions, please read the following articles:
[ERROR] [Help 1] http://cwiki.apache.org/confluence/display/MAVEN/DependencyResolutionException
channel stopped
Archiving artifacts
Recording test results

Build failed in Jenkins: sling-org-apache-sling-launchpad-testing-10 #194

Posted by Apache Jenkins Server <je...@builds.apache.org>.
See <https://builds.apache.org/job/sling-org-apache-sling-launchpad-testing-10/194/display/redirect>

------------------------------------------
Started by timer
[EnvInject] - Loading node environment variables.
Building remotely on ubuntu-4 (ubuntu trusty) in workspace <https://builds.apache.org/job/sling-org-apache-sling-launchpad-testing-10/ws/>
[WS-CLEANUP] Deleting project workspace...
[WS-CLEANUP] Done
Cloning the remote Git repository
Cloning repository https://github.com/apache/sling-org-apache-sling-launchpad-testing.git
 > git init <https://builds.apache.org/job/sling-org-apache-sling-launchpad-testing-10/ws/> # timeout=10
Fetching upstream changes from https://github.com/apache/sling-org-apache-sling-launchpad-testing.git
 > git --version # timeout=10
 > git fetch --tags --progress https://github.com/apache/sling-org-apache-sling-launchpad-testing.git +refs/heads/*:refs/remotes/origin/*
 > git config remote.origin.url https://github.com/apache/sling-org-apache-sling-launchpad-testing.git # timeout=10
 > git config --add remote.origin.fetch +refs/heads/*:refs/remotes/origin/* # timeout=10
 > git config remote.origin.url https://github.com/apache/sling-org-apache-sling-launchpad-testing.git # timeout=10
Fetching upstream changes from https://github.com/apache/sling-org-apache-sling-launchpad-testing.git
 > git fetch --tags --progress https://github.com/apache/sling-org-apache-sling-launchpad-testing.git +refs/heads/*:refs/remotes/origin/*
 > git rev-parse origin/master^{commit} # timeout=10
Checking out Revision 11a7575dedfad03e7e357506e8a44bc30a7b9de1 (origin/master)
 > git config core.sparsecheckout # timeout=10
 > git checkout -f 11a7575dedfad03e7e357506e8a44bc30a7b9de1
Commit message: "SLING-7935 - Consolidate all 'launchpad-testing' modules into a single git repository"
 > git rev-list --no-walk 11a7575dedfad03e7e357506e8a44bc30a7b9de1 # timeout=10
Parsing POMs
Established TCP socket on 45916
maven33-agent.jar already up to date
maven33-interceptor.jar already up to date
maven3-interceptor-commons.jar already up to date
[sling-org-apache-sling-launchpad-testing-10] $ /home/jenkins/tools/java/latest10/bin/java -Xmx4g -Xms4g -cp /home/jenkins/jenkins-slave/maven33-agent.jar:/home/jenkins/tools/maven/apache-maven-3.3.9/boot/plexus-classworlds-2.5.2.jar:/home/jenkins/tools/maven/apache-maven-3.3.9/conf/logging jenkins.maven3.agent.Maven33Main /home/jenkins/tools/maven/apache-maven-3.3.9 /home/jenkins/jenkins-slave/slave.jar /home/jenkins/jenkins-slave/maven33-interceptor.jar /home/jenkins/jenkins-slave/maven3-interceptor-commons.jar 45916
<===[JENKINS REMOTING CAPACITY]===>   channel started
Executing Maven:  -B -f <https://builds.apache.org/job/sling-org-apache-sling-launchpad-testing-10/ws/pom.xml> -Dmaven.repo.local=/home/jenkins/jenkins-slave/maven-repositories/0 -U clean verify
[INFO] Scanning for projects...
[INFO] Downloading: http://repository.apache.org/snapshots/org/apache/sling/org.apache.sling.launchpad.test-bundles/12-SNAPSHOT/maven-metadata.xml
[INFO] Downloaded: http://repository.apache.org/snapshots/org/apache/sling/org.apache.sling.launchpad.test-bundles/12-SNAPSHOT/maven-metadata.xml (1007 B at 2.3 KB/sec)
[INFO] Downloading: http://repository.apache.org/snapshots/org/apache/sling/org.apache.sling.starter/12-SNAPSHOT/maven-metadata.xml
[INFO] Downloaded: http://repository.apache.org/snapshots/org/apache/sling/org.apache.sling.starter/12-SNAPSHOT/maven-metadata.xml (2 KB at 4.5 KB/sec)
[INFO] Extended Maven classpath (scope 'provided') by the dependencies extracted from the Sling model.
[INFO]                                                                         
[INFO] ------------------------------------------------------------------------
[INFO] Building Apache Sling Launchpad Testing 12-SNAPSHOT
[INFO] ------------------------------------------------------------------------
[INFO] Downloading: http://repository.apache.org/snapshots/org/apache/sling/org.apache.sling.launchpad.integration-tests/12-SNAPSHOT/maven-metadata.xml
[INFO] Downloading: http://repository.apache.org/snapshots/org/apache/sling/org.apache.sling.launchpad.integration-tests/12-SNAPSHOT/org.apache.sling.launchpad.integration-tests-12-SNAPSHOT.pom
[WARNING] The POM for org.apache.sling:org.apache.sling.launchpad.integration-tests:jar:12-SNAPSHOT is missing, no dependency information available
[INFO] Downloading: http://repository.apache.org/snapshots/org/apache/sling/org.apache.sling.launchpad.test-fragment/12-SNAPSHOT/maven-metadata.xml
[INFO] Downloaded: http://repository.apache.org/snapshots/org/apache/sling/org.apache.sling.launchpad.test-fragment/12-SNAPSHOT/maven-metadata.xml (1008 B at 3.0 KB/sec)
[INFO] Downloading: http://repository.apache.org/snapshots/org/apache/sling/org.apache.sling.launchpad.test-services-war/12-SNAPSHOT/maven-metadata.xml
[INFO] Downloaded: http://repository.apache.org/snapshots/org/apache/sling/org.apache.sling.launchpad.test-services-war/12-SNAPSHOT/maven-metadata.xml (1012 B at 2.9 KB/sec)
[INFO] Downloading: http://repository.apache.org/snapshots/org/apache/sling/org.apache.sling.launchpad.test-services/12-SNAPSHOT/maven-metadata.xml
[INFO] Downloaded: http://repository.apache.org/snapshots/org/apache/sling/org.apache.sling.launchpad.test-services/12-SNAPSHOT/maven-metadata.xml (1008 B at 3.0 KB/sec)
[INFO] Downloading: http://repository.apache.org/snapshots/org/apache/sling/org.apache.sling.launchpad.integration-tests/12-SNAPSHOT/org.apache.sling.launchpad.integration-tests-12-SNAPSHOT.jar
[WARNING] Attempt to (de-)serialize anonymous class hudson.maven.reporters.MavenArtifactArchiver$2; see: https://jenkins.io/redirect/serialization-of-anonymous-classes/
[JENKINS] Archiving disabled
[WARNING] Attempt to (de-)serialize anonymous class hudson.maven.reporters.MavenFingerprinter$1; see: https://jenkins.io/redirect/serialization-of-anonymous-classes/
[JENKINS] Archiving disabled
[INFO] ------------------------------------------------------------------------
[INFO] BUILD FAILURE
[INFO] ------------------------------------------------------------------------
[INFO] Total time: 14.797 s
[INFO] Finished at: 2018-10-20T12:48:44+00:00
[INFO] Final Memory: 32M/4096M
[INFO] ------------------------------------------------------------------------
Waiting for Jenkins to finish collecting data
[ERROR] Failed to execute goal on project org.apache.sling.launchpad.testing: Could not resolve dependencies for project org.apache.sling:org.apache.sling.launchpad.testing:slingstart:12-SNAPSHOT: Could not find artifact org.apache.sling:org.apache.sling.launchpad.integration-tests:jar:12-SNAPSHOT in Nexus (http://repository.apache.org/snapshots) -> [Help 1]
[ERROR] 
[ERROR] To see the full stack trace of the errors, re-run Maven with the -e switch.
[ERROR] Re-run Maven using the -X switch to enable full debug logging.
[ERROR] 
[ERROR] For more information about the errors and possible solutions, please read the following articles:
[ERROR] [Help 1] http://cwiki.apache.org/confluence/display/MAVEN/DependencyResolutionException
channel stopped
Archiving artifacts
Recording test results

Build failed in Jenkins: sling-org-apache-sling-launchpad-testing-10 #193

Posted by Apache Jenkins Server <je...@builds.apache.org>.
See <https://builds.apache.org/job/sling-org-apache-sling-launchpad-testing-10/193/display/redirect>

------------------------------------------
[...truncated 16.12 KB...]
[INFO] Downloading: https://repo.maven.apache.org/maven2/org/apache/jackrabbit/oak-store-spi/1.8.8/oak-store-spi-1.8.8.pom
[INFO] Downloaded: https://repo.maven.apache.org/maven2/org/apache/jackrabbit/oak-store-spi/1.8.8/oak-store-spi-1.8.8.pom (6 KB at 294.2 KB/sec)
[INFO] Downloading: https://repo.maven.apache.org/maven2/org/apache/jackrabbit/oak-core/1.8.8/oak-core-1.8.8.pom
[INFO] Downloaded: https://repo.maven.apache.org/maven2/org/apache/jackrabbit/oak-core/1.8.8/oak-core-1.8.8.pom (10 KB at 535.8 KB/sec)
[INFO] Downloading: https://repo.maven.apache.org/maven2/org/apache/jackrabbit/oak-query-spi/1.8.8/oak-query-spi-1.8.8.pom
[INFO] Downloaded: https://repo.maven.apache.org/maven2/org/apache/jackrabbit/oak-query-spi/1.8.8/oak-query-spi-1.8.8.pom (5 KB at 264.2 KB/sec)
[INFO] Downloading: https://repo.maven.apache.org/maven2/org/apache/jackrabbit/oak-security-spi/1.8.8/oak-security-spi-1.8.8.pom
[INFO] Downloaded: https://repo.maven.apache.org/maven2/org/apache/jackrabbit/oak-security-spi/1.8.8/oak-security-spi-1.8.8.pom (7 KB at 343.3 KB/sec)
[INFO] Downloading: https://repo.maven.apache.org/maven2/org/apache/jackrabbit/oak-jcr/1.8.8/oak-jcr-1.8.8.pom
[INFO] Downloaded: https://repo.maven.apache.org/maven2/org/apache/jackrabbit/oak-jcr/1.8.8/oak-jcr-1.8.8.pom (21 KB at 1100.1 KB/sec)
[INFO] Downloading: https://repo.maven.apache.org/maven2/org/apache/jackrabbit/oak-lucene/1.8.8/oak-lucene-1.8.8.pom
[INFO] Downloaded: https://repo.maven.apache.org/maven2/org/apache/jackrabbit/oak-lucene/1.8.8/oak-lucene-1.8.8.pom (18 KB at 969.9 KB/sec)
[INFO] Downloading: https://repo.maven.apache.org/maven2/org/apache/jackrabbit/oak-store-document/1.8.8/oak-store-document-1.8.8.pom
[INFO] Downloaded: https://repo.maven.apache.org/maven2/org/apache/jackrabbit/oak-store-document/1.8.8/oak-store-document-1.8.8.pom (11 KB at 277.6 KB/sec)
[INFO] Downloading: https://repo.maven.apache.org/maven2/org/apache/jackrabbit/oak-store-composite/1.8.8/oak-store-composite-1.8.8.pom
[INFO] Downloaded: https://repo.maven.apache.org/maven2/org/apache/jackrabbit/oak-store-composite/1.8.8/oak-store-composite-1.8.8.pom (6 KB at 266.4 KB/sec)
[INFO] Downloading: https://repo.maven.apache.org/maven2/org/apache/sling/org.apache.sling.jcr.oak.server/1.2.0/org.apache.sling.jcr.oak.server-1.2.0.pom
[INFO] Downloaded: https://repo.maven.apache.org/maven2/org/apache/sling/org.apache.sling.jcr.oak.server/1.2.0/org.apache.sling.jcr.oak.server-1.2.0.pom (9 KB at 319.8 KB/sec)
[INFO] Downloading: https://repo.maven.apache.org/maven2/com/h2database/h2-mvstore/1.4.194/h2-mvstore-1.4.194.pom
[INFO] Downloaded: https://repo.maven.apache.org/maven2/com/h2database/h2-mvstore/1.4.194/h2-mvstore-1.4.194.pom (970 B at 49.9 KB/sec)
[INFO] Downloading: https://repo.maven.apache.org/maven2/org/apache/jackrabbit/oak-segment-tar/1.8.8/oak-segment-tar-1.8.8.pom
[INFO] Downloaded: https://repo.maven.apache.org/maven2/org/apache/jackrabbit/oak-segment-tar/1.8.8/oak-segment-tar-1.8.8.pom (16 KB at 790.2 KB/sec)
[INFO] Downloading: https://repo.maven.apache.org/maven2/org/apache/httpcomponents/httpclient-osgi/4.5.6/httpclient-osgi-4.5.6.pom
[INFO] Downloaded: https://repo.maven.apache.org/maven2/org/apache/httpcomponents/httpclient-osgi/4.5.6/httpclient-osgi-4.5.6.pom (9 KB at 408.6 KB/sec)
[INFO] Downloading: https://repo.maven.apache.org/maven2/org/apache/httpcomponents/fluent-hc/4.5.6/fluent-hc-4.5.6.pom
[INFO] Downloaded: https://repo.maven.apache.org/maven2/org/apache/httpcomponents/fluent-hc/4.5.6/fluent-hc-4.5.6.pom (6 KB at 320.3 KB/sec)
[INFO] Downloading: https://repo.maven.apache.org/maven2/org/apache/httpcomponents/httpcore-osgi/4.4.10/httpcore-osgi-4.4.10.pom
[INFO] Downloaded: https://repo.maven.apache.org/maven2/org/apache/httpcomponents/httpcore-osgi/4.4.10/httpcore-osgi-4.4.10.pom (9 KB at 468.2 KB/sec)
[INFO] Downloading: https://repo.maven.apache.org/maven2/org/apache/servicemix/bundles/org.apache.servicemix.bundles.rhino/1.7.10_1/org.apache.servicemix.bundles.rhino-1.7.10_1.pom
[INFO] Downloaded: https://repo.maven.apache.org/maven2/org/apache/servicemix/bundles/org.apache.servicemix.bundles.rhino/1.7.10_1/org.apache.servicemix.bundles.rhino-1.7.10_1.pom (3 KB at 173.3 KB/sec)
[INFO] Downloading: https://repo.maven.apache.org/maven2/org/apache/sling/org.apache.sling.auth.form/1.0.12/org.apache.sling.auth.form-1.0.12.pom
[INFO] Downloaded: https://repo.maven.apache.org/maven2/org/apache/sling/org.apache.sling.auth.form/1.0.12/org.apache.sling.auth.form-1.0.12.pom (7 KB at 215.8 KB/sec)
[INFO] Downloading: https://repo.maven.apache.org/maven2/org/apache/sling/org.apache.sling.commons.mime/2.2.0/org.apache.sling.commons.mime-2.2.0.pom
[INFO] Downloaded: https://repo.maven.apache.org/maven2/org/apache/sling/org.apache.sling.commons.mime/2.2.0/org.apache.sling.commons.mime-2.2.0.pom (5 KB at 282.3 KB/sec)
[INFO] Downloading: https://repo.maven.apache.org/maven2/org/apache/sling/org.apache.sling.fsresource/2.1.14/org.apache.sling.fsresource-2.1.14.pom
[INFO] Downloaded: https://repo.maven.apache.org/maven2/org/apache/sling/org.apache.sling.fsresource/2.1.14/org.apache.sling.fsresource-2.1.14.pom (7 KB at 388.6 KB/sec)
[INFO] Downloading: https://repo.maven.apache.org/maven2/org/apache/sling/org.apache.sling.jcr.contentloader/2.2.6/org.apache.sling.jcr.contentloader-2.2.6.pom
[INFO] Downloaded: https://repo.maven.apache.org/maven2/org/apache/sling/org.apache.sling.jcr.contentloader/2.2.6/org.apache.sling.jcr.contentloader-2.2.6.pom (15 KB at 598.3 KB/sec)
[INFO] Downloading: https://repo.maven.apache.org/maven2/org/apache/sling/org.apache.sling.scripting.sightly/1.0.56-1.4.0/org.apache.sling.scripting.sightly-1.0.56-1.4.0.pom
[INFO] Downloaded: https://repo.maven.apache.org/maven2/org/apache/sling/org.apache.sling.scripting.sightly/1.0.56-1.4.0/org.apache.sling.scripting.sightly-1.0.56-1.4.0.pom (13 KB at 694.7 KB/sec)
[INFO] Downloading: https://repo.maven.apache.org/maven2/org/apache/sling/org.apache.sling.serviceusermapper/1.4.2/org.apache.sling.serviceusermapper-1.4.2.pom
[INFO] Downloaded: https://repo.maven.apache.org/maven2/org/apache/sling/org.apache.sling.serviceusermapper/1.4.2/org.apache.sling.serviceusermapper-1.4.2.pom (6 KB at 323.5 KB/sec)
[INFO] Downloading: https://repo.maven.apache.org/maven2/org/apache/sling/org.apache.sling.servlets.get/2.1.36/org.apache.sling.servlets.get-2.1.36.pom
[INFO] Downloaded: https://repo.maven.apache.org/maven2/org/apache/sling/org.apache.sling.servlets.get/2.1.36/org.apache.sling.servlets.get-2.1.36.pom (7 KB at 388.3 KB/sec)
[INFO] Downloading: https://repo.maven.apache.org/maven2/org/apache/felix/org.apache.felix.webconsole.plugins.ds/2.1.0/org.apache.felix.webconsole.plugins.ds-2.1.0.pom
[INFO] Downloaded: https://repo.maven.apache.org/maven2/org/apache/felix/org.apache.felix.webconsole.plugins.ds/2.1.0/org.apache.felix.webconsole.plugins.ds-2.1.0.pom (7 KB at 345.2 KB/sec)
[INFO] Downloading: https://repo.maven.apache.org/maven2/org/apache/sling/org.apache.sling.commons.johnzon/1.1.2/org.apache.sling.commons.johnzon-1.1.2.pom
[INFO] Downloaded: https://repo.maven.apache.org/maven2/org/apache/sling/org.apache.sling.commons.johnzon/1.1.2/org.apache.sling.commons.johnzon-1.1.2.pom (4 KB at 205.5 KB/sec)
[INFO] Downloading: https://repo.maven.apache.org/maven2/org/apache/sling/org.apache.sling.extensions.webconsolesecurityprovider/1.2.0/org.apache.sling.extensions.webconsolesecurityprovider-1.2.0.pom
[INFO] Downloaded: https://repo.maven.apache.org/maven2/org/apache/sling/org.apache.sling.extensions.webconsolesecurityprovider/1.2.0/org.apache.sling.extensions.webconsolesecurityprovider-1.2.0.pom (6 KB at 327.4 KB/sec)
[INFO] Downloading: https://repo.maven.apache.org/maven2/org/apache/sling/org.apache.sling.starter.content/1.0.2/org.apache.sling.starter.content-1.0.2.pom
[INFO] Downloaded: https://repo.maven.apache.org/maven2/org/apache/sling/org.apache.sling.starter.content/1.0.2/org.apache.sling.starter.content-1.0.2.pom (5 KB at 238.2 KB/sec)
[INFO] Downloading: https://repo.maven.apache.org/maven2/org/apache/felix/org.apache.felix.http.sslfilter/1.2.6/org.apache.felix.http.sslfilter-1.2.6.pom
[INFO] Downloaded: https://repo.maven.apache.org/maven2/org/apache/felix/org.apache.felix.http.sslfilter/1.2.6/org.apache.felix.http.sslfilter-1.2.6.pom (5 KB at 296.4 KB/sec)
[INFO] Downloading: https://repo.maven.apache.org/maven2/org/apache/felix/org.apache.felix.http.parent/12/org.apache.felix.http.parent-12.pom
[INFO] Downloaded: https://repo.maven.apache.org/maven2/org/apache/felix/org.apache.felix.http.parent/12/org.apache.felix.http.parent-12.pom (6 KB at 328.1 KB/sec)
[INFO] Downloading: https://repo.maven.apache.org/maven2/org/apache/felix/org.apache.felix.metatype/1.2.2/org.apache.felix.metatype-1.2.2.pom
[INFO] Downloaded: https://repo.maven.apache.org/maven2/org/apache/felix/org.apache.felix.metatype/1.2.2/org.apache.felix.metatype-1.2.2.pom (6 KB at 339.3 KB/sec)
[INFO] Downloading: https://repo.maven.apache.org/maven2/org/apache/felix/org.apache.felix.scr/2.1.12/org.apache.felix.scr-2.1.12.pom
[INFO] Downloaded: https://repo.maven.apache.org/maven2/org/apache/felix/org.apache.felix.scr/2.1.12/org.apache.felix.scr-2.1.12.pom (15 KB at 797.3 KB/sec)
[INFO] Downloading: https://repo.maven.apache.org/maven2/org/apache/poi/poi-ooxml/4.0.0/poi-ooxml-4.0.0.pom
[INFO] Downloaded: https://repo.maven.apache.org/maven2/org/apache/poi/poi-ooxml/4.0.0/poi-ooxml-4.0.0.pom (3 KB at 175.9 KB/sec)
[INFO] Downloading: https://repo.maven.apache.org/maven2/org/apache/poi/poi-ooxml-schemas/4.0.0/poi-ooxml-schemas-4.0.0.pom
[INFO] Downloaded: https://repo.maven.apache.org/maven2/org/apache/poi/poi-ooxml-schemas/4.0.0/poi-ooxml-schemas-4.0.0.pom (3 KB at 148.6 KB/sec)
[INFO] Downloading: https://repo.maven.apache.org/maven2/org/apache/xmlbeans/xmlbeans/3.0.1/xmlbeans-3.0.1.pom
[INFO] Downloaded: https://repo.maven.apache.org/maven2/org/apache/xmlbeans/xmlbeans/3.0.1/xmlbeans-3.0.1.pom (4 KB at 200.3 KB/sec)
[INFO] Downloading: https://repo.maven.apache.org/maven2/org/apache/cxf/cxf-rt-rs-client/3.2.6/cxf-rt-rs-client-3.2.6.pom
[INFO] Downloaded: https://repo.maven.apache.org/maven2/org/apache/cxf/cxf-rt-rs-client/3.2.6/cxf-rt-rs-client-3.2.6.pom (8 KB at 95.7 KB/sec)
[INFO] Downloading: https://repo.maven.apache.org/maven2/org/apache/cxf/cxf-parent/3.2.6/cxf-parent-3.2.6.pom
[INFO] Downloaded: https://repo.maven.apache.org/maven2/org/apache/cxf/cxf-parent/3.2.6/cxf-parent-3.2.6.pom (140 KB at 3395.7 KB/sec)
[INFO] Downloading: https://repo.maven.apache.org/maven2/org/apache/cxf/cxf/3.2.6/cxf-3.2.6.pom
[INFO] Downloaded: https://repo.maven.apache.org/maven2/org/apache/cxf/cxf/3.2.6/cxf-3.2.6.pom (37 KB at 1598.4 KB/sec)
[INFO] Downloading: https://repo.maven.apache.org/maven2/org/apache/cxf/cxf-rt-transports-http/3.2.6/cxf-rt-transports-http-3.2.6.pom
[INFO] Downloaded: https://repo.maven.apache.org/maven2/org/apache/cxf/cxf-rt-transports-http/3.2.6/cxf-rt-transports-http-3.2.6.pom (13 KB at 680.8 KB/sec)
[INFO] Downloading: https://repo.maven.apache.org/maven2/org/apache/cxf/cxf-core/3.2.6/cxf-core-3.2.6.pom
[INFO] Downloaded: https://repo.maven.apache.org/maven2/org/apache/cxf/cxf-core/3.2.6/cxf-core-3.2.6.pom (19 KB at 670.0 KB/sec)
[INFO] Downloading: https://repo.maven.apache.org/maven2/org/apache/cxf/cxf-rt-frontend-jaxrs/3.2.6/cxf-rt-frontend-jaxrs-3.2.6.pom
[INFO] Downloaded: https://repo.maven.apache.org/maven2/org/apache/cxf/cxf-rt-frontend-jaxrs/3.2.6/cxf-rt-frontend-jaxrs-3.2.6.pom (10 KB at 554.2 KB/sec)
[INFO] Downloading: https://repo.maven.apache.org/maven2/org/apache/jackrabbit/jackrabbit-jcr-rmi/2.16.3/jackrabbit-jcr-rmi-2.16.3.pom
[INFO] Downloaded: https://repo.maven.apache.org/maven2/org/apache/jackrabbit/jackrabbit-jcr-rmi/2.16.3/jackrabbit-jcr-rmi-2.16.3.pom (36 KB at 1459.4 KB/sec)
[INFO] Downloading: https://repo.maven.apache.org/maven2/org/apache/jackrabbit/jackrabbit-spi-commons/2.16.3/jackrabbit-spi-commons-2.16.3.pom
[INFO] Downloaded: https://repo.maven.apache.org/maven2/org/apache/jackrabbit/jackrabbit-spi-commons/2.16.3/jackrabbit-spi-commons-2.16.3.pom (7 KB at 423.3 KB/sec)
[INFO] Downloading: https://repo.maven.apache.org/maven2/org/apache/jackrabbit/jackrabbit-spi/2.16.3/jackrabbit-spi-2.16.3.pom
[INFO] Downloaded: https://repo.maven.apache.org/maven2/org/apache/jackrabbit/jackrabbit-spi/2.16.3/jackrabbit-spi-2.16.3.pom (4 KB at 170.3 KB/sec)
[INFO] Downloading: https://repo.maven.apache.org/maven2/org/apache/jackrabbit/jackrabbit-webdav/2.16.3/jackrabbit-webdav-2.16.3.pom
[INFO] Downloaded: https://repo.maven.apache.org/maven2/org/apache/jackrabbit/jackrabbit-webdav/2.16.3/jackrabbit-webdav-2.16.3.pom (4 KB at 190.8 KB/sec)
[INFO] Downloading: https://repo.maven.apache.org/maven2/org/apache/sling/org.apache.sling.commons.metrics/1.2.6/org.apache.sling.commons.metrics-1.2.6.pom
[INFO] Downloaded: https://repo.maven.apache.org/maven2/org/apache/sling/org.apache.sling.commons.metrics/1.2.6/org.apache.sling.commons.metrics-1.2.6.pom (8 KB at 418.8 KB/sec)
[INFO] Downloading: https://repo.maven.apache.org/maven2/org/apache/sling/org.apache.sling.caconfig.api/1.1.2/org.apache.sling.caconfig.api-1.1.2.pom
[INFO] Downloaded: https://repo.maven.apache.org/maven2/org/apache/sling/org.apache.sling.caconfig.api/1.1.2/org.apache.sling.caconfig.api-1.1.2.pom (3 KB at 126.4 KB/sec)
[INFO] Downloading: https://repo.maven.apache.org/maven2/org/apache/sling/org.apache.sling.caconfig.impl/1.4.14/org.apache.sling.caconfig.impl-1.4.14.pom
[INFO] Downloaded: https://repo.maven.apache.org/maven2/org/apache/sling/org.apache.sling.caconfig.impl/1.4.14/org.apache.sling.caconfig.impl-1.4.14.pom (12 KB at 664.7 KB/sec)
[INFO] Downloading: https://repo.maven.apache.org/maven2/org/apache/sling/org.apache.sling.caconfig.spi/1.3.4/org.apache.sling.caconfig.spi-1.3.4.pom
[INFO] Downloaded: https://repo.maven.apache.org/maven2/org/apache/sling/org.apache.sling.caconfig.spi/1.3.4/org.apache.sling.caconfig.spi-1.3.4.pom (5 KB at 245.1 KB/sec)
[INFO] Downloading: https://repo.maven.apache.org/maven2/org/apache/felix/org.apache.felix.http.jetty/4.0.6/org.apache.felix.http.jetty-4.0.6.pom
[INFO] Downloaded: https://repo.maven.apache.org/maven2/org/apache/felix/org.apache.felix.http.jetty/4.0.6/org.apache.felix.http.jetty-4.0.6.pom (11 KB at 568.2 KB/sec)
[INFO] Downloading: https://repo.maven.apache.org/maven2/org/apache/felix/org.apache.felix.http.base/4.0.4/org.apache.felix.http.base-4.0.4.pom
[INFO] Downloaded: https://repo.maven.apache.org/maven2/org/apache/felix/org.apache.felix.http.base/4.0.4/org.apache.felix.http.base-4.0.4.pom (4 KB at 198.1 KB/sec)
[INFO] Downloading: https://repo.maven.apache.org/maven2/org/apache/felix/org.apache.felix.http.bridge/4.0.4/org.apache.felix.http.bridge-4.0.4.pom
[INFO] Downloaded: https://repo.maven.apache.org/maven2/org/apache/felix/org.apache.felix.http.bridge/4.0.4/org.apache.felix.http.bridge-4.0.4.pom (6 KB at 332.6 KB/sec)
[INFO] Downloading: http://repository.apache.org/snapshots/org/apache/sling/org.apache.sling.launchpad.integration-tests/12-SNAPSHOT/org.apache.sling.launchpad.integration-tests-12-SNAPSHOT.jar
[INFO] Downloading: http://repository.apache.org/snapshots/org/apache/sling/org.apache.sling.starter/12-SNAPSHOT/org.apache.sling.starter-12-20181020.065851-2.jar
[INFO] Downloading: http://repository.apache.org/snapshots/org/apache/sling/org.apache.sling.launchpad.test-fragment/12-SNAPSHOT/org.apache.sling.launchpad.test-fragment-12-20181019.171341-1.jar
[INFO] Downloading: http://repository.apache.org/snapshots/org/apache/sling/org.apache.sling.launchpad.test-services-war/12-SNAPSHOT/org.apache.sling.launchpad.test-services-war-12-20181019.171426-1.war
[INFO] Downloading: http://repository.apache.org/snapshots/org/apache/sling/org.apache.sling.launchpad.test-services/12-SNAPSHOT/org.apache.sling.launchpad.test-services-12-20181019.165434-1.jar
[INFO] Downloaded: http://repository.apache.org/snapshots/org/apache/sling/org.apache.sling.launchpad.test-services-war/12-SNAPSHOT/org.apache.sling.launchpad.test-services-war-12-20181019.171426-1.war (14 KB at 47.2 KB/sec)
[INFO] Downloaded: http://repository.apache.org/snapshots/org/apache/sling/org.apache.sling.launchpad.test-fragment/12-SNAPSHOT/org.apache.sling.launchpad.test-fragment-12-20181019.171341-1.jar (9 KB at 30.3 KB/sec)
[INFO] Downloaded: http://repository.apache.org/snapshots/org/apache/sling/org.apache.sling.launchpad.test-services/12-SNAPSHOT/org.apache.sling.launchpad.test-services-12-20181019.165434-1.jar (180 KB at 346.7 KB/sec)
[INFO] Downloaded: http://repository.apache.org/snapshots/org/apache/sling/org.apache.sling.starter/12-SNAPSHOT/org.apache.sling.starter-12-20181020.065851-2.jar (71851 KB at 29160.3 KB/sec)
[INFO] Downloading: https://repo.maven.apache.org/maven2/org/apache/sling/org.apache.sling.launchpad.base/6.0.1-2.6.32/org.apache.sling.launchpad.base-6.0.1-2.6.32.jar
[INFO] Downloading: https://repo.maven.apache.org/maven2/org/apache/sling/org.apache.sling.launchpad.base/6.0.1-2.6.32/org.apache.sling.launchpad.base-6.0.1-2.6.32-app.jar
[INFO] Downloading: https://repo.maven.apache.org/maven2/org/apache/sling/org.apache.sling.launchpad.base/6.0.1-2.6.32/org.apache.sling.launchpad.base-6.0.1-2.6.32-webapp.war
[INFO] Downloading: https://repo.maven.apache.org/maven2/org/apache/felix/org.apache.felix.configadmin/1.9.10/org.apache.felix.configadmin-1.9.10.jar
[INFO] Downloading: https://repo.maven.apache.org/maven2/org/apache/geronimo/specs/geronimo-annotation_1.3_spec/1.1/geronimo-annotation_1.3_spec-1.1.jar
[INFO] Downloaded: https://repo.maven.apache.org/maven2/org/apache/geronimo/specs/geronimo-annotation_1.3_spec/1.1/geronimo-annotation_1.3_spec-1.1.jar (16 KB at 337.5 KB/sec)
[INFO] Downloading: https://repo.maven.apache.org/maven2/org/apache/geronimo/specs/geronimo-atinject_1.0_spec/1.1/geronimo-atinject_1.0_spec-1.1.jar
[INFO] Downloaded: https://repo.maven.apache.org/maven2/org/apache/sling/org.apache.sling.launchpad.base/6.0.1-2.6.32/org.apache.sling.launchpad.base-6.0.1-2.6.32-app.jar (62 KB at 1109.6 KB/sec)
[INFO] Downloaded: https://repo.maven.apache.org/maven2/org/apache/sling/org.apache.sling.launchpad.base/6.0.1-2.6.32/org.apache.sling.launchpad.base-6.0.1-2.6.32-webapp.war (42 KB at 762.2 KB/sec)
[INFO] Downloading: https://repo.maven.apache.org/maven2/org/apache/sling/org.apache.sling.settings/1.3.10/org.apache.sling.settings-1.3.10.jar
[INFO] Downloading: https://repo.maven.apache.org/maven2/com/composum/sling/core/composum-sling-core-commons/1.9.2/composum-sling-core-commons-1.9.2.jar
[INFO] Downloaded: https://repo.maven.apache.org/maven2/org/apache/geronimo/specs/geronimo-atinject_1.0_spec/1.1/geronimo-atinject_1.0_spec-1.1.jar (10 KB at 144.6 KB/sec)
[INFO] Downloading: https://repo.maven.apache.org/maven2/com/composum/sling/core/composum-sling-core-config/1.9.2/composum-sling-core-config-1.9.2.jar
[INFO] Downloaded: https://repo.maven.apache.org/maven2/org/apache/felix/org.apache.felix.configadmin/1.9.10/org.apache.felix.configadmin-1.9.10.jar (152 KB at 2171.2 KB/sec)
[INFO] Downloading: https://repo.maven.apache.org/maven2/com/composum/sling/core/composum-sling-core-console/1.9.2/composum-sling-core-console-1.9.2.jar
[INFO] Downloaded: https://repo.maven.apache.org/maven2/org/apache/sling/org.apache.sling.settings/1.3.10/org.apache.sling.settings-1.3.10.jar (30 KB at 382.7 KB/sec)
[INFO] Downloading: https://repo.maven.apache.org/maven2/com/composum/sling/core/composum-sling-core-jslibs/1.9.2/composum-sling-core-jslibs-1.9.2.jar
[INFO] Downloaded: https://repo.maven.apache.org/maven2/com/composum/sling/core/composum-sling-core-config/1.9.2/composum-sling-core-config-1.9.2.jar (4 KB at 43.7 KB/sec)
[INFO] Downloading: https://repo.maven.apache.org/maven2/com/composum/sling/core/composum-sling-package-manager/1.9.2/composum-sling-package-manager-1.9.2.jar
[INFO] Downloaded: https://repo.maven.apache.org/maven2/org/apache/sling/org.apache.sling.launchpad.base/6.0.1-2.6.32/org.apache.sling.launchpad.base-6.0.1-2.6.32.jar (803 KB at 7715.4 KB/sec)
[INFO] Downloading: https://repo.maven.apache.org/maven2/com/composum/sling/core/composum-sling-user-management/1.9.2/composum-sling-user-management-1.9.2.jar
[INFO] Downloaded: https://repo.maven.apache.org/maven2/com/composum/sling/core/composum-sling-package-manager/1.9.2/composum-sling-package-manager-1.9.2.jar (164 KB at 1395.9 KB/sec)
[INFO] Downloading: https://repo.maven.apache.org/maven2/org/apache/jackrabbit/vault/org.apache.jackrabbit.vault/3.2.4/org.apache.jackrabbit.vault-3.2.4.jar
[INFO] Downloaded: https://repo.maven.apache.org/maven2/com/composum/sling/core/composum-sling-user-management/1.9.2/composum-sling-user-management-1.9.2.jar (119 KB at 948.6 KB/sec)
[INFO] Downloading: https://repo.maven.apache.org/maven2/org/apache/jackrabbit/oak-api/1.8.8/oak-api-1.8.8.jar
[INFO] Downloaded: https://repo.maven.apache.org/maven2/org/apache/jackrabbit/oak-api/1.8.8/oak-api-1.8.8.jar (38 KB at 254.0 KB/sec)
[INFO] Downloading: https://repo.maven.apache.org/maven2/org/apache/jackrabbit/oak-blob-plugins/1.8.8/oak-blob-plugins-1.8.8.jar
[INFO] Downloaded: https://repo.maven.apache.org/maven2/org/apache/jackrabbit/oak-blob-plugins/1.8.8/oak-blob-plugins-1.8.8.jar (207 KB at 1154.0 KB/sec)
[INFO] Downloading: https://repo.maven.apache.org/maven2/org/apache/jackrabbit/oak-blob/1.8.8/oak-blob-1.8.8.jar
[INFO] Downloaded: https://repo.maven.apache.org/maven2/org/apache/jackrabbit/oak-blob/1.8.8/oak-blob-1.8.8.jar (55 KB at 272.8 KB/sec)
[INFO] Downloading: https://repo.maven.apache.org/maven2/org/apache/jackrabbit/oak-commons/1.8.8/oak-commons-1.8.8.jar
[INFO] Downloaded: https://repo.maven.apache.org/maven2/org/apache/jackrabbit/vault/org.apache.jackrabbit.vault/3.2.4/org.apache.jackrabbit.vault-3.2.4.jar (728 KB at 3550.5 KB/sec)
[INFO] Downloading: https://repo.maven.apache.org/maven2/org/apache/jackrabbit/oak-core-spi/1.8.8/oak-core-spi-1.8.8.jar
[INFO] Downloaded: https://repo.maven.apache.org/maven2/org/apache/jackrabbit/oak-commons/1.8.8/oak-commons-1.8.8.jar (98 KB at 439.7 KB/sec)
[INFO] Downloading: https://repo.maven.apache.org/maven2/org/apache/jackrabbit/oak-core/1.8.8/oak-core-1.8.8.jar
[INFO] Downloaded: https://repo.maven.apache.org/maven2/org/apache/jackrabbit/oak-core-spi/1.8.8/oak-core-spi-1.8.8.jar (148 KB at 636.5 KB/sec)
[INFO] Downloading: https://repo.maven.apache.org/maven2/org/apache/jackrabbit/oak-jcr/1.8.8/oak-jcr-1.8.8.jar
[INFO] Downloaded: https://repo.maven.apache.org/maven2/com/composum/sling/core/composum-sling-core-console/1.9.2/composum-sling-core-console-1.9.2.jar (820 KB at 3516.2 KB/sec)
[INFO] Downloading: https://repo.maven.apache.org/maven2/org/apache/jackrabbit/oak-lucene/1.8.8/oak-lucene-1.8.8.jar
[INFO] Downloaded: https://repo.maven.apache.org/maven2/org/apache/jackrabbit/oak-jcr/1.8.8/oak-jcr-1.8.8.jar (548 KB at 1927.7 KB/sec)
[INFO] Downloading: https://repo.maven.apache.org/maven2/org/apache/jackrabbit/oak-query-spi/1.8.8/oak-query-spi-1.8.8.jar
[INFO] Downloaded: https://repo.maven.apache.org/maven2/org/apache/jackrabbit/oak-query-spi/1.8.8/oak-query-spi-1.8.8.jar (49 KB at 159.5 KB/sec)
[INFO] Downloading: https://repo.maven.apache.org/maven2/org/apache/jackrabbit/oak-security-spi/1.8.8/oak-security-spi-1.8.8.jar
[INFO] Downloaded: https://repo.maven.apache.org/maven2/org/apache/jackrabbit/oak-core/1.8.8/oak-core-1.8.8.jar (1513 KB at 4513.6 KB/sec)
[INFO] Downloading: https://repo.maven.apache.org/maven2/org/apache/jackrabbit/oak-store-composite/1.8.8/oak-store-composite-1.8.8.jar
[INFO] Downloaded: https://repo.maven.apache.org/maven2/org/apache/jackrabbit/oak-security-spi/1.8.8/oak-security-spi-1.8.8.jar (226 KB at 667.7 KB/sec)
[INFO] Downloading: https://repo.maven.apache.org/maven2/org/apache/jackrabbit/oak-store-document/1.8.8/oak-store-document-1.8.8.jar
[INFO] Downloaded: https://repo.maven.apache.org/maven2/org/apache/jackrabbit/oak-store-composite/1.8.8/oak-store-composite-1.8.8.jar (110 KB at 308.3 KB/sec)
[INFO] Downloading: https://repo.maven.apache.org/maven2/org/apache/jackrabbit/oak-store-spi/1.8.8/oak-store-spi-1.8.8.jar
[INFO] Downloaded: https://repo.maven.apache.org/maven2/org/apache/jackrabbit/oak-store-spi/1.8.8/oak-store-spi-1.8.8.jar (236 KB at 612.0 KB/sec)
[INFO] Downloading: https://repo.maven.apache.org/maven2/com/h2database/h2-mvstore/1.4.194/h2-mvstore-1.4.194.jar
[INFO] Downloaded: https://repo.maven.apache.org/maven2/com/h2database/h2-mvstore/1.4.194/h2-mvstore-1.4.194.jar (204 KB at 494.1 KB/sec)
[INFO] Downloading: https://repo.maven.apache.org/maven2/org/apache/jackrabbit/oak-segment-tar/1.8.8/oak-segment-tar-1.8.8.jar
[INFO] Downloaded: https://repo.maven.apache.org/maven2/com/composum/sling/core/composum-sling-core-commons/1.9.2/composum-sling-core-commons-1.9.2.jar (1466 KB at 3465.3 KB/sec)
[INFO] Downloading: https://repo.maven.apache.org/maven2/org/apache/httpcomponents/fluent-hc/4.5.6/fluent-hc-4.5.6.jar
[INFO] Downloaded: https://repo.maven.apache.org/maven2/org/apache/jackrabbit/oak-store-document/1.8.8/oak-store-document-1.8.8.jar (1046 KB at 2476.8 KB/sec)
[INFO] Downloading: https://repo.maven.apache.org/maven2/org/apache/servicemix/bundles/org.apache.servicemix.bundles.rhino/1.7.10_1/org.apache.servicemix.bundles.rhino-1.7.10_1.jar
[INFO] Downloaded: https://repo.maven.apache.org/maven2/org/apache/httpcomponents/fluent-hc/4.5.6/fluent-hc-4.5.6.jar (31 KB at 70.3 KB/sec)
[INFO] Downloading: https://repo.maven.apache.org/maven2/org/apache/sling/org.apache.sling.auth.form/1.0.12/org.apache.sling.auth.form-1.0.12.jar
[INFO] Downloaded: https://repo.maven.apache.org/maven2/org/apache/sling/org.apache.sling.auth.form/1.0.12/org.apache.sling.auth.form-1.0.12.jar (59 KB at 128.3 KB/sec)
[INFO] Downloading: https://repo.maven.apache.org/maven2/org/apache/sling/org.apache.sling.jcr.contentloader/2.2.6/org.apache.sling.jcr.contentloader-2.2.6.jar
[INFO] Downloaded: https://repo.maven.apache.org/maven2/org/apache/jackrabbit/oak-lucene/1.8.8/oak-lucene-1.8.8.jar (5700 KB at 11923.2 KB/sec)
[INFO] Downloading: https://repo.maven.apache.org/maven2/org/apache/sling/org.apache.sling.scripting.sightly/1.0.56-1.4.0/org.apache.sling.scripting.sightly-1.0.56-1.4.0.jar
[INFO] Downloaded: https://repo.maven.apache.org/maven2/org/apache/sling/org.apache.sling.jcr.contentloader/2.2.6/org.apache.sling.jcr.contentloader-2.2.6.jar (142 KB at 293.8 KB/sec)
[INFO] Downloading: https://repo.maven.apache.org/maven2/org/apache/sling/org.apache.sling.serviceusermapper/1.4.2/org.apache.sling.serviceusermapper-1.4.2.jar
[INFO] Downloaded: https://repo.maven.apache.org/maven2/org/apache/sling/org.apache.sling.scripting.sightly/1.0.56-1.4.0/org.apache.sling.scripting.sightly-1.0.56-1.4.0.jar (107 KB at 213.3 KB/sec)
[INFO] Downloading: https://repo.maven.apache.org/maven2/org/apache/felix/org.apache.felix.webconsole.plugins.ds/2.1.0/org.apache.felix.webconsole.plugins.ds-2.1.0.jar
[INFO] Downloaded: https://repo.maven.apache.org/maven2/org/apache/sling/org.apache.sling.serviceusermapper/1.4.2/org.apache.sling.serviceusermapper-1.4.2.jar (40 KB at 78.6 KB/sec)
[INFO] Downloading: https://repo.maven.apache.org/maven2/org/apache/sling/org.apache.sling.starter.content/1.0.2/org.apache.sling.starter.content-1.0.2.jar
[INFO] Downloaded: https://repo.maven.apache.org/maven2/org/apache/felix/org.apache.felix.webconsole.plugins.ds/2.1.0/org.apache.felix.webconsole.plugins.ds-2.1.0.jar (48 KB at 90.5 KB/sec)
[INFO] Downloading: https://repo.maven.apache.org/maven2/org/apache/felix/org.apache.felix.http.sslfilter/1.2.6/org.apache.felix.http.sslfilter-1.2.6.jar
[INFO] Downloaded: https://repo.maven.apache.org/maven2/org/apache/sling/org.apache.sling.starter.content/1.0.2/org.apache.sling.starter.content-1.0.2.jar (144 KB at 268.7 KB/sec)
[INFO] Downloading: https://repo.maven.apache.org/maven2/org/apache/felix/org.apache.felix.metatype/1.2.2/org.apache.felix.metatype-1.2.2.jar
[INFO] Downloaded: https://repo.maven.apache.org/maven2/org/apache/felix/org.apache.felix.metatype/1.2.2/org.apache.felix.metatype-1.2.2.jar (75 KB at 135.7 KB/sec)
[INFO] Downloaded: https://repo.maven.apache.org/maven2/org/apache/felix/org.apache.felix.http.sslfilter/1.2.6/org.apache.felix.http.sslfilter-1.2.6.jar (25 KB at 45.1 KB/sec)
[INFO] Downloading: https://repo.maven.apache.org/maven2/org/apache/felix/org.apache.felix.scr/2.1.12/org.apache.felix.scr-2.1.12.jar
[INFO] Downloading: https://repo.maven.apache.org/maven2/org/apache/poi/poi-ooxml/4.0.0/poi-ooxml-4.0.0.jar
[INFO] Downloaded: https://repo.maven.apache.org/maven2/org/apache/jackrabbit/oak-segment-tar/1.8.8/oak-segment-tar-1.8.8.jar (2385 KB at 4273.9 KB/sec)
[INFO] Downloading: https://repo.maven.apache.org/maven2/org/apache/poi/poi-ooxml-schemas/4.0.0/poi-ooxml-schemas-4.0.0.jar
[INFO] Downloaded: https://repo.maven.apache.org/maven2/org/apache/felix/org.apache.felix.scr/2.1.12/org.apache.felix.scr-2.1.12.jar (408 KB at 664.0 KB/sec)
[INFO] Downloading: https://repo.maven.apache.org/maven2/org/apache/xmlbeans/xmlbeans/3.0.1/xmlbeans-3.0.1.jar
[INFO] Downloaded: https://repo.maven.apache.org/maven2/com/composum/sling/core/composum-sling-core-jslibs/1.9.2/composum-sling-core-jslibs-1.9.2.jar (11232 KB at 17884.1 KB/sec)
[INFO] Downloading: https://repo.maven.apache.org/maven2/org/apache/cxf/cxf-rt-rs-client/3.2.6/cxf-rt-rs-client-3.2.6.jar
[INFO] Downloaded: https://repo.maven.apache.org/maven2/org/apache/cxf/cxf-rt-rs-client/3.2.6/cxf-rt-rs-client-3.2.6.jar (176 KB at 271.0 KB/sec)
[INFO] Downloading: https://repo.maven.apache.org/maven2/org/apache/cxf/cxf-rt-transports-http/3.2.6/cxf-rt-transports-http-3.2.6.jar
[INFO] Downloaded: https://repo.maven.apache.org/maven2/org/apache/poi/poi-ooxml/4.0.0/poi-ooxml-4.0.0.jar (1717 KB at 2629.2 KB/sec)
[INFO] Downloading: https://repo.maven.apache.org/maven2/org/apache/cxf/cxf-core/3.2.6/cxf-core-3.2.6.jar
[INFO] Downloaded: https://repo.maven.apache.org/maven2/org/apache/cxf/cxf-rt-transports-http/3.2.6/cxf-rt-transports-http-3.2.6.jar (355 KB at 516.8 KB/sec)
[INFO] Downloading: https://repo.maven.apache.org/maven2/org/apache/cxf/cxf-rt-frontend-jaxrs/3.2.6/cxf-rt-frontend-jaxrs-3.2.6.jar
[INFO] Downloaded: https://repo.maven.apache.org/maven2/org/apache/cxf/cxf-core/3.2.6/cxf-core-3.2.6.jar (1368 KB at 1899.3 KB/sec)
[INFO] Downloaded: https://repo.maven.apache.org/maven2/org/apache/xmlbeans/xmlbeans/3.0.1/xmlbeans-3.0.1.jar (2522 KB at 3502.5 KB/sec)
[INFO] Downloading: https://repo.maven.apache.org/maven2/org/apache/jackrabbit/jackrabbit-data/2.16.3/jackrabbit-data-2.16.3.jar
[INFO] Downloading: https://repo.maven.apache.org/maven2/org/apache/jackrabbit/jackrabbit-api/2.16.3/jackrabbit-api-2.16.3.jar
[INFO] Downloaded: https://repo.maven.apache.org/maven2/org/apache/cxf/cxf-rt-frontend-jaxrs/3.2.6/cxf-rt-frontend-jaxrs-3.2.6.jar (665 KB at 912.3 KB/sec)
[INFO] Downloading: https://repo.maven.apache.org/maven2/org/apache/jackrabbit/jackrabbit-jcr-commons/2.16.3/jackrabbit-jcr-commons-2.16.3.jar
[INFO] Downloaded: https://repo.maven.apache.org/maven2/org/apache/jackrabbit/jackrabbit-api/2.16.3/jackrabbit-api-2.16.3.jar (42 KB at 56.3 KB/sec)
[INFO] Downloading: https://repo.maven.apache.org/maven2/org/apache/jackrabbit/jackrabbit-jcr-rmi/2.16.3/jackrabbit-jcr-rmi-2.16.3.jar
[INFO] Downloaded: https://repo.maven.apache.org/maven2/org/apache/jackrabbit/jackrabbit-data/2.16.3/jackrabbit-data-2.16.3.jar (169 KB at 227.0 KB/sec)
[INFO] Downloading: https://repo.maven.apache.org/maven2/org/apache/jackrabbit/jackrabbit-spi-commons/2.16.3/jackrabbit-spi-commons-2.16.3.jar
[INFO] Downloaded: https://repo.maven.apache.org/maven2/org/apache/servicemix/bundles/org.apache.servicemix.bundles.rhino/1.7.10_1/org.apache.servicemix.bundles.rhino-1.7.10_1.jar (2121 KB at 2800.7 KB/sec)
[INFO] Downloading: https://repo.maven.apache.org/maven2/org/apache/jackrabbit/jackrabbit-spi/2.16.3/jackrabbit-spi-2.16.3.jar
[INFO] Downloaded: https://repo.maven.apache.org/maven2/org/apache/poi/poi-ooxml-schemas/4.0.0/poi-ooxml-schemas-4.0.0.jar (6326 KB at 8356.1 KB/sec)
[INFO] Downloading: https://repo.maven.apache.org/maven2/org/apache/jackrabbit/jackrabbit-webdav/2.16.3/jackrabbit-webdav-2.16.3.jar
[INFO] Downloaded: https://repo.maven.apache.org/maven2/org/apache/jackrabbit/jackrabbit-jcr-commons/2.16.3/jackrabbit-jcr-commons-2.16.3.jar (394 KB at 519.5 KB/sec)
[INFO] Downloading: https://repo.maven.apache.org/maven2/org/apache/sling/org.apache.sling.commons.metrics/1.2.6/org.apache.sling.commons.metrics-1.2.6.jar
[INFO] Downloaded: https://repo.maven.apache.org/maven2/org/apache/jackrabbit/jackrabbit-jcr-rmi/2.16.3/jackrabbit-jcr-rmi-2.16.3.jar (227 KB at 297.5 KB/sec)
[INFO] Downloading: https://repo.maven.apache.org/maven2/org/apache/sling/org.apache.sling.caconfig.spi/1.3.4/org.apache.sling.caconfig.spi-1.3.4.jar
[INFO] Downloaded: https://repo.maven.apache.org/maven2/org/apache/jackrabbit/jackrabbit-spi/2.16.3/jackrabbit-spi-2.16.3.jar (28 KB at 35.8 KB/sec)
[INFO] Downloading: https://repo.maven.apache.org/maven2/org/apache/felix/org.apache.felix.http.jetty/4.0.6/org.apache.felix.http.jetty-4.0.6.jar
[INFO] Downloaded: https://repo.maven.apache.org/maven2/org/apache/jackrabbit/jackrabbit-webdav/2.16.3/jackrabbit-webdav-2.16.3.jar (319 KB at 402.9 KB/sec)
[INFO] Downloading: https://repo.maven.apache.org/maven2/org/apache/felix/org.apache.felix.http.base/4.0.4/org.apache.felix.http.base-4.0.4.jar
[INFO] Downloaded: https://repo.maven.apache.org/maven2/org/apache/jackrabbit/jackrabbit-spi-commons/2.16.3/jackrabbit-spi-commons-2.16.3.jar (785 KB at 981.7 KB/sec)
[INFO] Downloading: https://repo.maven.apache.org/maven2/org/apache/felix/org.apache.felix.http.bridge/4.0.4/org.apache.felix.http.bridge-4.0.4.jar
[INFO] Downloaded: https://repo.maven.apache.org/maven2/org/apache/felix/org.apache.felix.http.base/4.0.4/org.apache.felix.http.base-4.0.4.jar (238 KB at 290.8 KB/sec)
[INFO] Downloaded: https://repo.maven.apache.org/maven2/org/apache/felix/org.apache.felix.http.bridge/4.0.4/org.apache.felix.http.bridge-4.0.4.jar (493 KB at 594.2 KB/sec)
[INFO] Downloaded: https://repo.maven.apache.org/maven2/org/apache/sling/org.apache.sling.commons.metrics/1.2.6/org.apache.sling.commons.metrics-1.2.6.jar (63 KB at 74.4 KB/sec)
[INFO] Downloaded: https://repo.maven.apache.org/maven2/org/apache/sling/org.apache.sling.caconfig.spi/1.3.4/org.apache.sling.caconfig.spi-1.3.4.jar (26 KB at 27.7 KB/sec)
[INFO] Downloaded: https://repo.maven.apache.org/maven2/org/apache/felix/org.apache.felix.http.jetty/4.0.6/org.apache.felix.http.jetty-4.0.6.jar (2911 KB at 3040.9 KB/sec)
[WARNING] Attempt to (de-)serialize anonymous class hudson.maven.reporters.MavenArtifactArchiver$2; see: https://jenkins.io/redirect/serialization-of-anonymous-classes/
[JENKINS] Archiving disabled
[WARNING] Attempt to (de-)serialize anonymous class hudson.maven.reporters.MavenFingerprinter$1; see: https://jenkins.io/redirect/serialization-of-anonymous-classes/
[JENKINS] Archiving disabled
[INFO] ------------------------------------------------------------------------
[INFO] BUILD FAILURE
[INFO] ------------------------------------------------------------------------
[INFO] Total time: 24.096 s
[INFO] Finished at: 2018-10-20T07:00:23+00:00
[INFO] Final Memory: 33M/4096M
[INFO] ------------------------------------------------------------------------
Waiting for Jenkins to finish collecting data
[ERROR] Failed to execute goal on project org.apache.sling.launchpad.testing: Could not resolve dependencies for project org.apache.sling:org.apache.sling.launchpad.testing:slingstart:12-SNAPSHOT: Could not find artifact org.apache.sling:org.apache.sling.launchpad.integration-tests:jar:12-SNAPSHOT in Nexus (http://repository.apache.org/snapshots) -> [Help 1]
[ERROR] 
[ERROR] To see the full stack trace of the errors, re-run Maven with the -e switch.
[ERROR] Re-run Maven using the -X switch to enable full debug logging.
[ERROR] 
[ERROR] For more information about the errors and possible solutions, please read the following articles:
[ERROR] [Help 1] http://cwiki.apache.org/confluence/display/MAVEN/DependencyResolutionException
channel stopped
Archiving artifacts
Recording test results

Build failed in Jenkins: sling-org-apache-sling-launchpad-testing-10 #192

Posted by Apache Jenkins Server <je...@builds.apache.org>.
See <https://builds.apache.org/job/sling-org-apache-sling-launchpad-testing-10/192/display/redirect?page=changes>

Changes:

[rombert] SLING-7935 - Consolidate all 'launchpad-testing' modules into a single

------------------------------------------
Started by an SCM change
Started by an SCM change
Started by upstream project "sling-org-apache-sling-launchpad-test-bundles-1.8" build number 65
originally caused by:
 Started by an SCM change
 Started by an SCM change
[EnvInject] - Loading node environment variables.
Building remotely on ubuntu-eu2 (ubuntu trusty) in workspace <https://builds.apache.org/job/sling-org-apache-sling-launchpad-testing-10/ws/>
[WS-CLEANUP] Deleting project workspace...
[WS-CLEANUP] Done
Cloning the remote Git repository
Cloning repository https://github.com/apache/sling-org-apache-sling-launchpad-testing.git
 > git init <https://builds.apache.org/job/sling-org-apache-sling-launchpad-testing-10/ws/> # timeout=10
Fetching upstream changes from https://github.com/apache/sling-org-apache-sling-launchpad-testing.git
 > git --version # timeout=10
 > git fetch --tags --progress https://github.com/apache/sling-org-apache-sling-launchpad-testing.git +refs/heads/*:refs/remotes/origin/*
 > git config remote.origin.url https://github.com/apache/sling-org-apache-sling-launchpad-testing.git # timeout=10
 > git config --add remote.origin.fetch +refs/heads/*:refs/remotes/origin/* # timeout=10
 > git config remote.origin.url https://github.com/apache/sling-org-apache-sling-launchpad-testing.git # timeout=10
Fetching upstream changes from https://github.com/apache/sling-org-apache-sling-launchpad-testing.git
 > git fetch --tags --progress https://github.com/apache/sling-org-apache-sling-launchpad-testing.git +refs/heads/*:refs/remotes/origin/*
 > git rev-parse origin/master^{commit} # timeout=10
Checking out Revision 11a7575dedfad03e7e357506e8a44bc30a7b9de1 (origin/master)
 > git config core.sparsecheckout # timeout=10
 > git checkout -f 11a7575dedfad03e7e357506e8a44bc30a7b9de1
Commit message: "SLING-7935 - Consolidate all 'launchpad-testing' modules into a single git repository"
 > git rev-list --no-walk 19f71e11e2fa56ba723cb1797cb2c91e9ae3dd0a # timeout=10
Parsing POMs
Established TCP socket on 41314
maven33-agent.jar already up to date
maven33-interceptor.jar already up to date
maven3-interceptor-commons.jar already up to date
[sling-org-apache-sling-launchpad-testing-10] $ /home/jenkins/tools/java/latest10/bin/java -Xmx4g -Xms4g -cp /home/jenkins/jenkins-slave/maven33-agent.jar:/home/jenkins/tools/maven/apache-maven-3.3.9/boot/plexus-classworlds-2.5.2.jar:/home/jenkins/tools/maven/apache-maven-3.3.9/conf/logging jenkins.maven3.agent.Maven33Main /home/jenkins/tools/maven/apache-maven-3.3.9 /home/jenkins/jenkins-slave/slave.jar /home/jenkins/jenkins-slave/maven33-interceptor.jar /home/jenkins/jenkins-slave/maven3-interceptor-commons.jar 41314
<===[JENKINS REMOTING CAPACITY]===>   channel started
Executing Maven:  -B -f <https://builds.apache.org/job/sling-org-apache-sling-launchpad-testing-10/ws/pom.xml> -Dmaven.repo.local=/home/jenkins/jenkins-slave/maven-repositories/1 -U clean verify
[INFO] Scanning for projects...
[INFO] Downloading: http://repository.apache.org/snapshots/org/apache/sling/org.apache.sling.launchpad.test-bundles/12-SNAPSHOT/maven-metadata.xml
[INFO] Downloaded: http://repository.apache.org/snapshots/org/apache/sling/org.apache.sling.launchpad.test-bundles/12-SNAPSHOT/maven-metadata.xml (1007 B at 2.0 KB/sec)
[INFO] Downloading: http://repository.apache.org/snapshots/org/apache/sling/org.apache.sling.launchpad.test-bundles/12-SNAPSHOT/org.apache.sling.launchpad.test-bundles-12-20181019.220256-2.txt
[INFO] Downloaded: http://repository.apache.org/snapshots/org/apache/sling/org.apache.sling.launchpad.test-bundles/12-SNAPSHOT/org.apache.sling.launchpad.test-bundles-12-20181019.220256-2.txt (2 KB at 4.3 KB/sec)
[INFO] Downloading: http://repository.apache.org/snapshots/org/apache/sling/org.apache.sling.starter/12-SNAPSHOT/maven-metadata.xml
[INFO] Downloaded: http://repository.apache.org/snapshots/org/apache/sling/org.apache.sling.starter/12-SNAPSHOT/maven-metadata.xml (2 KB at 3.3 KB/sec)
[INFO] Downloading: http://repository.apache.org/snapshots/org/apache/sling/org.apache.sling.starter/12-SNAPSHOT/org.apache.sling.starter-12-20181019.145904-1-slingfeature.txt
[INFO] Downloaded: http://repository.apache.org/snapshots/org/apache/sling/org.apache.sling.starter/12-SNAPSHOT/org.apache.sling.starter-12-20181019.145904-1-slingfeature.txt (50 KB at 127.8 KB/sec)
[INFO] Extended Maven classpath (scope 'provided') by the dependencies extracted from the Sling model.
[INFO]                                                                         
[INFO] ------------------------------------------------------------------------
[INFO] Building Apache Sling Launchpad Testing 12-SNAPSHOT
[INFO] ------------------------------------------------------------------------
[INFO] Downloading: http://repository.apache.org/snapshots/org/apache/sling/org.apache.sling.launchpad.integration-tests/12-SNAPSHOT/maven-metadata.xml
[INFO] Downloading: http://repository.apache.org/snapshots/org/apache/sling/org.apache.sling.launchpad.integration-tests/12-SNAPSHOT/org.apache.sling.launchpad.integration-tests-12-SNAPSHOT.pom
[WARNING] The POM for org.apache.sling:org.apache.sling.launchpad.integration-tests:jar:12-SNAPSHOT is missing, no dependency information available
[INFO] Downloading: http://repository.apache.org/snapshots/org/apache/sling/org.apache.sling.starter/12-SNAPSHOT/org.apache.sling.starter-12-20181019.145904-1.pom
[INFO] Downloaded: http://repository.apache.org/snapshots/org/apache/sling/org.apache.sling.starter/12-SNAPSHOT/org.apache.sling.starter-12-20181019.145904-1.pom (8 KB at 18.6 KB/sec)
[INFO] Downloading: http://repository.apache.org/snapshots/org/apache/sling/org.apache.sling.launchpad.test-bundles/12-SNAPSHOT/org.apache.sling.launchpad.test-bundles-12-20181019.220256-2.pom
[INFO] Downloaded: http://repository.apache.org/snapshots/org/apache/sling/org.apache.sling.launchpad.test-bundles/12-SNAPSHOT/org.apache.sling.launchpad.test-bundles-12-20181019.220256-2.pom (4 KB at 8.1 KB/sec)
[INFO] Downloading: https://repo.maven.apache.org/maven2/org/apache/felix/org.apache.felix.configadmin/1.9.10/org.apache.felix.configadmin-1.9.10.pom
[INFO] Downloaded: https://repo.maven.apache.org/maven2/org/apache/felix/org.apache.felix.configadmin/1.9.10/org.apache.felix.configadmin-1.9.10.pom (14 KB at 32.4 KB/sec)
[INFO] Downloading: https://repo.maven.apache.org/maven2/org/apache/jackrabbit/vault/org.apache.jackrabbit.vault/3.2.4/org.apache.jackrabbit.vault-3.2.4.pom
[INFO] Downloaded: https://repo.maven.apache.org/maven2/org/apache/jackrabbit/vault/org.apache.jackrabbit.vault/3.2.4/org.apache.jackrabbit.vault-3.2.4.pom (14 KB at 112.3 KB/sec)
[INFO] Downloading: https://repo.maven.apache.org/maven2/org/apache/jackrabbit/vault/parent/3.2.4/parent-3.2.4.pom
[INFO] Downloaded: https://repo.maven.apache.org/maven2/org/apache/jackrabbit/vault/parent/3.2.4/parent-3.2.4.pom (20 KB at 174.0 KB/sec)
[INFO] Downloading: http://repository.apache.org/snapshots/org/apache/sling/org.apache.sling.launchpad.test-fragment/12-SNAPSHOT/maven-metadata.xml
[INFO] Downloaded: http://repository.apache.org/snapshots/org/apache/sling/org.apache.sling.launchpad.test-fragment/12-SNAPSHOT/maven-metadata.xml (1008 B at 2.6 KB/sec)
[INFO] Downloading: http://repository.apache.org/snapshots/org/apache/sling/org.apache.sling.launchpad.test-services-war/12-SNAPSHOT/maven-metadata.xml
[INFO] Downloaded: http://repository.apache.org/snapshots/org/apache/sling/org.apache.sling.launchpad.test-services-war/12-SNAPSHOT/maven-metadata.xml (1012 B at 2.7 KB/sec)
[INFO] Downloading: http://repository.apache.org/snapshots/org/apache/sling/org.apache.sling.launchpad.test-services/12-SNAPSHOT/maven-metadata.xml
[INFO] Downloaded: http://repository.apache.org/snapshots/org/apache/sling/org.apache.sling.launchpad.test-services/12-SNAPSHOT/maven-metadata.xml (1008 B at 2.5 KB/sec)
[INFO] Downloading: https://repo.maven.apache.org/maven2/org/apache/jackrabbit/oak-api/1.8.8/oak-api-1.8.8.pom
[INFO] Downloaded: https://repo.maven.apache.org/maven2/org/apache/jackrabbit/oak-api/1.8.8/oak-api-1.8.8.pom (4 KB at 19.7 KB/sec)
[INFO] Downloading: https://repo.maven.apache.org/maven2/org/apache/jackrabbit/oak-parent/1.8.8/oak-parent-1.8.8.pom
[INFO] Downloaded: https://repo.maven.apache.org/maven2/org/apache/jackrabbit/oak-parent/1.8.8/oak-parent-1.8.8.pom (43 KB at 1682.1 KB/sec)
[INFO] Downloading: https://repo.maven.apache.org/maven2/org/apache/jackrabbit/oak-blob-plugins/1.8.8/oak-blob-plugins-1.8.8.pom
[INFO] Downloaded: https://repo.maven.apache.org/maven2/org/apache/jackrabbit/oak-blob-plugins/1.8.8/oak-blob-plugins-1.8.8.pom (7 KB at 69.4 KB/sec)
[INFO] Downloading: https://repo.maven.apache.org/maven2/org/apache/jackrabbit/jackrabbit-data/2.16.3/jackrabbit-data-2.16.3.pom
[INFO] Downloaded: https://repo.maven.apache.org/maven2/org/apache/jackrabbit/jackrabbit-data/2.16.3/jackrabbit-data-2.16.3.pom (4 KB at 19.9 KB/sec)
[INFO] Downloading: https://repo.maven.apache.org/maven2/org/apache/jackrabbit/oak-commons/1.8.8/oak-commons-1.8.8.pom
[INFO] Downloaded: https://repo.maven.apache.org/maven2/org/apache/jackrabbit/oak-commons/1.8.8/oak-commons-1.8.8.pom (4 KB at 274.9 KB/sec)
[INFO] Downloading: https://repo.maven.apache.org/maven2/org/apache/jackrabbit/oak-core-spi/1.8.8/oak-core-spi-1.8.8.pom
[INFO] Downloaded: https://repo.maven.apache.org/maven2/org/apache/jackrabbit/oak-core-spi/1.8.8/oak-core-spi-1.8.8.pom (6 KB at 60.6 KB/sec)
[INFO] Downloading: https://repo.maven.apache.org/maven2/org/apache/jackrabbit/oak-blob/1.8.8/oak-blob-1.8.8.pom
[INFO] Downloaded: https://repo.maven.apache.org/maven2/org/apache/jackrabbit/oak-blob/1.8.8/oak-blob-1.8.8.pom (5 KB at 313.2 KB/sec)
[INFO] Downloading: https://repo.maven.apache.org/maven2/org/apache/jackrabbit/oak-store-spi/1.8.8/oak-store-spi-1.8.8.pom
[INFO] Downloaded: https://repo.maven.apache.org/maven2/org/apache/jackrabbit/oak-store-spi/1.8.8/oak-store-spi-1.8.8.pom (6 KB at 330.9 KB/sec)
[INFO] Downloading: https://repo.maven.apache.org/maven2/org/apache/jackrabbit/oak-core/1.8.8/oak-core-1.8.8.pom
[INFO] Downloaded: https://repo.maven.apache.org/maven2/org/apache/jackrabbit/oak-core/1.8.8/oak-core-1.8.8.pom (10 KB at 643.0 KB/sec)
[INFO] Downloading: https://repo.maven.apache.org/maven2/org/apache/jackrabbit/oak-query-spi/1.8.8/oak-query-spi-1.8.8.pom
[INFO] Downloaded: https://repo.maven.apache.org/maven2/org/apache/jackrabbit/oak-query-spi/1.8.8/oak-query-spi-1.8.8.pom (5 KB at 301.9 KB/sec)
[INFO] Downloading: https://repo.maven.apache.org/maven2/org/apache/jackrabbit/oak-security-spi/1.8.8/oak-security-spi-1.8.8.pom
[INFO] Downloaded: https://repo.maven.apache.org/maven2/org/apache/jackrabbit/oak-security-spi/1.8.8/oak-security-spi-1.8.8.pom (7 KB at 62.7 KB/sec)
[INFO] Downloading: https://repo.maven.apache.org/maven2/org/apache/jackrabbit/oak-jcr/1.8.8/oak-jcr-1.8.8.pom
[INFO] Downloaded: https://repo.maven.apache.org/maven2/org/apache/jackrabbit/oak-jcr/1.8.8/oak-jcr-1.8.8.pom (21 KB at 177.1 KB/sec)
[INFO] Downloading: https://repo.maven.apache.org/maven2/org/apache/jackrabbit/oak-lucene/1.8.8/oak-lucene-1.8.8.pom
[INFO] Downloaded: https://repo.maven.apache.org/maven2/org/apache/jackrabbit/oak-lucene/1.8.8/oak-lucene-1.8.8.pom (18 KB at 78.6 KB/sec)
[INFO] Downloading: https://repo.maven.apache.org/maven2/org/apache/jackrabbit/oak-store-document/1.8.8/oak-store-document-1.8.8.pom
[INFO] Downloaded: https://repo.maven.apache.org/maven2/org/apache/jackrabbit/oak-store-document/1.8.8/oak-store-document-1.8.8.pom (11 KB at 502.4 KB/sec)
[INFO] Downloading: https://repo.maven.apache.org/maven2/org/apache/jackrabbit/oak-store-composite/1.8.8/oak-store-composite-1.8.8.pom
[INFO] Downloaded: https://repo.maven.apache.org/maven2/org/apache/jackrabbit/oak-store-composite/1.8.8/oak-store-composite-1.8.8.pom (6 KB at 23.8 KB/sec)
[INFO] Downloading: https://repo.maven.apache.org/maven2/org/apache/sling/org.apache.sling.jcr.oak.server/1.2.0/org.apache.sling.jcr.oak.server-1.2.0.pom
[INFO] Downloaded: https://repo.maven.apache.org/maven2/org/apache/sling/org.apache.sling.jcr.oak.server/1.2.0/org.apache.sling.jcr.oak.server-1.2.0.pom (9 KB at 554.3 KB/sec)
[INFO] Downloading: https://repo.maven.apache.org/maven2/org/apache/jackrabbit/oak-segment-tar/1.8.8/oak-segment-tar-1.8.8.pom
[INFO] Downloaded: https://repo.maven.apache.org/maven2/org/apache/jackrabbit/oak-segment-tar/1.8.8/oak-segment-tar-1.8.8.pom (16 KB at 150.1 KB/sec)
[INFO] Downloading: https://repo.maven.apache.org/maven2/org/apache/sling/org.apache.sling.auth.form/1.0.12/org.apache.sling.auth.form-1.0.12.pom
[INFO] Downloaded: https://repo.maven.apache.org/maven2/org/apache/sling/org.apache.sling.auth.form/1.0.12/org.apache.sling.auth.form-1.0.12.pom (7 KB at 36.0 KB/sec)
[INFO] Downloading: https://repo.maven.apache.org/maven2/org/apache/sling/org.apache.sling.extensions.webconsolesecurityprovider/1.2.0/org.apache.sling.extensions.webconsolesecurityprovider-1.2.0.pom
[INFO] Downloaded: https://repo.maven.apache.org/maven2/org/apache/sling/org.apache.sling.extensions.webconsolesecurityprovider/1.2.0/org.apache.sling.extensions.webconsolesecurityprovider-1.2.0.pom (6 KB at 29.3 KB/sec)
[INFO] Downloading: https://repo.maven.apache.org/maven2/org/apache/sling/org.apache.sling.starter.content/1.0.2/org.apache.sling.starter.content-1.0.2.pom
[INFO] Downloaded: https://repo.maven.apache.org/maven2/org/apache/sling/org.apache.sling.starter.content/1.0.2/org.apache.sling.starter.content-1.0.2.pom (5 KB at 25.1 KB/sec)
[INFO] Downloading: https://repo.maven.apache.org/maven2/org/apache/felix/org.apache.felix.http.sslfilter/1.2.6/org.apache.felix.http.sslfilter-1.2.6.pom
[INFO] Downloaded: https://repo.maven.apache.org/maven2/org/apache/felix/org.apache.felix.http.sslfilter/1.2.6/org.apache.felix.http.sslfilter-1.2.6.pom (5 KB at 26.3 KB/sec)
[INFO] Downloading: https://repo.maven.apache.org/maven2/org/apache/felix/org.apache.felix.scr/2.1.12/org.apache.felix.scr-2.1.12.pom
[INFO] Downloaded: https://repo.maven.apache.org/maven2/org/apache/felix/org.apache.felix.scr/2.1.12/org.apache.felix.scr-2.1.12.pom (15 KB at 956.8 KB/sec)
[INFO] Downloading: https://repo.maven.apache.org/maven2/org/apache/jackrabbit/jackrabbit-jcr-rmi/2.16.3/jackrabbit-jcr-rmi-2.16.3.pom
[INFO] Downloaded: https://repo.maven.apache.org/maven2/org/apache/jackrabbit/jackrabbit-jcr-rmi/2.16.3/jackrabbit-jcr-rmi-2.16.3.pom (36 KB at 1459.4 KB/sec)
[INFO] Downloading: https://repo.maven.apache.org/maven2/org/apache/jackrabbit/jackrabbit-spi-commons/2.16.3/jackrabbit-spi-commons-2.16.3.pom
[INFO] Downloaded: https://repo.maven.apache.org/maven2/org/apache/jackrabbit/jackrabbit-spi-commons/2.16.3/jackrabbit-spi-commons-2.16.3.pom (7 KB at 33.4 KB/sec)
[INFO] Downloading: https://repo.maven.apache.org/maven2/org/apache/jackrabbit/jackrabbit-spi/2.16.3/jackrabbit-spi-2.16.3.pom
[INFO] Downloaded: https://repo.maven.apache.org/maven2/org/apache/jackrabbit/jackrabbit-spi/2.16.3/jackrabbit-spi-2.16.3.pom (4 KB at 153.3 KB/sec)
[INFO] Downloading: https://repo.maven.apache.org/maven2/org/apache/jackrabbit/jackrabbit-webdav/2.16.3/jackrabbit-webdav-2.16.3.pom
[INFO] Downloaded: https://repo.maven.apache.org/maven2/org/apache/jackrabbit/jackrabbit-webdav/2.16.3/jackrabbit-webdav-2.16.3.pom (4 KB at 17.7 KB/sec)
[INFO] Downloading: http://repository.apache.org/snapshots/org/apache/sling/org.apache.sling.launchpad.integration-tests/12-SNAPSHOT/org.apache.sling.launchpad.integration-tests-12-SNAPSHOT.jar
[INFO] Downloading: http://repository.apache.org/snapshots/org/apache/sling/org.apache.sling.starter/12-SNAPSHOT/org.apache.sling.starter-12-20181019.145904-1.jar
[INFO] Downloaded: http://repository.apache.org/snapshots/org/apache/sling/org.apache.sling.starter/12-SNAPSHOT/org.apache.sling.starter-12-20181019.145904-1.jar (71851 KB at 20917.3 KB/sec)
[INFO] Downloading: https://repo.maven.apache.org/maven2/org/apache/jackrabbit/vault/org.apache.jackrabbit.vault/3.2.4/org.apache.jackrabbit.vault-3.2.4.jar
[INFO] Downloading: https://repo.maven.apache.org/maven2/org/apache/felix/org.apache.felix.configadmin/1.9.10/org.apache.felix.configadmin-1.9.10.jar
[INFO] Downloading: https://repo.maven.apache.org/maven2/org/apache/sling/org.apache.sling.auth.form/1.0.12/org.apache.sling.auth.form-1.0.12.jar
[INFO] Downloading: https://repo.maven.apache.org/maven2/org/apache/sling/org.apache.sling.extensions.webconsolesecurityprovider/1.2.0/org.apache.sling.extensions.webconsolesecurityprovider-1.2.0.jar
[INFO] Downloading: https://repo.maven.apache.org/maven2/org/apache/sling/org.apache.sling.starter.content/1.0.2/org.apache.sling.starter.content-1.0.2.jar
[INFO] Downloaded: https://repo.maven.apache.org/maven2/org/apache/sling/org.apache.sling.extensions.webconsolesecurityprovider/1.2.0/org.apache.sling.extensions.webconsolesecurityprovider-1.2.0.jar (24 KB at 346.2 KB/sec)
[INFO] Downloading: https://repo.maven.apache.org/maven2/org/apache/felix/org.apache.felix.http.sslfilter/1.2.6/org.apache.felix.http.sslfilter-1.2.6.jar
[INFO] Downloaded: https://repo.maven.apache.org/maven2/org/apache/felix/org.apache.felix.configadmin/1.9.10/org.apache.felix.configadmin-1.9.10.jar (152 KB at 1504.8 KB/sec)
[INFO] Downloading: https://repo.maven.apache.org/maven2/org/apache/felix/org.apache.felix.scr/2.1.12/org.apache.felix.scr-2.1.12.jar
[INFO] Downloaded: https://repo.maven.apache.org/maven2/org/apache/felix/org.apache.felix.scr/2.1.12/org.apache.felix.scr-2.1.12.jar (408 KB at 2754.8 KB/sec)
[INFO] Downloaded: https://repo.maven.apache.org/maven2/org/apache/felix/org.apache.felix.http.sslfilter/1.2.6/org.apache.felix.http.sslfilter-1.2.6.jar (25 KB at 98.0 KB/sec)
[INFO] Downloaded: https://repo.maven.apache.org/maven2/org/apache/sling/org.apache.sling.starter.content/1.0.2/org.apache.sling.starter.content-1.0.2.jar (144 KB at 523.6 KB/sec)
[INFO] Downloaded: https://repo.maven.apache.org/maven2/org/apache/sling/org.apache.sling.auth.form/1.0.12/org.apache.sling.auth.form-1.0.12.jar (59 KB at 209.2 KB/sec)
[INFO] Downloaded: https://repo.maven.apache.org/maven2/org/apache/jackrabbit/vault/org.apache.jackrabbit.vault/3.2.4/org.apache.jackrabbit.vault-3.2.4.jar (728 KB at 1650.4 KB/sec)
[WARNING] Attempt to (de-)serialize anonymous class hudson.maven.reporters.MavenArtifactArchiver$2; see: https://jenkins.io/redirect/serialization-of-anonymous-classes/
[JENKINS] Archiving disabled
[WARNING] Attempt to (de-)serialize anonymous class hudson.maven.reporters.MavenFingerprinter$1; see: https://jenkins.io/redirect/serialization-of-anonymous-classes/
[JENKINS] Archiving disabled[INFO] ------------------------------------------------------------------------
[INFO] BUILD FAILURE
[INFO] ------------------------------------------------------------------------
[INFO] Total time: 23.576 s
[INFO] Finished at: 2018-10-19T22:03:46+00:00

[INFO] Final Memory: 33M/4096M
[INFO] ------------------------------------------------------------------------
Waiting for Jenkins to finish collecting data[ERROR] Failed to execute goal on project org.apache.sling.launchpad.testing: Could not resolve dependencies for project org.apache.sling:org.apache.sling.launchpad.testing:slingstart:12-SNAPSHOT: Could not find artifact org.apache.sling:org.apache.sling.launchpad.integration-tests:jar:12-SNAPSHOT in Nexus (http://repository.apache.org/snapshots) -> [Help 1]
[ERROR] 
[ERROR] To see the full stack trace of the errors, re-run Maven with the -e switch.
[ERROR] Re-run Maven using the -X switch to enable full debug logging.

[ERROR] 
[ERROR] For more information about the errors and possible solutions, please read the following articles:
[ERROR] [Help 1] http://cwiki.apache.org/confluence/display/MAVEN/DependencyResolutionException
channel stopped
Archiving artifacts
Recording test results

Build failed in Jenkins: sling-org-apache-sling-launchpad-testing-10 #191

Posted by Apache Jenkins Server <je...@builds.apache.org>.
See <https://builds.apache.org/job/sling-org-apache-sling-launchpad-testing-10/191/display/redirect?page=changes>

Changes:

[rombert] SLING-7935 - Consolidate all 'launchpad-testing' modules into a single

------------------------------------------
Started by an SCM change
[EnvInject] - Loading node environment variables.
Building remotely on H33 (ubuntu xenial) in workspace <https://builds.apache.org/job/sling-org-apache-sling-launchpad-testing-10/ws/>
[WS-CLEANUP] Deleting project workspace...
[WS-CLEANUP] Done
Cloning the remote Git repository
Cloning repository https://github.com/apache/sling-org-apache-sling-launchpad-testing.git
 > git init <https://builds.apache.org/job/sling-org-apache-sling-launchpad-testing-10/ws/> # timeout=10
Fetching upstream changes from https://github.com/apache/sling-org-apache-sling-launchpad-testing.git
 > git --version # timeout=10
 > git fetch --tags --progress https://github.com/apache/sling-org-apache-sling-launchpad-testing.git +refs/heads/*:refs/remotes/origin/*
 > git config remote.origin.url https://github.com/apache/sling-org-apache-sling-launchpad-testing.git # timeout=10
 > git config --add remote.origin.fetch +refs/heads/*:refs/remotes/origin/* # timeout=10
 > git config remote.origin.url https://github.com/apache/sling-org-apache-sling-launchpad-testing.git # timeout=10
Fetching upstream changes from https://github.com/apache/sling-org-apache-sling-launchpad-testing.git
 > git fetch --tags --progress https://github.com/apache/sling-org-apache-sling-launchpad-testing.git +refs/heads/*:refs/remotes/origin/*
 > git rev-parse origin/master^{commit} # timeout=10
Checking out Revision 19f71e11e2fa56ba723cb1797cb2c91e9ae3dd0a (origin/master)
 > git config core.sparsecheckout # timeout=10
 > git checkout -f 19f71e11e2fa56ba723cb1797cb2c91e9ae3dd0a
Commit message: "SLING-7935 - Consolidate all 'launchpad-testing' modules into a single git repository"
 > git rev-list --no-walk 138ff27264968dfab0e4ea4fa254838990e8e4b3 # timeout=10
Parsing POMs
Modules changed, recalculating dependency graph
Established TCP socket on 43677
maven33-agent.jar already up to date
maven33-interceptor.jar already up to date
maven3-interceptor-commons.jar already up to date
[sling-org-apache-sling-launchpad-testing-10] $ /home/jenkins/tools/java/latest10/bin/java -Xmx4g -Xms4g -cp /home/jenkins/jenkins-slave/maven33-agent.jar:/home/jenkins/tools/maven/apache-maven-3.3.9/boot/plexus-classworlds-2.5.2.jar:/home/jenkins/tools/maven/apache-maven-3.3.9/conf/logging jenkins.maven3.agent.Maven33Main /home/jenkins/tools/maven/apache-maven-3.3.9 /home/jenkins/jenkins-slave/slave.jar /home/jenkins/jenkins-slave/maven33-interceptor.jar /home/jenkins/jenkins-slave/maven3-interceptor-commons.jar 43677
<===[JENKINS REMOTING CAPACITY]===>   channel started
Executing Maven:  -B -f <https://builds.apache.org/job/sling-org-apache-sling-launchpad-testing-10/ws/pom.xml> -Dmaven.repo.local=/home/jenkins/jenkins-slave/maven-repositories/1 -U clean verify
[INFO] Scanning for projects...
[INFO] Downloading: http://repository.apache.org/snapshots/org/apache/sling/org.apache.sling.launchpad.test-bundles/maven-metadata.xml
[INFO] Downloading: https://repo.maven.apache.org/maven2/org/apache/sling/org.apache.sling.launchpad.test-bundles/maven-metadata.xml
[INFO] Downloaded: https://repo.maven.apache.org/maven2/org/apache/sling/org.apache.sling.launchpad.test-bundles/maven-metadata.xml (393 B at 1.0 KB/sec)
[INFO] Downloaded: http://repository.apache.org/snapshots/org/apache/sling/org.apache.sling.launchpad.test-bundles/maven-metadata.xml (465 B at 1.1 KB/sec)
[INFO] Downloading: http://repository.apache.org/snapshots/org/apache/sling/org.apache.sling.launchpad.test-bundles/12-SNAPSHOT/maven-metadata.xml
[INFO] Downloaded: http://repository.apache.org/snapshots/org/apache/sling/org.apache.sling.launchpad.test-bundles/12-SNAPSHOT/maven-metadata.xml (1007 B at 3.3 KB/sec)
[INFO] Downloading: http://repository.apache.org/snapshots/org/apache/sling/org.apache.sling.starter/maven-metadata.xml
[INFO] Downloading: https://repo.maven.apache.org/maven2/org/apache/sling/org.apache.sling.starter/maven-metadata.xml
[INFO] Downloaded: https://repo.maven.apache.org/maven2/org/apache/sling/org.apache.sling.starter/maven-metadata.xml (338 B at 14.4 KB/sec)
[INFO] Downloaded: http://repository.apache.org/snapshots/org/apache/sling/org.apache.sling.starter/maven-metadata.xml (367 B at 1.3 KB/sec)
[INFO] Downloading: http://repository.apache.org/snapshots/org/apache/sling/org.apache.sling.starter/12-SNAPSHOT/maven-metadata.xml
[INFO] Downloaded: http://repository.apache.org/snapshots/org/apache/sling/org.apache.sling.starter/12-SNAPSHOT/maven-metadata.xml (2 KB at 4.8 KB/sec)
[INFO] Extended Maven classpath (scope 'provided') by the dependencies extracted from the Sling model.
[INFO]                                                                         
[INFO] ------------------------------------------------------------------------
[INFO] Building Apache Sling Launchpad Testing 12-SNAPSHOT
[INFO] ------------------------------------------------------------------------
[INFO] Downloading: http://repository.apache.org/snapshots/org/apache/sling/org.apache.sling.launchpad.integration-tests/12-SNAPSHOT/maven-metadata.xml
[INFO] Downloading: http://repository.apache.org/snapshots/org/apache/sling/org.apache.sling.launchpad.integration-tests/12-SNAPSHOT/org.apache.sling.launchpad.integration-tests-12-SNAPSHOT.pom
[WARNING] The POM for org.apache.sling:org.apache.sling.launchpad.integration-tests:jar:12-SNAPSHOT is missing, no dependency information available
[INFO] Downloading: http://repository.apache.org/snapshots/org/apache/sling/org.apache.sling.launchpad.test-fragment/maven-metadata.xml
[INFO] Downloading: https://repo.maven.apache.org/maven2/org/apache/sling/org.apache.sling.launchpad.test-fragment/maven-metadata.xml
[INFO] Downloaded: https://repo.maven.apache.org/maven2/org/apache/sling/org.apache.sling.launchpad.test-fragment/maven-metadata.xml (430 B at 19.1 KB/sec)
[INFO] Downloaded: http://repository.apache.org/snapshots/org/apache/sling/org.apache.sling.launchpad.test-fragment/maven-metadata.xml (550 B at 1.8 KB/sec)
[INFO] Downloading: http://repository.apache.org/snapshots/org/apache/sling/org.apache.sling.launchpad.test-fragment/12-SNAPSHOT/maven-metadata.xml
[INFO] Downloaded: http://repository.apache.org/snapshots/org/apache/sling/org.apache.sling.launchpad.test-fragment/12-SNAPSHOT/maven-metadata.xml (1008 B at 3.3 KB/sec)
[INFO] Downloading: http://repository.apache.org/snapshots/org/apache/sling/org.apache.sling.launchpad.test-services-war/maven-metadata.xml
[INFO] Downloading: https://repo.maven.apache.org/maven2/org/apache/sling/org.apache.sling.launchpad.test-services-war/maven-metadata.xml
[INFO] Downloaded: https://repo.maven.apache.org/maven2/org/apache/sling/org.apache.sling.launchpad.test-services-war/maven-metadata.xml (465 B at 21.6 KB/sec)
[INFO] Downloaded: http://repository.apache.org/snapshots/org/apache/sling/org.apache.sling.launchpad.test-services-war/maven-metadata.xml (594 B at 1.9 KB/sec)
[INFO] Downloading: http://repository.apache.org/snapshots/org/apache/sling/org.apache.sling.launchpad.test-services-war/12-SNAPSHOT/maven-metadata.xml
[INFO] Downloaded: http://repository.apache.org/snapshots/org/apache/sling/org.apache.sling.launchpad.test-services-war/12-SNAPSHOT/maven-metadata.xml (1012 B at 3.4 KB/sec)
[INFO] Downloading: http://repository.apache.org/snapshots/org/apache/sling/org.apache.sling.launchpad.test-services/maven-metadata.xml
[INFO] Downloading: https://repo.maven.apache.org/maven2/org/apache/sling/org.apache.sling.launchpad.test-services/maven-metadata.xml
[INFO] Downloaded: https://repo.maven.apache.org/maven2/org/apache/sling/org.apache.sling.launchpad.test-services/maven-metadata.xml (502 B at 24.5 KB/sec)
[INFO] Downloaded: http://repository.apache.org/snapshots/org/apache/sling/org.apache.sling.launchpad.test-services/maven-metadata.xml (590 B at 2.0 KB/sec)
[INFO] Downloading: http://repository.apache.org/snapshots/org/apache/sling/org.apache.sling.launchpad.test-services/12-SNAPSHOT/maven-metadata.xml
[INFO] Downloaded: http://repository.apache.org/snapshots/org/apache/sling/org.apache.sling.launchpad.test-services/12-SNAPSHOT/maven-metadata.xml (1008 B at 3.3 KB/sec)
[INFO] Downloading: http://repository.apache.org/snapshots/org/apache/sling/org.apache.sling.launchpad.integration-tests/12-SNAPSHOT/org.apache.sling.launchpad.integration-tests-12-SNAPSHOT.jar
[WARNING] Attempt to (de-)serialize anonymous class hudson.maven.reporters.MavenArtifactArchiver$2; see: https://jenkins.io/redirect/serialization-of-anonymous-classes/
[JENKINS] Archiving disabled
[WARNING] Attempt to (de-)serialize anonymous class hudson.maven.reporters.MavenFingerprinter$1; see: https://jenkins.io/redirect/serialization-of-anonymous-classes/
[JENKINS] Archiving disabled
[INFO] ------------------------------------------------------------------------
[INFO] BUILD FAILURE
[INFO] ------------------------------------------------------------------------
[INFO] Total time: 15.630 s
[INFO] Finished at: 2018-10-19T21:19:41+00:00
[INFO] Final Memory: 32M/4096M
[INFO] ------------------------------------------------------------------------
Waiting for Jenkins to finish collecting data
[ERROR] Failed to execute goal on project org.apache.sling.launchpad.testing: Could not resolve dependencies for project org.apache.sling:org.apache.sling.launchpad.testing:slingstart:12-SNAPSHOT: Could not find artifact org.apache.sling:org.apache.sling.launchpad.integration-tests:jar:12-SNAPSHOT in Nexus (http://repository.apache.org/snapshots) -> [Help 1]
[ERROR] 
[ERROR] To see the full stack trace of the errors, re-run Maven with the -e switch.
[ERROR] Re-run Maven using the -X switch to enable full debug logging.
[ERROR] 
[ERROR] For more information about the errors and possible solutions, please read the following articles:
[ERROR] [Help 1] http://cwiki.apache.org/confluence/display/MAVEN/DependencyResolutionException
channel stopped
Archiving artifacts
Recording test results