You are viewing a plain text version of this content. The canonical link for it is here.
Posted to builds@beam.apache.org by Apache Jenkins Server <je...@builds.apache.org> on 2022/02/14 14:44:29 UTC

Build failed in Jenkins: beam_LoadTests_Python_GBK_reiterate_Dataflow_Streaming #532

See <https://ci-beam.apache.org/job/beam_LoadTests_Python_GBK_reiterate_Dataflow_Streaming/532/display/redirect?page=changes>

Changes:

[akustov] fix name project id from secreton scio deploy action

[alexander.zhuravlev] [BEAM-13775] Fixed bug with run button

[ihr] [BEAM-13836] Fix the answers placeholders locations in the Python katas

[noreply] Merge pull request #16703 from [BEAM-13804][Playground][Bugfix] Add

[noreply] Merge pull request #16611 from [BEAM-13712][Playground] Add graph for

[noreply] Merge pull request #16757 from [BEAM-13655] [Playground] Persist the


------------------------------------------
[...truncated 22.30 KB...]
  Using cached google_auth-2.6.0-py2.py3-none-any.whl (156 kB)
Collecting google-cloud-datastore<2,>=1.8.0
  Using cached google_cloud_datastore-1.15.3-py2.py3-none-any.whl (134 kB)
Collecting google-cloud-pubsub<3,>=2.1.0
  Using cached google_cloud_pubsub-2.9.0-py2.py3-none-any.whl (219 kB)
Collecting google-cloud-pubsublite<2,>=1.2.0
  Using cached google_cloud_pubsublite-1.3.0-py2.py3-none-any.whl (255 kB)
Collecting google-cloud-bigquery<3,>=1.6.0
  Using cached google_cloud_bigquery-2.32.0-py2.py3-none-any.whl (205 kB)
Collecting google-cloud-bigquery-storage>=2.6.3
  Using cached google_cloud_bigquery_storage-2.11.0-py2.py3-none-any.whl (172 kB)
Collecting google-cloud-core<2,>=0.28.1
  Using cached google_cloud_core-1.7.2-py2.py3-none-any.whl (28 kB)
Collecting google-cloud-bigtable<2,>=0.31.1
  Using cached google_cloud_bigtable-1.7.0-py2.py3-none-any.whl (267 kB)
Collecting google-cloud-spanner<2,>=1.13.0
  Using cached google_cloud_spanner-1.19.1-py2.py3-none-any.whl (255 kB)
Collecting grpcio-gcp<1,>=0.2.2
  Using cached grpcio_gcp-0.2.2-py2.py3-none-any.whl (9.4 kB)
Collecting google-cloud-dlp<4,>=3.0.0
  Using cached google_cloud_dlp-3.6.0-py2.py3-none-any.whl (111 kB)
Collecting google-cloud-language<2,>=1.3.0
  Using cached google_cloud_language-1.3.0-py2.py3-none-any.whl (83 kB)
Collecting google-cloud-videointelligence<2,>=1.8.0
  Using cached google_cloud_videointelligence-1.16.1-py2.py3-none-any.whl (183 kB)
Collecting google-cloud-vision<2,>=0.38.0
  Using cached google_cloud_vision-1.0.0-py2.py3-none-any.whl (435 kB)
Collecting google-cloud-recommendations-ai<=0.2.0,>=0.1.0
  Using cached google_cloud_recommendations_ai-0.2.0-py2.py3-none-any.whl (180 kB)
Collecting boto3>=1.9
  Using cached boto3-1.20.54-py3-none-any.whl (132 kB)
Collecting azure-storage-blob>=12.3.2
  Using cached azure_storage_blob-12.9.0-py2.py3-none-any.whl (356 kB)
Collecting azure-core>=1.7.0
  Using cached azure_core-1.22.1-py3-none-any.whl (178 kB)
Requirement already satisfied: six>=1.11.0 in /home/jenkins/jenkins-slave/workspace/beam_LoadTests_Python_GBK_reiterate_Dataflow_Streaming/src/build/gradleenv/1329484227/lib/python3.7/site-packages (from azure-core>=1.7.0->apache-beam==2.38.0.dev0) (1.16.0)
Collecting msrest>=0.6.21
  Using cached msrest-0.6.21-py2.py3-none-any.whl (85 kB)
Collecting jmespath<1.0.0,>=0.7.1
  Using cached jmespath-0.10.0-py2.py3-none-any.whl (24 kB)
Collecting s3transfer<0.6.0,>=0.5.0
  Using cached s3transfer-0.5.1-py3-none-any.whl (79 kB)
Collecting botocore<1.24.0,>=1.23.54
  Using cached botocore-1.23.54-py3-none-any.whl (8.5 MB)
Collecting cffi>=1.12
  Using cached cffi-1.15.0-cp37-cp37m-manylinux_2_12_x86_64.manylinux2010_x86_64.whl (427 kB)
Collecting fasteners>=0.14
  Using cached fasteners-0.17.3-py3-none-any.whl (18 kB)
Collecting rsa<5,>=3.1.4
  Using cached rsa-4.8-py3-none-any.whl (39 kB)
Collecting pyasn1-modules>=0.2.1
  Using cached pyasn1_modules-0.2.8-py2.py3-none-any.whl (155 kB)
Collecting google-api-core[grpc]<3.0.0dev,>=1.29.0
  Using cached google_api_core-2.5.0-py2.py3-none-any.whl (111 kB)
Collecting google-resumable-media<3.0dev,>=0.6.0
  Using cached google_resumable_media-2.2.1-py2.py3-none-any.whl (75 kB)
Requirement already satisfied: packaging>=14.3 in /home/jenkins/jenkins-slave/workspace/beam_LoadTests_Python_GBK_reiterate_Dataflow_Streaming/src/build/gradleenv/1329484227/lib/python3.7/site-packages (from google-cloud-bigquery<3,>=1.6.0->apache-beam==2.38.0.dev0) (21.3)
Collecting libcst>=0.2.5
  Using cached libcst-0.4.1-cp37-cp37m-manylinux_2_17_x86_64.manylinux2014_x86_64.whl (2.7 MB)
Collecting grpc-google-iam-v1<0.13dev,>=0.12.3
  Using cached grpc_google_iam_v1-0.12.3-py3-none-any.whl
Collecting google-api-core[grpc]<3.0.0dev,>=1.29.0
  Using cached google_api_core-1.31.5-py2.py3-none-any.whl (93 kB)
Collecting google-auth<3,>=1.18.0
  Using cached google_auth-1.35.0-py2.py3-none-any.whl (152 kB)
Requirement already satisfied: setuptools>=40.3.0 in /home/jenkins/jenkins-slave/workspace/beam_LoadTests_Python_GBK_reiterate_Dataflow_Streaming/src/build/gradleenv/1329484227/lib/python3.7/site-packages (from google-auth<3,>=1.18.0->apache-beam==2.38.0.dev0) (60.9.0)
Collecting grpcio-status>=1.18.0
  Using cached grpcio_status-1.43.0-py3-none-any.whl (10.0 kB)
Collecting overrides<7.0.0,>=6.0.1
  Using cached overrides-6.1.0-py3-none-any.whl (14 kB)
Collecting docopt
  Using cached docopt-0.6.2-py2.py3-none-any.whl
Collecting pyparsing<3,>=2.4.2
  Using cached pyparsing-2.4.7-py2.py3-none-any.whl (67 kB)
Collecting pbr>=0.11
  Using cached pbr-5.8.1-py2.py3-none-any.whl (113 kB)
Collecting pyasn1>=0.1.7
  Using cached pyasn1-0.4.8-py2.py3-none-any.whl (77 kB)
Requirement already satisfied: importlib-metadata>=0.12 in /home/jenkins/jenkins-slave/workspace/beam_LoadTests_Python_GBK_reiterate_Dataflow_Streaming/src/build/gradleenv/1329484227/lib/python3.7/site-packages (from pytest<5.0,>=4.4.0->apache-beam==2.38.0.dev0) (2.1.3)
Collecting atomicwrites>=1.0
  Using cached atomicwrites-1.4.0-py2.py3-none-any.whl (6.8 kB)
Collecting more-itertools>=4.0.0
  Using cached more_itertools-8.12.0-py3-none-any.whl (54 kB)
Collecting pluggy<1.0,>=0.12
  Using cached pluggy-0.13.1-py2.py3-none-any.whl (18 kB)
Requirement already satisfied: py>=1.5.0 in /home/jenkins/jenkins-slave/workspace/beam_LoadTests_Python_GBK_reiterate_Dataflow_Streaming/src/build/gradleenv/1329484227/lib/python3.7/site-packages (from pytest<5.0,>=4.4.0->apache-beam==2.38.0.dev0) (1.11.0)
Collecting attrs>=17.4.0
  Using cached attrs-21.4.0-py2.py3-none-any.whl (60 kB)
Collecting wcwidth
  Using cached wcwidth-0.2.5-py2.py3-none-any.whl (30 kB)
Collecting execnet>=1.1
  Using cached execnet-1.9.0-py2.py3-none-any.whl (39 kB)
Collecting pytest-forked
  Using cached pytest_forked-1.4.0-py3-none-any.whl (4.9 kB)
Collecting certifi>=2017.4.17
  Using cached certifi-2021.10.8-py2.py3-none-any.whl (149 kB)
Collecting urllib3<1.27,>=1.21.1
  Using cached urllib3-1.26.8-py2.py3-none-any.whl (138 kB)
Collecting idna<4,>=2.5
  Using cached idna-3.3-py3-none-any.whl (61 kB)
Collecting charset-normalizer~=2.0.0
  Using cached charset_normalizer-2.0.12-py3-none-any.whl (39 kB)
Collecting greenlet!=0.4.17
  Using cached greenlet-1.1.2-cp37-cp37m-manylinux_2_17_x86_64.manylinux2014_x86_64.whl (150 kB)
Collecting docker
  Using cached docker-5.0.3-py2.py3-none-any.whl (146 kB)
Collecting wrapt
  Using cached wrapt-1.13.3-cp37-cp37m-manylinux_2_5_x86_64.manylinux1_x86_64.manylinux_2_12_x86_64.manylinux2010_x86_64.whl (79 kB)
Collecting deprecation
  Using cached deprecation-2.1.0-py2.py3-none-any.whl (11 kB)
Collecting pymysql
  Using cached PyMySQL-1.0.2-py3-none-any.whl (43 kB)
Collecting pycparser
  Using cached pycparser-2.21-py2.py3-none-any.whl (118 kB)
Collecting googleapis-common-protos<2.0dev,>=1.6.0
  Using cached googleapis_common_protos-1.54.0-py2.py3-none-any.whl (207 kB)
Collecting google-crc32c<2.0dev,>=1.0
  Using cached google_crc32c-1.3.0-cp37-cp37m-manylinux_2_12_x86_64.manylinux2010_x86_64.whl (38 kB)
Requirement already satisfied: zipp>=0.5 in /home/jenkins/jenkins-slave/workspace/beam_LoadTests_Python_GBK_reiterate_Dataflow_Streaming/src/build/gradleenv/1329484227/lib/python3.7/site-packages (from importlib-metadata>=0.12->pytest<5.0,>=4.4.0->apache-beam==2.38.0.dev0) (3.7.0)
Collecting typing-inspect>=0.4.0
  Using cached typing_inspect-0.7.1-py3-none-any.whl (8.4 kB)
Collecting isodate>=0.6.0
  Using cached isodate-0.6.1-py2.py3-none-any.whl (41 kB)
Collecting requests-oauthlib>=0.5.0
  Using cached requests_oauthlib-1.3.1-py2.py3-none-any.whl (23 kB)
Collecting typing-utils>=0.0.3
  Using cached typing_utils-0.1.0-py3-none-any.whl (10 kB)
Collecting websocket-client>=0.32.0
  Using cached websocket_client-1.2.3-py3-none-any.whl (53 kB)
Collecting oauthlib>=3.0.0
  Using cached oauthlib-3.2.0-py3-none-any.whl (151 kB)
Collecting mypy-extensions>=0.3.0
  Using cached mypy_extensions-0.4.3-py2.py3-none-any.whl (4.5 kB)
Building wheels for collected packages: apache-beam
  Building wheel for apache-beam (setup.py): started
  Building wheel for apache-beam (setup.py): finished with status 'done'
  Created wheel for apache-beam: filename=apache_beam-2.38.0.dev0-py3-none-any.whl size=2659546 sha256=b229762400240154955ad8fed1db62ca9fbb2adedc39e957f3a17f74fed86f0b
  Stored in directory: /home/jenkins/.cache/pip/wheels/a0/48/d5/c79f878961d315cf20a7fe172ed62d6563f8affca153a46683
Successfully built apache-beam
Installing collected packages: wcwidth, pytz, pyasn1, parameterized, mypy-extensions, docopt, crcmod, certifi, wrapt, websocket-client, urllib3, typing-utils, typing-extensions, tenacity, rsa, pyyaml, python-dateutil, pyparsing, pymysql, pymongo, pyhamcrest, pycparser, pyasn1-modules, psycopg2-binary, proto-plus, pbr, orjson, oauthlib, numpy, more-itertools, jmespath, isodate, idna, greenlet, googleapis-common-protos, google-crc32c, fasteners, fastavro, execnet, dill, cloudpickle, charset-normalizer, cachetools, attrs, atomicwrites, typing-inspect, sqlalchemy, requests, pydot, pyarrow, pluggy, pandas, overrides, mock, httplib2, grpcio-status, grpcio-gcp, google-resumable-media, google-auth, freezegun, cffi, botocore, s3transfer, requests-oauthlib, requests_mock, pytest, oauth2client, libcst, hdfs, grpc-google-iam-v1, google-api-core, docker, deprecation, cryptography, azure-core, testcontainers, pytest-timeout, pytest-forked, msrest, google-cloud-core, google-apitools, boto3, apache-beam, pytest-xdist, google-cloud-vision, google-cloud-videointelligence, google-cloud-spanner, google-cloud-recommendations-ai, google-cloud-pubsub, google-cloud-language, google-cloud-dlp, google-cloud-datastore, google-cloud-bigtable, google-cloud-bigquery-storage, google-cloud-bigquery, azure-storage-blob, google-cloud-pubsublite
  Attempting uninstall: pyparsing
    Found existing installation: pyparsing 3.0.7
    Uninstalling pyparsing-3.0.7:
      Successfully uninstalled pyparsing-3.0.7
  Attempting uninstall: pluggy
    Found existing installation: pluggy 1.0.0
    Uninstalling pluggy-1.0.0:
      Successfully uninstalled pluggy-1.0.0
Successfully installed apache-beam-2.38.0.dev0 atomicwrites-1.4.0 attrs-21.4.0 azure-core-1.22.1 azure-storage-blob-12.9.0 boto3-1.20.54 botocore-1.23.54 cachetools-4.2.4 certifi-2021.10.8 cffi-1.15.0 charset-normalizer-2.0.12 cloudpickle-2.0.0 crcmod-1.7 cryptography-36.0.1 deprecation-2.1.0 dill-0.3.1.1 docker-5.0.3 docopt-0.6.2 execnet-1.9.0 fastavro-1.4.9 fasteners-0.17.3 freezegun-1.1.0 google-api-core-1.31.5 google-apitools-0.5.31 google-auth-1.35.0 google-cloud-bigquery-2.32.0 google-cloud-bigquery-storage-2.11.0 google-cloud-bigtable-1.7.0 google-cloud-core-1.7.2 google-cloud-datastore-1.15.3 google-cloud-dlp-3.6.0 google-cloud-language-1.3.0 google-cloud-pubsub-2.9.0 google-cloud-pubsublite-1.3.0 google-cloud-recommendations-ai-0.2.0 google-cloud-spanner-1.19.1 google-cloud-videointelligence-1.16.1 google-cloud-vision-1.0.0 google-crc32c-1.3.0 google-resumable-media-2.2.1 googleapis-common-protos-1.54.0 greenlet-1.1.2 grpc-google-iam-v1-0.12.3 grpcio-gcp-0.2.2 grpcio-status-1.43.0 hdfs-2.6.0 httplib2-0.19.1 idna-3.3 isodate-0.6.1 jmespath-0.10.0 libcst-0.4.1 mock-2.0.0 more-itertools-8.12.0 msrest-0.6.21 mypy-extensions-0.4.3 numpy-1.21.5 oauth2client-4.1.3 oauthlib-3.2.0 orjson-3.6.6 overrides-6.1.0 pandas-1.3.5 parameterized-0.7.5 pbr-5.8.1 pluggy-0.13.1 proto-plus-1.20.0 psycopg2-binary-2.9.3 pyarrow-6.0.1 pyasn1-0.4.8 pyasn1-modules-0.2.8 pycparser-2.21 pydot-1.4.2 pyhamcrest-1.10.1 pymongo-3.12.3 pymysql-1.0.2 pyparsing-2.4.7 pytest-4.6.11 pytest-forked-1.4.0 pytest-timeout-1.4.2 pytest-xdist-1.34.0 python-dateutil-2.8.2 pytz-2021.3 pyyaml-6.0 requests-2.27.1 requests-oauthlib-1.3.1 requests_mock-1.9.3 rsa-4.8 s3transfer-0.5.1 sqlalchemy-1.4.31 tenacity-5.1.5 testcontainers-3.4.2 typing-extensions-4.1.1 typing-inspect-0.7.1 typing-utils-0.1.0 urllib3-1.26.8 wcwidth-0.2.5 websocket-client-1.2.3 wrapt-1.13.3

> Task :sdks:python:apache_beam:testing:load_tests:run
INFO:apache_beam.runners.portability.stager:Copying Beam SDK "/home/jenkins/jenkins-slave/workspace/beam_LoadTests_Python_GBK_reiterate_Dataflow_Streaming/src/sdks/python/build/apache-beam.tar.gz" to staging location.
WARNING:root:Make sure that locally built Python SDK docker image has Python 3.7 interpreter.
INFO:root:Default Python SDK image for environment is apache/beam_python3.7_sdk:2.38.0.dev
INFO:root:Using provided Python SDK container image: gcr.io/cloud-dataflow/v1beta3/python37-fnapi:beam-master-20220208
INFO:root:Python SDK container image set to "gcr.io/cloud-dataflow/v1beta3/python37-fnapi:beam-master-20220208" for Docker environment
INFO:apache_beam.runners.dataflow.internal.apiclient:Defaulting to the temp_location as staging_location: gs://temp-storage-for-perf-tests/loadtests
INFO:apache_beam.internal.gcp.auth:Setting socket default timeout to 60 seconds.
INFO:apache_beam.internal.gcp.auth:socket default timeout is 60.0 seconds.
INFO:apache_beam.runners.dataflow.internal.apiclient:Starting GCS upload to gs://temp-storage-for-perf-tests/loadtests/load-tests-python-dataflow-streaming-gbk-6-0214125447.1644849450.371063/dataflow_python_sdk.tar...
INFO:oauth2client.transport:Attempting refresh to obtain initial access_token
INFO:oauth2client.transport:Attempting refresh to obtain initial access_token
INFO:apache_beam.runners.dataflow.internal.apiclient:Completed GCS upload to gs://temp-storage-for-perf-tests/loadtests/load-tests-python-dataflow-streaming-gbk-6-0214125447.1644849450.371063/dataflow_python_sdk.tar in 0 seconds.
INFO:apache_beam.runners.dataflow.internal.apiclient:Starting GCS upload to gs://temp-storage-for-perf-tests/loadtests/load-tests-python-dataflow-streaming-gbk-6-0214125447.1644849450.371063/pipeline.pb...
INFO:apache_beam.runners.dataflow.internal.apiclient:Completed GCS upload to gs://temp-storage-for-perf-tests/loadtests/load-tests-python-dataflow-streaming-gbk-6-0214125447.1644849450.371063/pipeline.pb in 0 seconds.
WARNING:apache_beam.options.pipeline_options:Discarding unparseable args: ['--iterations=4', '--fanout=1', 'shuffle_mode=appliance']
WARNING:apache_beam.options.pipeline_options:Discarding unparseable args: ['--iterations=4', '--fanout=1', 'shuffle_mode=appliance']
INFO:apache_beam.runners.dataflow.internal.apiclient:Create job: <Job
 clientRequestId: '20220214143730372024-7590'
 createTime: '2022-02-14T14:37:31.194638Z'
 currentStateTime: '1970-01-01T00:00:00Z'
 id: '2022-02-14_06_37_30-5475795378688271864'
 location: 'us-central1'
 name: 'load-tests-python-dataflow-streaming-gbk-6-0214125447'
 projectId: 'apache-beam-testing'
 stageStates: []
 startTime: '2022-02-14T14:37:31.194638Z'
 steps: []
 tempFiles: []
 type: TypeValueValuesEnum(JOB_TYPE_STREAMING, 2)>
INFO:apache_beam.runners.dataflow.internal.apiclient:Created job with id: [2022-02-14_06_37_30-5475795378688271864]
INFO:apache_beam.runners.dataflow.internal.apiclient:Submitted job: 2022-02-14_06_37_30-5475795378688271864
INFO:apache_beam.runners.dataflow.internal.apiclient:To access the Dataflow monitoring console, please navigate to https://console.cloud.google.com/dataflow/jobs/us-central1/2022-02-14_06_37_30-5475795378688271864?project=apache-beam-testing
INFO:apache_beam.runners.dataflow.dataflow_runner:Job 2022-02-14_06_37_30-5475795378688271864 is in state JOB_STATE_PENDING
INFO:apache_beam.runners.dataflow.dataflow_runner:2022-02-14T14:37:35.497Z: JOB_MESSAGE_BASIC: Worker configuration: e2-standard-2 in us-central1-b.
INFO:apache_beam.runners.dataflow.dataflow_runner:2022-02-14T14:37:36.192Z: JOB_MESSAGE_DETAILED: Expanding SplittableParDo operations into optimizable parts.
INFO:apache_beam.runners.dataflow.dataflow_runner:2022-02-14T14:37:36.223Z: JOB_MESSAGE_DETAILED: Expanding CollectionToSingleton operations into optimizable parts.
INFO:apache_beam.runners.dataflow.dataflow_runner:2022-02-14T14:37:36.290Z: JOB_MESSAGE_DETAILED: Expanding CoGroupByKey operations into optimizable parts.
INFO:apache_beam.runners.dataflow.dataflow_runner:2022-02-14T14:37:36.324Z: JOB_MESSAGE_DEBUG: Combiner lifting skipped for step GroupByKey 0: GroupByKey not followed by a combiner.
INFO:apache_beam.runners.dataflow.dataflow_runner:2022-02-14T14:37:36.372Z: JOB_MESSAGE_DETAILED: Expanding SplittableProcessKeyed operations into optimizable parts.
INFO:apache_beam.runners.dataflow.dataflow_runner:2022-02-14T14:37:36.403Z: JOB_MESSAGE_DETAILED: Expanding GroupByKey operations into streaming Read/Write steps
INFO:apache_beam.runners.dataflow.dataflow_runner:2022-02-14T14:37:36.472Z: JOB_MESSAGE_DETAILED: Lifting ValueCombiningMappingFns into MergeBucketsMappingFns
INFO:apache_beam.runners.dataflow.dataflow_runner:2022-02-14T14:37:36.540Z: JOB_MESSAGE_DEBUG: Annotating graph with Autotuner information.
INFO:apache_beam.runners.dataflow.dataflow_runner:2022-02-14T14:37:36.579Z: JOB_MESSAGE_DETAILED: Fusing adjacent ParDo, Read, Write, and Flatten operations
INFO:apache_beam.runners.dataflow.dataflow_runner:2022-02-14T14:37:36.607Z: JOB_MESSAGE_DETAILED: Fusing consumer Read/Map(<lambda at iobase.py:898>) into Read/Impulse
INFO:apache_beam.runners.dataflow.dataflow_runner:2022-02-14T14:37:36.632Z: JOB_MESSAGE_DETAILED: Fusing consumer ref_AppliedPTransform_Read-SDFBoundedSourceReader-ParDo-SDFBoundedSourceDoFn-_6/PairWithRestriction into Read/Map(<lambda at iobase.py:898>)
INFO:apache_beam.runners.dataflow.dataflow_runner:2022-02-14T14:37:36.654Z: JOB_MESSAGE_DETAILED: Fusing consumer ref_AppliedPTransform_Read-SDFBoundedSourceReader-ParDo-SDFBoundedSourceDoFn-_6/SplitWithSizing into ref_AppliedPTransform_Read-SDFBoundedSourceReader-ParDo-SDFBoundedSourceDoFn-_6/PairWithRestriction
INFO:apache_beam.runners.dataflow.dataflow_runner:2022-02-14T14:37:36.678Z: JOB_MESSAGE_DETAILED: Fusing consumer Measure time: Start into ref_AppliedPTransform_Read-SDFBoundedSourceReader-ParDo-SDFBoundedSourceDoFn-_6/ProcessElementAndRestrictionWithSizing
INFO:apache_beam.runners.dataflow.dataflow_runner:2022-02-14T14:37:36.707Z: JOB_MESSAGE_DETAILED: Fusing consumer Assign timestamps into Measure time: Start
INFO:apache_beam.runners.dataflow.dataflow_runner:2022-02-14T14:37:36.740Z: JOB_MESSAGE_DETAILED: Fusing consumer GroupByKey 0/WriteStream into Assign timestamps
INFO:apache_beam.runners.dataflow.dataflow_runner:2022-02-14T14:37:36.788Z: JOB_MESSAGE_DETAILED: Fusing consumer GroupByKey 0/MergeBuckets into GroupByKey 0/ReadStream
INFO:apache_beam.runners.dataflow.dataflow_runner:2022-02-14T14:37:36.826Z: JOB_MESSAGE_DETAILED: Fusing consumer Ungroup 0 into GroupByKey 0/MergeBuckets
INFO:apache_beam.runners.dataflow.dataflow_runner:2022-02-14T14:37:36.876Z: JOB_MESSAGE_DETAILED: Fusing consumer Measure latency 0 into Ungroup 0
INFO:apache_beam.runners.dataflow.dataflow_runner:2022-02-14T14:37:36.913Z: JOB_MESSAGE_DETAILED: Fusing consumer Measure time: End 0 into Measure latency 0
INFO:apache_beam.runners.dataflow.dataflow_runner:2022-02-14T14:37:37.073Z: JOB_MESSAGE_DEBUG: Workflow config is missing a default resource spec.
INFO:apache_beam.runners.dataflow.dataflow_runner:2022-02-14T14:37:37.107Z: JOB_MESSAGE_DEBUG: Adding StepResource setup and teardown to workflow graph.
INFO:apache_beam.runners.dataflow.dataflow_runner:2022-02-14T14:37:37.155Z: JOB_MESSAGE_DEBUG: Adding workflow start and stop steps.
INFO:apache_beam.runners.dataflow.dataflow_runner:2022-02-14T14:37:37.187Z: JOB_MESSAGE_DEBUG: Assigning stage ids.
INFO:apache_beam.runners.dataflow.dataflow_runner:2022-02-14T14:37:37.245Z: JOB_MESSAGE_DEBUG: Starting **** pool setup.
INFO:apache_beam.runners.dataflow.dataflow_runner:2022-02-14T14:37:37.277Z: JOB_MESSAGE_BASIC: Starting 5 ****s in us-central1-b...
INFO:apache_beam.runners.dataflow.dataflow_runner:2022-02-14T14:37:37.311Z: JOB_MESSAGE_DEBUG: Starting **** pool setup.
INFO:apache_beam.runners.dataflow.dataflow_runner:Job 2022-02-14_06_37_30-5475795378688271864 is in state JOB_STATE_RUNNING
INFO:apache_beam.runners.dataflow.dataflow_runner:2022-02-14T14:38:01.435Z: JOB_MESSAGE_BASIC: Your project already contains 100 Dataflow-created metric descriptors, so new user metrics of the form custom.googleapis.com/* will not be created. However, all user metrics are also available in the metric dataflow.googleapis.com/job/user_counter. If you rely on the custom metrics, you can delete old / unused metric descriptors. See https://developers.google.com/apis-explorer/#p/monitoring/v3/monitoring.projects.metricDescriptors.list and https://developers.google.com/apis-explorer/#p/monitoring/v3/monitoring.projects.metricDescriptors.delete
INFO:apache_beam.runners.dataflow.dataflow_runner:2022-02-14T14:38:19.765Z: JOB_MESSAGE_DETAILED: Autoscaling: Raised the number of ****s to 5 so that the pipeline can catch up with its backlog and keep up with its input rate.
INFO:apache_beam.runners.dataflow.dataflow_runner:2022-02-14T14:38:44.807Z: JOB_MESSAGE_DETAILED: Workers have started successfully.
INFO:apache_beam.runners.dataflow.dataflow_runner:2022-02-14T14:38:44.839Z: JOB_MESSAGE_DETAILED: Workers have started successfully.
FATAL: command execution failed
java.io.IOException: Backing channel 'apache-beam-jenkins-10' is disconnected.
	at hudson.remoting.RemoteInvocationHandler.channelOrFail(RemoteInvocationHandler.java:216)
	at hudson.remoting.RemoteInvocationHandler.invoke(RemoteInvocationHandler.java:286)
	at com.sun.proxy.$Proxy135.isAlive(Unknown Source)
	at hudson.Launcher$RemoteLauncher$ProcImpl.isAlive(Launcher.java:1211)
	at hudson.Launcher$RemoteLauncher$ProcImpl.join(Launcher.java:1203)
	at hudson.Launcher$ProcStarter.join(Launcher.java:523)
	at hudson.plugins.gradle.Gradle.perform(Gradle.java:317)
	at hudson.tasks.BuildStepMonitor$1.perform(BuildStepMonitor.java:20)
	at hudson.model.AbstractBuild$AbstractBuildExecution.perform(AbstractBuild.java:803)
	at hudson.model.Build$BuildExecution.build(Build.java:197)
	at hudson.model.Build$BuildExecution.doRun(Build.java:163)
	at hudson.model.AbstractBuild$AbstractBuildExecution.run(AbstractBuild.java:513)
	at hudson.model.Run.execute(Run.java:1906)
	at hudson.model.FreeStyleBuild.run(FreeStyleBuild.java:43)
	at hudson.model.ResourceController.execute(ResourceController.java:97)
	at hudson.model.Executor.run(Executor.java:429)
Caused by: java.io.IOException: Unexpected termination of the channel
	at hudson.remoting.SynchronousCommandTransport$ReaderThread.run(SynchronousCommandTransport.java:75)
Caused by: java.io.EOFException
	at java.io.ObjectInputStream$PeekInputStream.readFully(ObjectInputStream.java:2799)
	at java.io.ObjectInputStream$BlockDataInputStream.readShort(ObjectInputStream.java:3274)
	at java.io.ObjectInputStream.readStreamHeader(ObjectInputStream.java:934)
	at java.io.ObjectInputStream.<init>(ObjectInputStream.java:396)
	at hudson.remoting.ObjectInputStreamEx.<init>(ObjectInputStreamEx.java:49)
	at hudson.remoting.Command.readFrom(Command.java:142)
	at hudson.remoting.Command.readFrom(Command.java:128)
	at hudson.remoting.AbstractSynchronousByteArrayCommandTransport.read(AbstractSynchronousByteArrayCommandTransport.java:35)
	at hudson.remoting.SynchronousCommandTransport$ReaderThread.run(SynchronousCommandTransport.java:61)
Build step 'Invoke Gradle script' changed build result to FAILURE
Build step 'Invoke Gradle script' marked build as failure
ERROR: apache-beam-jenkins-10 is offline; cannot locate jdk_1.8_latest

---------------------------------------------------------------------
To unsubscribe, e-mail: builds-unsubscribe@beam.apache.org
For additional commands, e-mail: builds-help@beam.apache.org


Jenkins build is back to normal : beam_LoadTests_Python_GBK_reiterate_Dataflow_Streaming #533

Posted by Apache Jenkins Server <je...@builds.apache.org>.
See <https://ci-beam.apache.org/job/beam_LoadTests_Python_GBK_reiterate_Dataflow_Streaming/533/display/redirect?page=changes>


---------------------------------------------------------------------
To unsubscribe, e-mail: builds-unsubscribe@beam.apache.org
For additional commands, e-mail: builds-help@beam.apache.org