You are viewing a plain text version of this content. The canonical link for it is here.
Posted to builds@cassandra.apache.org by Apache Jenkins Server <je...@builds.apache.org> on 2025/02/17 22:25:05 UTC
Build complete: Cassandra-trunk #2027 [UNSTABLE] ebbdd8bb81cff1f120ae86a59a3934f26c30b6b7
-------------------------------------------------------------------------------
Build Cassandra-trunk #2027 Still Unstable
URL: https://ci-cassandra.apache.org/job/Cassandra-trunk/2027/
-------------------------------------------------------------------------------
Changes:
No changes
-------------------------------------------------------------------------------
Failed Tests:
19 tests failed.
FAILED: org.apache.cassandra.db.compaction.CompactionStrategyManagerTest.Tests / test-latest jdk17 6/8 / testAutomaticUpgradeConcurrency-latest_jdk17_x86_64
FAILED: org.apache.cassandra.fuzz.sai.MultiNodeSAITest.Tests / jvm-dtest jdk17 4/12 / indexOnlySaiTest-cassandra.testtag_IS_UNDEFINED
FAILED: org.apache.cassandra.fuzz.sai.MultiNodeSAITest.Tests / jvm-dtest jdk11 4/12 / mixedFilteringSaiTest-cassandra.testtag_IS_UNDEFINED
FAILED: org.apache.cassandra.transport.SimpleClientPerfTest.Tests / test-burn jdk11 2/2 / measureLargeWithCompression[5/v5]-_jdk11_x86_64
FAILED: org.apache.cassandra.transport.SimpleClientPerfTest.Tests / test-burn jdk17 2/2 / measureLargeWithCompression[5/v5]-_jdk17_x86_64
FAILED: org.apache.cassandra.transport.SimpleClientPerfTest.Tests / test-burn jdk11 2/2 / measureLargeWithCompression[6/v6-beta]-_jdk11_x86_64
FAILED: org.apache.cassandra.transport.SimpleClientPerfTest.Tests / test-burn jdk17 2/2 / measureLargeWithCompression[6/v6-beta]-_jdk17_x86_64
FAILED: org.apache.cassandra.transport.SimpleClientPerfTest.Tests / test-burn jdk11 2/2 / measureLarge[5/v5]-_jdk11_x86_64
FAILED: org.apache.cassandra.transport.SimpleClientPerfTest.Tests / test-burn jdk17 2/2 / measureLarge[5/v5]-_jdk17_x86_64
FAILED: org.apache.cassandra.transport.SimpleClientPerfTest.Tests / test-burn jdk11 2/2 / measureLarge[6/v6-beta]-_jdk11_x86_64
FAILED: org.apache.cassandra.transport.SimpleClientPerfTest.Tests / test-burn jdk17 2/2 / measureLarge[6/v6-beta]-_jdk17_x86_64
FAILED: org.apache.cassandra.db.compaction.CorruptedSSTablesCompactionsTest.Tests / test-compression jdk11 8/8 / testCorruptedSSTablesWithUnifiedCompactionStrategyParallelized-compression_jdk11_x86_64
FAILED: org.apache.cassandra.db.compaction.CorruptedSSTablesCompactionsTest.Tests / test-compression jdk17 8/8 / testCorruptedSSTablesWithUnifiedCompactionStrategyParallelized-compression_jdk17_x86_64
FAILED: org.apache.cassandra.db.compaction.CorruptedSSTablesCompactionsTest.Tests / test-compression jdk11 8/8 / testCorruptedSSTablesWithLeveledCompactionStrategy-compression_jdk11_x86_64
FAILED: org.apache.cassandra.db.compaction.CorruptedSSTablesCompactionsTest.Tests / test-compression jdk17 8/8 / testCorruptedSSTablesWithLeveledCompactionStrategy-compression_jdk17_x86_64
FAILED: org.apache.cassandra.db.compaction.CorruptedSSTablesCompactionsTest.Tests / test-compression jdk11 8/8 / testCorruptedSSTablesWithSizeTieredCompactionStrategy-compression_jdk11_x86_64
FAILED: org.apache.cassandra.db.compaction.CorruptedSSTablesCompactionsTest.Tests / test-compression jdk17 8/8 / testCorruptedSSTablesWithSizeTieredCompactionStrategy-compression_jdk17_x86_64
FAILED: org.apache.cassandra.db.compaction.CorruptedSSTablesCompactionsTest.Tests / test-compression jdk11 8/8 / testCorruptedSSTablesWithUnifiedCompactionStrategy-compression_jdk11_x86_64
FAILED: org.apache.cassandra.db.compaction.CorruptedSSTablesCompactionsTest.Tests / test-compression jdk17 8/8 / testCorruptedSSTablesWithUnifiedCompactionStrategy-compression_jdk17_x86_64
-------------------------------------------------------------------------------
For complete test report and logs see https://nightlies.apache.org/cassandra/Cassandra-trunk/2027/