You are viewing a plain text version of this content. The canonical link for it is here.
Posted to builds@solr.apache.org by Apache Jenkins Server <je...@builds.apache.org> on 2026/01/06 18:50:27 UTC
[JENKINS] Solr » Solr-Test-9.x - Build # 10060 - Still Failing!
Build: https://ci-builds.apache.org/job/Solr/job/Solr-Test-9.x/10060/
No tests ran.
Build Log:
[...truncated 17 lines...]
ERROR: Error cloning remote repo 'origin'
hudson.plugins.git.GitException: Command "git fetch --tags --force --progress -- https://gitbox.apache.org/repos/asf/solr.git +refs/heads/*:refs/remotes/origin/*" returned status code 128:
stdout:
stderr: error: RPC failed; curl 56 Recv failure: Connection reset by peer
error: 84 bytes of body are still expected
fatal: expected flush after ref listing
at PluginClassLoader for git-client//org.jenkinsci.plugins.gitclient.CliGitAPIImpl.launchCommandIn(CliGitAPIImpl.java:2848)
at PluginClassLoader for git-client//org.jenkinsci.plugins.gitclient.CliGitAPIImpl.launchCommandWithCredentials(CliGitAPIImpl.java:2184)
at PluginClassLoader for git-client//org.jenkinsci.plugins.gitclient.CliGitAPIImpl$1.execute(CliGitAPIImpl.java:635)
at PluginClassLoader for git-client//org.jenkinsci.plugins.gitclient.CliGitAPIImpl$2.execute(CliGitAPIImpl.java:877)
at PluginClassLoader for git-client//org.jenkinsci.plugins.gitclient.RemoteGitImpl$CommandInvocationHandler$GitCommandMasterToSlaveCallable.call(RemoteGitImpl.java:170)
at PluginClassLoader for git-client//org.jenkinsci.plugins.gitclient.RemoteGitImpl$CommandInvocationHandler$GitCommandMasterToSlaveCallable.call(RemoteGitImpl.java:161)
at hudson.remoting.UserRequest.perform(UserRequest.java:225)
at hudson.remoting.UserRequest.perform(UserRequest.java:50)
at hudson.remoting.Request$2.run(Request.java:391)
at hudson.remoting.InterceptingExecutorService.lambda$wrap$0(InterceptingExecutorService.java:81)
at java.base/java.util.concurrent.FutureTask.run(FutureTask.java:264)
at java.base/java.util.concurrent.ThreadPoolExecutor.runWorker(ThreadPoolExecutor.java:1136)
at java.base/java.util.concurrent.ThreadPoolExecutor$Worker.run(ThreadPoolExecutor.java:635)
at java.base/java.lang.Thread.run(Thread.java:840)
Suppressed: hudson.remoting.Channel$CallSiteStackTrace: Remote call to lucene-solr-3
at hudson.remoting.Channel.attachCallSiteStackTrace(Channel.java:1923)
at hudson.remoting.UserRequest$ExceptionResponse.retrieve(UserRequest.java:384)
at hudson.remoting.Channel.call(Channel.java:1112)
at PluginClassLoader for git-client//org.jenkinsci.plugins.gitclient.RemoteGitImpl$CommandInvocationHandler.execute(RemoteGitImpl.java:153)
at jdk.internal.reflect.GeneratedMethodAccessor1277.invoke(Unknown Source)
at java.base/jdk.internal.reflect.DelegatingMethodAccessorImpl.invoke(DelegatingMethodAccessorImpl.java:43)
at java.base/java.lang.reflect.Method.invoke(Method.java:569)
at PluginClassLoader for git-client//org.jenkinsci.plugins.gitclient.RemoteGitImpl$CommandInvocationHandler.invoke(RemoteGitImpl.java:138)
at PluginClassLoader for git-client/jdk.proxy159/jdk.proxy159.$Proxy302.execute(Unknown Source)
at PluginClassLoader for git//hudson.plugins.git.GitSCM.retrieveChanges(GitSCM.java:1220)
at PluginClassLoader for git//hudson.plugins.git.GitSCM._checkout(GitSCM.java:1310)
at PluginClassLoader for git//hudson.plugins.git.GitSCM.checkout(GitSCM.java:1277)
at hudson.scm.SCM.checkout(SCM.java:540)
at hudson.model.AbstractProject.checkout(AbstractProject.java:1250)
at hudson.model.AbstractBuild$AbstractBuildExecution.defaultCheckout(AbstractBuild.java:649)
at jenkins.scm.SCMCheckoutStrategy.checkout(SCMCheckoutStrategy.java:85)
at hudson.model.AbstractBuild$AbstractBuildExecution.run(AbstractBuild.java:522)
at hudson.model.Run.execute(Run.java:1833)
at hudson.model.FreeStyleBuild.run(FreeStyleBuild.java:44)
at hudson.model.ResourceController.execute(ResourceController.java:101)
at hudson.model.Executor.run(Executor.java:446)
ERROR: Error cloning remote repo 'origin'
Archiving artifacts
Recording test results
ERROR: Step ‘Publish JUnit test result report’ failed: No test report files were found. Configuration error?
Email was triggered for: Failure - Any
Sending email for trigger: Failure - Any
[JENKINS] Solr » Solr-Test-9.x - Build # 10077 - Still Failing!
Posted by Apache Jenkins Server <je...@builds.apache.org>.
Build: https://ci-builds.apache.org/job/Solr/job/Solr-Test-9.x/10077/
All tests passed
Build Log:
[...truncated 443 lines...]
BUILD FAILED in 46m
165 actionable tasks: 165 executed
Publishing build scan...
https://develocity.apache.org/s/535qc6rweayri
Build step 'Invoke Gradle script' changed build result to FAILURE
Build step 'Invoke Gradle script' marked build as failure
Archiving artifacts
Recording test results
[Checks API] No suitable checks publisher found.
Email was triggered for: Failure - Any
Sending email for trigger: Failure - Any
[JENKINS] Solr » Solr-Test-9.x - Build # 10076 - Still Failing!
Posted by Apache Jenkins Server <je...@builds.apache.org>.
Build: https://ci-builds.apache.org/job/Solr/job/Solr-Test-9.x/10076/
No tests ran.
Build Log:
[...truncated 20 lines...]
ERROR: Error cloning remote repo 'origin'
hudson.plugins.git.GitException: Command "git fetch --tags --force --progress -- https://gitbox.apache.org/repos/asf/solr.git +refs/heads/*:refs/remotes/origin/*" returned status code 128:
stdout:
stderr: error: RPC failed; curl 56 Recv failure: Connection reset by peer
fatal: expected flush after ref listing
at PluginClassLoader for git-client//org.jenkinsci.plugins.gitclient.CliGitAPIImpl.launchCommandIn(CliGitAPIImpl.java:2848)
at PluginClassLoader for git-client//org.jenkinsci.plugins.gitclient.CliGitAPIImpl.launchCommandWithCredentials(CliGitAPIImpl.java:2184)
at PluginClassLoader for git-client//org.jenkinsci.plugins.gitclient.CliGitAPIImpl$1.execute(CliGitAPIImpl.java:635)
at PluginClassLoader for git-client//org.jenkinsci.plugins.gitclient.CliGitAPIImpl$2.execute(CliGitAPIImpl.java:877)
at PluginClassLoader for git-client//org.jenkinsci.plugins.gitclient.RemoteGitImpl$CommandInvocationHandler$GitCommandMasterToSlaveCallable.call(RemoteGitImpl.java:170)
at PluginClassLoader for git-client//org.jenkinsci.plugins.gitclient.RemoteGitImpl$CommandInvocationHandler$GitCommandMasterToSlaveCallable.call(RemoteGitImpl.java:161)
at hudson.remoting.UserRequest.perform(UserRequest.java:225)
at hudson.remoting.UserRequest.perform(UserRequest.java:50)
at hudson.remoting.Request$2.run(Request.java:391)
at hudson.remoting.InterceptingExecutorService.lambda$wrap$0(InterceptingExecutorService.java:81)
at java.base/java.util.concurrent.FutureTask.run(FutureTask.java:264)
at java.base/java.util.concurrent.ThreadPoolExecutor.runWorker(ThreadPoolExecutor.java:1136)
at java.base/java.util.concurrent.ThreadPoolExecutor$Worker.run(ThreadPoolExecutor.java:635)
at java.base/java.lang.Thread.run(Thread.java:840)
Suppressed: hudson.remoting.Channel$CallSiteStackTrace: Remote call to lucene-solr-3
at hudson.remoting.Channel.attachCallSiteStackTrace(Channel.java:1923)
at hudson.remoting.UserRequest$ExceptionResponse.retrieve(UserRequest.java:384)
at hudson.remoting.Channel.call(Channel.java:1112)
at PluginClassLoader for git-client//org.jenkinsci.plugins.gitclient.RemoteGitImpl$CommandInvocationHandler.execute(RemoteGitImpl.java:153)
at jdk.internal.reflect.GeneratedMethodAccessor1277.invoke(Unknown Source)
at java.base/jdk.internal.reflect.DelegatingMethodAccessorImpl.invoke(DelegatingMethodAccessorImpl.java:43)
at java.base/java.lang.reflect.Method.invoke(Method.java:569)
at PluginClassLoader for git-client//org.jenkinsci.plugins.gitclient.RemoteGitImpl$CommandInvocationHandler.invoke(RemoteGitImpl.java:138)
at PluginClassLoader for git-client/jdk.proxy159/jdk.proxy159.$Proxy302.execute(Unknown Source)
at PluginClassLoader for git//hudson.plugins.git.GitSCM.retrieveChanges(GitSCM.java:1220)
at PluginClassLoader for git//hudson.plugins.git.GitSCM._checkout(GitSCM.java:1310)
at PluginClassLoader for git//hudson.plugins.git.GitSCM.checkout(GitSCM.java:1277)
at hudson.scm.SCM.checkout(SCM.java:540)
at hudson.model.AbstractProject.checkout(AbstractProject.java:1250)
at hudson.model.AbstractBuild$AbstractBuildExecution.defaultCheckout(AbstractBuild.java:649)
at jenkins.scm.SCMCheckoutStrategy.checkout(SCMCheckoutStrategy.java:85)
at hudson.model.AbstractBuild$AbstractBuildExecution.run(AbstractBuild.java:522)
at hudson.model.Run.execute(Run.java:1833)
at hudson.model.FreeStyleBuild.run(FreeStyleBuild.java:44)
at hudson.model.ResourceController.execute(ResourceController.java:101)
at hudson.model.Executor.run(Executor.java:446)
ERROR: Error cloning remote repo 'origin'
Archiving artifacts
Recording test results
ERROR: Step ‘Publish JUnit test result report’ failed: No test report files were found. Configuration error?
Email was triggered for: Failure - Any
Sending email for trigger: Failure - Any
[JENKINS] Solr » Solr-Test-9.x - Build # 10075 - Still Failing!
Posted by Apache Jenkins Server <je...@builds.apache.org>.
Build: https://ci-builds.apache.org/job/Solr/job/Solr-Test-9.x/10075/
All tests passed
Build Log:
[...truncated 451 lines...]
BUILD FAILED in 44m 17s
165 actionable tasks: 165 executed
Publishing build scan...
https://develocity.apache.org/s/veidiax3bup22
Build step 'Invoke Gradle script' changed build result to FAILURE
Build step 'Invoke Gradle script' marked build as failure
Archiving artifacts
Recording test results
[Checks API] No suitable checks publisher found.
Email was triggered for: Failure - Any
Sending email for trigger: Failure - Any
[JENKINS] Solr » Solr-Test-9.x - Build # 10074 - Still Failing!
Posted by Apache Jenkins Server <je...@builds.apache.org>.
Build: https://ci-builds.apache.org/job/Solr/job/Solr-Test-9.x/10074/
All tests passed
Build Log:
[...truncated 444 lines...]
BUILD FAILED in 43m 28s
165 actionable tasks: 165 executed
Publishing build scan...
https://develocity.apache.org/s/db3d6f5sczfyo
Build step 'Invoke Gradle script' changed build result to FAILURE
Build step 'Invoke Gradle script' marked build as failure
Archiving artifacts
Recording test results
[Checks API] No suitable checks publisher found.
Email was triggered for: Failure - Any
Sending email for trigger: Failure - Any
[JENKINS] Solr » Solr-Test-9.x - Build # 10073 - Still Failing!
Posted by Apache Jenkins Server <je...@builds.apache.org>.
Build: https://ci-builds.apache.org/job/Solr/job/Solr-Test-9.x/10073/
All tests passed
Build Log:
[...truncated 445 lines...]
BUILD FAILED in 44m 6s
165 actionable tasks: 165 executed
Publishing build scan...
https://develocity.apache.org/s/jjsdm6zmtbhgk
Build step 'Invoke Gradle script' changed build result to FAILURE
Build step 'Invoke Gradle script' marked build as failure
Archiving artifacts
Recording test results
[Checks API] No suitable checks publisher found.
Email was triggered for: Failure - Any
Sending email for trigger: Failure - Any
[JENKINS] Solr » Solr-Test-9.x - Build # 10072 - Still Failing!
Posted by Apache Jenkins Server <je...@builds.apache.org>.
Build: https://ci-builds.apache.org/job/Solr/job/Solr-Test-9.x/10072/
No tests ran.
Build Log:
[...truncated 17 lines...]
ERROR: Error cloning remote repo 'origin'
hudson.plugins.git.GitException: Command "git fetch --tags --force --progress -- https://gitbox.apache.org/repos/asf/solr.git +refs/heads/*:refs/remotes/origin/*" returned status code 128:
stdout:
stderr: error: RPC failed; curl 56 Recv failure: Connection reset by peer
fatal: expected flush after ref listing
at PluginClassLoader for git-client//org.jenkinsci.plugins.gitclient.CliGitAPIImpl.launchCommandIn(CliGitAPIImpl.java:2848)
at PluginClassLoader for git-client//org.jenkinsci.plugins.gitclient.CliGitAPIImpl.launchCommandWithCredentials(CliGitAPIImpl.java:2184)
at PluginClassLoader for git-client//org.jenkinsci.plugins.gitclient.CliGitAPIImpl$1.execute(CliGitAPIImpl.java:635)
at PluginClassLoader for git-client//org.jenkinsci.plugins.gitclient.CliGitAPIImpl$2.execute(CliGitAPIImpl.java:877)
at PluginClassLoader for git-client//org.jenkinsci.plugins.gitclient.RemoteGitImpl$CommandInvocationHandler$GitCommandMasterToSlaveCallable.call(RemoteGitImpl.java:170)
at PluginClassLoader for git-client//org.jenkinsci.plugins.gitclient.RemoteGitImpl$CommandInvocationHandler$GitCommandMasterToSlaveCallable.call(RemoteGitImpl.java:161)
at hudson.remoting.UserRequest.perform(UserRequest.java:225)
at hudson.remoting.UserRequest.perform(UserRequest.java:50)
at hudson.remoting.Request$2.run(Request.java:391)
at hudson.remoting.InterceptingExecutorService.lambda$wrap$0(InterceptingExecutorService.java:81)
at java.base/java.util.concurrent.FutureTask.run(FutureTask.java:264)
at java.base/java.util.concurrent.ThreadPoolExecutor.runWorker(ThreadPoolExecutor.java:1136)
at java.base/java.util.concurrent.ThreadPoolExecutor$Worker.run(ThreadPoolExecutor.java:635)
at java.base/java.lang.Thread.run(Thread.java:840)
Suppressed: hudson.remoting.Channel$CallSiteStackTrace: Remote call to lucene-solr-3
at hudson.remoting.Channel.attachCallSiteStackTrace(Channel.java:1923)
at hudson.remoting.UserRequest$ExceptionResponse.retrieve(UserRequest.java:384)
at hudson.remoting.Channel.call(Channel.java:1112)
at PluginClassLoader for git-client//org.jenkinsci.plugins.gitclient.RemoteGitImpl$CommandInvocationHandler.execute(RemoteGitImpl.java:153)
at jdk.internal.reflect.GeneratedMethodAccessor1277.invoke(Unknown Source)
at java.base/jdk.internal.reflect.DelegatingMethodAccessorImpl.invoke(DelegatingMethodAccessorImpl.java:43)
at java.base/java.lang.reflect.Method.invoke(Method.java:569)
at PluginClassLoader for git-client//org.jenkinsci.plugins.gitclient.RemoteGitImpl$CommandInvocationHandler.invoke(RemoteGitImpl.java:138)
at PluginClassLoader for git-client/jdk.proxy159/jdk.proxy159.$Proxy302.execute(Unknown Source)
at PluginClassLoader for git//hudson.plugins.git.GitSCM.retrieveChanges(GitSCM.java:1220)
at PluginClassLoader for git//hudson.plugins.git.GitSCM._checkout(GitSCM.java:1310)
at PluginClassLoader for git//hudson.plugins.git.GitSCM.checkout(GitSCM.java:1277)
at hudson.scm.SCM.checkout(SCM.java:540)
at hudson.model.AbstractProject.checkout(AbstractProject.java:1250)
at hudson.model.AbstractBuild$AbstractBuildExecution.defaultCheckout(AbstractBuild.java:649)
at jenkins.scm.SCMCheckoutStrategy.checkout(SCMCheckoutStrategy.java:85)
at hudson.model.AbstractBuild$AbstractBuildExecution.run(AbstractBuild.java:522)
at hudson.model.Run.execute(Run.java:1833)
at hudson.model.FreeStyleBuild.run(FreeStyleBuild.java:44)
at hudson.model.ResourceController.execute(ResourceController.java:101)
at hudson.model.Executor.run(Executor.java:446)
ERROR: Error cloning remote repo 'origin'
Archiving artifacts
Recording test results
ERROR: Step ‘Publish JUnit test result report’ failed: No test report files were found. Configuration error?
Email was triggered for: Failure - Any
Sending email for trigger: Failure - Any
[JENKINS] Solr » Solr-Test-9.x - Build # 10071 - Still Failing!
Posted by Apache Jenkins Server <je...@builds.apache.org>.
Build: https://ci-builds.apache.org/job/Solr/job/Solr-Test-9.x/10071/
All tests passed
Build Log:
[...truncated 444 lines...]
BUILD FAILED in 44m 29s
165 actionable tasks: 165 executed
Publishing build scan...
https://develocity.apache.org/s/xi4wmwl7ilk2q
Build step 'Invoke Gradle script' changed build result to FAILURE
Build step 'Invoke Gradle script' marked build as failure
Archiving artifacts
Recording test results
[Checks API] No suitable checks publisher found.
Email was triggered for: Failure - Any
Sending email for trigger: Failure - Any
[JENKINS] Solr » Solr-Test-9.x - Build # 10070 - Still Failing!
Posted by Apache Jenkins Server <je...@builds.apache.org>.
Build: https://ci-builds.apache.org/job/Solr/job/Solr-Test-9.x/10070/
1 tests failed.
FAILED: org.apache.solr.handler.admin.LoggingHandlerTest.testLogLevelHandlerOutput
Error Message:
java.lang.AssertionError: Logger Missing: org.apache.solr.bogus_logger_package.BogusClass_A
Stack Trace:
java.lang.AssertionError: Logger Missing: org.apache.solr.bogus_logger_package.BogusClass_A
at __randomizedtesting.SeedInfo.seed([66E24E9C344A4854:FDB90B1469FBF6AD]:0)
at org.junit.Assert.fail(Assert.java:89)
at org.junit.Assert.assertTrue(Assert.java:42)
at org.apache.solr.handler.admin.LoggingHandlerTest.assertLoggerLevel(LoggingHandlerTest.java:200)
at org.apache.solr.handler.admin.LoggingHandlerTest.testLogLevelHandlerOutput(LoggingHandlerTest.java:129)
at java.base/jdk.internal.reflect.NativeMethodAccessorImpl.invoke0(Native Method)
at java.base/jdk.internal.reflect.NativeMethodAccessorImpl.invoke(NativeMethodAccessorImpl.java:62)
at java.base/jdk.internal.reflect.DelegatingMethodAccessorImpl.invoke(DelegatingMethodAccessorImpl.java:43)
at java.base/java.lang.reflect.Method.invoke(Method.java:566)
at com.carrotsearch.randomizedtesting.RandomizedRunner.invoke(RandomizedRunner.java:1763)
at com.carrotsearch.randomizedtesting.RandomizedRunner$8.evaluate(RandomizedRunner.java:946)
at com.carrotsearch.randomizedtesting.RandomizedRunner$9.evaluate(RandomizedRunner.java:982)
at com.carrotsearch.randomizedtesting.RandomizedRunner$10.evaluate(RandomizedRunner.java:996)
at com.carrotsearch.randomizedtesting.rules.SystemPropertiesRestoreRule$1.evaluate(SystemPropertiesRestoreRule.java:80)
at org.junit.rules.RunRules.evaluate(RunRules.java:20)
at org.apache.lucene.tests.util.TestRuleSetupTeardownChained$1.evaluate(TestRuleSetupTeardownChained.java:48)
at org.apache.lucene.tests.util.AbstractBeforeAfterRule$1.evaluate(AbstractBeforeAfterRule.java:43)
at org.apache.lucene.tests.util.TestRuleThreadAndTestName$1.evaluate(TestRuleThreadAndTestName.java:45)
at org.apache.lucene.tests.util.TestRuleIgnoreAfterMaxFailures$1.evaluate(TestRuleIgnoreAfterMaxFailures.java:60)
at org.apache.lucene.tests.util.TestRuleMarkFailure$1.evaluate(TestRuleMarkFailure.java:44)
at org.junit.rules.RunRules.evaluate(RunRules.java:20)
at com.carrotsearch.randomizedtesting.rules.StatementAdapter.evaluate(StatementAdapter.java:36)
at com.carrotsearch.randomizedtesting.ThreadLeakControl$StatementRunner.run(ThreadLeakControl.java:390)
at com.carrotsearch.randomizedtesting.ThreadLeakControl.forkTimeoutingTask(ThreadLeakControl.java:843)
at com.carrotsearch.randomizedtesting.ThreadLeakControl$3.evaluate(ThreadLeakControl.java:490)
at com.carrotsearch.randomizedtesting.RandomizedRunner.runSingleTest(RandomizedRunner.java:955)
at com.carrotsearch.randomizedtesting.RandomizedRunner$5.evaluate(RandomizedRunner.java:840)
at com.carrotsearch.randomizedtesting.RandomizedRunner$6.evaluate(RandomizedRunner.java:891)
at com.carrotsearch.randomizedtesting.RandomizedRunner$7.evaluate(RandomizedRunner.java:902)
at com.carrotsearch.randomizedtesting.rules.StatementAdapter.evaluate(StatementAdapter.java:36)
at org.apache.solr.util.LogLevelTestRule$LogLevelStatement.evaluate(LogLevelTestRule.java:63)
at com.carrotsearch.randomizedtesting.rules.StatementAdapter.evaluate(StatementAdapter.java:36)
at org.apache.lucene.tests.util.AbstractBeforeAfterRule$1.evaluate(AbstractBeforeAfterRule.java:43)
at org.apache.lucene.tests.util.AbstractBeforeAfterRule$1.evaluate(AbstractBeforeAfterRule.java:43)
at com.carrotsearch.randomizedtesting.rules.SystemPropertiesRestoreRule$1.evaluate(SystemPropertiesRestoreRule.java:80)
at org.junit.rules.RunRules.evaluate(RunRules.java:20)
at org.apache.lucene.tests.util.AbstractBeforeAfterRule$1.evaluate(AbstractBeforeAfterRule.java:43)
at com.carrotsearch.randomizedtesting.rules.StatementAdapter.evaluate(StatementAdapter.java:36)
at org.apache.lucene.tests.util.TestRuleStoreClassName$1.evaluate(TestRuleStoreClassName.java:38)
at com.carrotsearch.randomizedtesting.rules.NoShadowingOrOverridesOnMethodsRule$1.evaluate(NoShadowingOrOverridesOnMethodsRule.java:40)
at com.carrotsearch.randomizedtesting.rules.NoShadowingOrOverridesOnMethodsRule$1.evaluate(NoShadowingOrOverridesOnMethodsRule.java:40)
at com.carrotsearch.randomizedtesting.rules.StatementAdapter.evaluate(StatementAdapter.java:36)
at com.carrotsearch.randomizedtesting.rules.StatementAdapter.evaluate(StatementAdapter.java:36)
at org.apache.lucene.tests.util.TestRuleAssertionsRequired$1.evaluate(TestRuleAssertionsRequired.java:53)
at org.apache.lucene.tests.util.AbstractBeforeAfterRule$1.evaluate(AbstractBeforeAfterRule.java:43)
at org.apache.lucene.tests.util.TestRuleMarkFailure$1.evaluate(TestRuleMarkFailure.java:44)
at org.apache.lucene.tests.util.TestRuleIgnoreAfterMaxFailures$1.evaluate(TestRuleIgnoreAfterMaxFailures.java:60)
at org.apache.lucene.tests.util.TestRuleIgnoreTestSuites$1.evaluate(TestRuleIgnoreTestSuites.java:47)
at org.junit.rules.RunRules.evaluate(RunRules.java:20)
at com.carrotsearch.randomizedtesting.rules.StatementAdapter.evaluate(StatementAdapter.java:36)
at com.carrotsearch.randomizedtesting.ThreadLeakControl$StatementRunner.run(ThreadLeakControl.java:390)
at com.carrotsearch.randomizedtesting.ThreadLeakControl.lambda$forkTimeoutingTask$0(ThreadLeakControl.java:850)
at java.base/java.lang.Thread.run(Thread.java:829)
Build Log:
[...truncated 612 lines...]
ERROR: The following test(s) have failed:
- org.apache.solr.handler.admin.LoggingHandlerTest.testLogLevelHandlerOutput (:solr:core)
Test history: https://develocity.apache.org/scans/tests?search.rootProjectNames=solr-root&tests.container=org.apache.solr.handler.admin.LoggingHandlerTest&tests.test=testLogLevelHandlerOutput http://fucit.org/solr-jenkins-reports/history-trend-of-recent-failures.html#series/org.apache.solr.handler.admin.LoggingHandlerTest.testLogLevelHandlerOutput
Test output: /home/jenkins/jenkins-agent/workspace/Solr/Solr-Test-9.x/solr/core/build/test-results/test/outputs/OUTPUT-org.apache.solr.handler.admin.LoggingHandlerTest.txt
Reproduce with: ./gradlew :solr:core:test --tests "org.apache.solr.handler.admin.LoggingHandlerTest.testLogLevelHandlerOutput" -Ptests.haltonfailure=false "-Ptests.jvmargs=-XX:TieredStopAtLevel=1 -XX:+UseParallelGC -XX:ActiveProcessorCount=1 -XX:ReservedCodeCacheSize=120m" -Ptests.seed=66E24E9C344A4854 -Ptests.multiplier=2 -Ptests.useSecurityManager=true -Ptests.badapples=false -Ptests.file.encoding=UTF-8
FAILURE: Build failed with an exception.
* What went wrong:
Execution failed for task ':solr:modules:analytics:compileTestJava'.
> Compilation failed; see the compiler error output for details.
* Try:
> Run with --info option to get more log output.
Deprecated Gradle features were used in this build, making it incompatible with Gradle 9.0.
You can use '--warning-mode all' to show the individual deprecation warnings and determine if they come from your own scripts or plugins.
For more on this, please refer to https://docs.gradle.org/8.10/userguide/command_line_interface.html#sec:command_line_warnings in the Gradle documentation.
BUILD FAILED in 44m 14s
165 actionable tasks: 165 executed
Publishing build scan...
https://develocity.apache.org/s/izpkurhtpyyhy
Build step 'Invoke Gradle script' changed build result to FAILURE
Build step 'Invoke Gradle script' marked build as failure
Archiving artifacts
Recording test results
[Checks API] No suitable checks publisher found.
Email was triggered for: Failure - Any
Sending email for trigger: Failure - Any
[JENKINS] Solr » Solr-Test-9.x - Build # 10069 - Still Failing!
Posted by Apache Jenkins Server <je...@builds.apache.org>.
Build: https://ci-builds.apache.org/job/Solr/job/Solr-Test-9.x/10069/
All tests passed
Build Log:
[...truncated 444 lines...]
BUILD FAILED in 44m 17s
165 actionable tasks: 165 executed
Publishing build scan...
https://develocity.apache.org/s/vn3fpuz33mnrm
Build step 'Invoke Gradle script' changed build result to FAILURE
Build step 'Invoke Gradle script' marked build as failure
Archiving artifacts
Recording test results
[Checks API] No suitable checks publisher found.
Email was triggered for: Failure - Any
Sending email for trigger: Failure - Any
[JENKINS] Solr » Solr-Test-9.x - Build # 10068 - Still Failing!
Posted by Apache Jenkins Server <je...@builds.apache.org>.
Build: https://ci-builds.apache.org/job/Solr/job/Solr-Test-9.x/10068/
All tests passed
Build Log:
[...truncated 442 lines...]
BUILD FAILED in 42m 57s
165 actionable tasks: 165 executed
Publishing build scan...
https://develocity.apache.org/s/3dpx46zaq6sr6
Build step 'Invoke Gradle script' changed build result to FAILURE
Build step 'Invoke Gradle script' marked build as failure
Archiving artifacts
Recording test results
[Checks API] No suitable checks publisher found.
Email was triggered for: Failure - Any
Sending email for trigger: Failure - Any
[JENKINS] Solr » Solr-Test-9.x - Build # 10067 - Still Failing!
Posted by Apache Jenkins Server <je...@builds.apache.org>.
Build: https://ci-builds.apache.org/job/Solr/job/Solr-Test-9.x/10067/
1 tests failed.
FAILED: org.apache.solr.cloud.SplitShardWithNodeRoleTest.testSolrClusterWithNodeRoleWithPull
Error Message:
java.lang.AssertionError: Timed out waiting for sub shards to be active. Number of active shards=1
Timeout waiting to see state for collection=coll_NRT_PULL :DocCollection(coll_NRT_PULL//collections/coll_NRT_PULL/state.json/13 {/collections/coll_NRT_PULL/state.json/[28]: [core_node10:2:A, core_node4:1:A, core_node2:2:A:L, core_node8:2:A:L, core_node9:2:A, core_node7:2:A:L]})={
"pullReplicas":1,
"configName":"conf",
"replicationFactor":1,
"router":{"name":"compositeId"},
"nrtReplicas":1,
"tlogReplicas":0,
"perReplicaState":true,
"shards":{
"shard1":{
"range":"80000000-7fffffff",
"state":"active",
"replicas":{
"core_node2":{
"core":"coll_NRT_PULL_shard1_replica_n1",
"node_name":"127.0.0.1:44289_solr",
"type":"NRT",
"state":"active",
"leader":"true",
"force_set_state":"false",
"base_url":"https://127.0.0.1:44289/solr"},
"core_node4":{
"core":"coll_NRT_PULL_shard1_replica_p3",
"node_name":"127.0.0.1:38375_solr",
"type":"PULL",
"state":"active",
"force_set_state":"false",
"base_url":"https://127.0.0.1:38375/solr"}}},
"shard1_0":{
"parent":"shard1",
"stateTimestamp":"1767775286534984748",
"shard_parent_node":"127.0.0.1:44289_solr",
"replicas":{
"core_node7":{
"core":"coll_NRT_PULL_shard1_0_replica_n5",
"node_name":"127.0.0.1:44289_solr",
"type":"NRT",
"state":"active",
"leader":"true",
"force_set_state":"false",
"base_url":"https://127.0.0.1:44289/solr"},
"core_node9":{
"core":"coll_NRT_PULL_shard1_0_replica_p0",
"node_name":"127.0.0.1:38375_solr",
"type":"PULL",
"state":"active",
"force_set_state":"false",
"base_url":"https://127.0.0.1:38375/solr"}},
"range":"80000000-ffffffff",
"state":"recovery",
"shard_parent_zk_session":"72205378922020869"},
"shard1_1":{
"parent":"shard1",
"stateTimestamp":"1767775286534949205",
"shard_parent_node":"127.0.0.1:44289_solr",
"replicas":{
"core_node8":{
"core":"coll_NRT_PULL_shard1_1_replica_n6",
"node_name":"127.0.0.1:44289_solr",
"type":"NRT",
"state":"active",
"leader":"true",
"force_set_state":"false",
"base_url":"https://127.0.0.1:44289/solr"},
"core_node10":{
"core":"coll_NRT_PULL_shard1_1_replica_p1",
"node_name":"127.0.0.1:38375_solr",
"type":"PULL",
"state":"active",
"force_set_state":"false",
"base_url":"https://127.0.0.1:38375/solr"}},
"range":"0-7fffffff",
"state":"recovery",
"shard_parent_zk_session":"72205378922020869"}}}
Live Nodes: [127.0.0.1:37811_solr, 127.0.0.1:38375_solr, 127.0.0.1:41843_solr, 127.0.0.1:44289_solr, 127.0.0.1:45497_solr, 127.0.0.1:45643_solr]
Last available state: DocCollection(coll_NRT_PULL//collections/coll_NRT_PULL/state.json/13 {/collections/coll_NRT_PULL/state.json/[28]: [core_node10:2:A, core_node4:1:A, core_node2:2:A:L, core_node8:2:A:L, core_node9:2:A, core_node7:2:A:L]})={
"pullReplicas":1,
"configName":"conf",
"replicationFactor":1,
"router":{"name":"compositeId"},
"nrtReplicas":1,
"tlogReplicas":0,
"perReplicaState":true,
"shards":{
"shard1":{
"range":"80000000-7fffffff",
"state":"active",
"replicas":{
"core_node2":{
"core":"coll_NRT_PULL_shard1_replica_n1",
"node_name":"127.0.0.1:44289_solr",
"type":"NRT",
"state":"active",
"leader":"true",
"force_set_state":"false",
"base_url":"https://127.0.0.1:44289/solr"},
"core_node4":{
"core":"coll_NRT_PULL_shard1_replica_p3",
"node_name":"127.0.0.1:38375_solr",
"type":"PULL",
"state":"active",
"force_set_state":"false",
"base_url":"https://127.0.0.1:38375/solr"}}},
"shard1_0":{
"parent":"shard1",
"stateTimestamp":"1767775286534984748",
"shard_parent_node":"127.0.0.1:44289_solr",
"replicas":{
"core_node7":{
"core":"coll_NRT_PULL_shard1_0_replica_n5",
"node_name":"127.0.0.1:44289_solr",
"type":"NRT",
"state":"active",
"leader":"true",
"force_set_state":"false",
"base_url":"https://127.0.0.1:44289/solr"},
"core_node9":{
"core":"coll_NRT_PULL_shard1_0_replica_p0",
"node_name":"127.0.0.1:38375_solr",
"type":"PULL",
"state":"active",
"force_set_state":"false",
"base_url":"https://127.0.0.1:38375/solr"}},
"range":"80000000-ffffffff",
"state":"recovery",
"shard_parent_zk_session":"72205378922020869"},
"shard1_1":{
"parent":"shard1",
"stateTimestamp":"1767775286534949205",
"shard_parent_node":"127.0.0.1:44289_solr",
"replicas":{
"core_node8":{
"core":"coll_NRT_PULL_shard1_1_replica_n6",
"node_name":"127.0.0.1:44289_solr",
"type":"NRT",
"state":"active",
"leader":"true",
"force_set_state":"false",
"base_url":"https://127.0.0.1:44289/solr"},
"core_node10":{
"core":"coll_NRT_PULL_shard1_1_replica_p1",
"node_name":"127.0.0.1:38375_solr",
"type":"PULL",
"state":"active",
"force_set_state":"false",
"base_url":"https://127.0.0.1:38375/solr"}},
"range":"0-7fffffff",
"state":"recovery",
"shard_parent_zk_session":"72205378922020869"}}}
Stack Trace:
java.lang.AssertionError: Timed out waiting for sub shards to be active. Number of active shards=1
Timeout waiting to see state for collection=coll_NRT_PULL :DocCollection(coll_NRT_PULL//collections/coll_NRT_PULL/state.json/13 {/collections/coll_NRT_PULL/state.json/[28]: [core_node10:2:A, core_node4:1:A, core_node2:2:A:L, core_node8:2:A:L, core_node9:2:A, core_node7:2:A:L]})={
"pullReplicas":1,
"configName":"conf",
"replicationFactor":1,
"router":{"name":"compositeId"},
"nrtReplicas":1,
"tlogReplicas":0,
"perReplicaState":true,
"shards":{
"shard1":{
"range":"80000000-7fffffff",
"state":"active",
"replicas":{
"core_node2":{
"core":"coll_NRT_PULL_shard1_replica_n1",
"node_name":"127.0.0.1:44289_solr",
"type":"NRT",
"state":"active",
"leader":"true",
"force_set_state":"false",
"base_url":"https://127.0.0.1:44289/solr"},
"core_node4":{
"core":"coll_NRT_PULL_shard1_replica_p3",
"node_name":"127.0.0.1:38375_solr",
"type":"PULL",
"state":"active",
"force_set_state":"false",
"base_url":"https://127.0.0.1:38375/solr"}}},
"shard1_0":{
"parent":"shard1",
"stateTimestamp":"1767775286534984748",
"shard_parent_node":"127.0.0.1:44289_solr",
"replicas":{
"core_node7":{
"core":"coll_NRT_PULL_shard1_0_replica_n5",
"node_name":"127.0.0.1:44289_solr",
"type":"NRT",
"state":"active",
"leader":"true",
"force_set_state":"false",
"base_url":"https://127.0.0.1:44289/solr"},
"core_node9":{
"core":"coll_NRT_PULL_shard1_0_replica_p0",
"node_name":"127.0.0.1:38375_solr",
"type":"PULL",
"state":"active",
"force_set_state":"false",
"base_url":"https://127.0.0.1:38375/solr"}},
"range":"80000000-ffffffff",
"state":"recovery",
"shard_parent_zk_session":"72205378922020869"},
"shard1_1":{
"parent":"shard1",
"stateTimestamp":"1767775286534949205",
"shard_parent_node":"127.0.0.1:44289_solr",
"replicas":{
"core_node8":{
"core":"coll_NRT_PULL_shard1_1_replica_n6",
"node_name":"127.0.0.1:44289_solr",
"type":"NRT",
"state":"active",
"leader":"true",
"force_set_state":"false",
"base_url":"https://127.0.0.1:44289/solr"},
"core_node10":{
"core":"coll_NRT_PULL_shard1_1_replica_p1",
"node_name":"127.0.0.1:38375_solr",
"type":"PULL",
"state":"active",
"force_set_state":"false",
"base_url":"https://127.0.0.1:38375/solr"}},
"range":"0-7fffffff",
"state":"recovery",
"shard_parent_zk_session":"72205378922020869"}}}
Live Nodes: [127.0.0.1:37811_solr, 127.0.0.1:38375_solr, 127.0.0.1:41843_solr, 127.0.0.1:44289_solr, 127.0.0.1:45497_solr, 127.0.0.1:45643_solr]
Last available state: DocCollection(coll_NRT_PULL//collections/coll_NRT_PULL/state.json/13 {/collections/coll_NRT_PULL/state.json/[28]: [core_node10:2:A, core_node4:1:A, core_node2:2:A:L, core_node8:2:A:L, core_node9:2:A, core_node7:2:A:L]})={
"pullReplicas":1,
"configName":"conf",
"replicationFactor":1,
"router":{"name":"compositeId"},
"nrtReplicas":1,
"tlogReplicas":0,
"perReplicaState":true,
"shards":{
"shard1":{
"range":"80000000-7fffffff",
"state":"active",
"replicas":{
"core_node2":{
"core":"coll_NRT_PULL_shard1_replica_n1",
"node_name":"127.0.0.1:44289_solr",
"type":"NRT",
"state":"active",
"leader":"true",
"force_set_state":"false",
"base_url":"https://127.0.0.1:44289/solr"},
"core_node4":{
"core":"coll_NRT_PULL_shard1_replica_p3",
"node_name":"127.0.0.1:38375_solr",
"type":"PULL",
"state":"active",
"force_set_state":"false",
"base_url":"https://127.0.0.1:38375/solr"}}},
"shard1_0":{
"parent":"shard1",
"stateTimestamp":"1767775286534984748",
"shard_parent_node":"127.0.0.1:44289_solr",
"replicas":{
"core_node7":{
"core":"coll_NRT_PULL_shard1_0_replica_n5",
"node_name":"127.0.0.1:44289_solr",
"type":"NRT",
"state":"active",
"leader":"true",
"force_set_state":"false",
"base_url":"https://127.0.0.1:44289/solr"},
"core_node9":{
"core":"coll_NRT_PULL_shard1_0_replica_p0",
"node_name":"127.0.0.1:38375_solr",
"type":"PULL",
"state":"active",
"force_set_state":"false",
"base_url":"https://127.0.0.1:38375/solr"}},
"range":"80000000-ffffffff",
"state":"recovery",
"shard_parent_zk_session":"72205378922020869"},
"shard1_1":{
"parent":"shard1",
"stateTimestamp":"1767775286534949205",
"shard_parent_node":"127.0.0.1:44289_solr",
"replicas":{
"core_node8":{
"core":"coll_NRT_PULL_shard1_1_replica_n6",
"node_name":"127.0.0.1:44289_solr",
"type":"NRT",
"state":"active",
"leader":"true",
"force_set_state":"false",
"base_url":"https://127.0.0.1:44289/solr"},
"core_node10":{
"core":"coll_NRT_PULL_shard1_1_replica_p1",
"node_name":"127.0.0.1:38375_solr",
"type":"PULL",
"state":"active",
"force_set_state":"false",
"base_url":"https://127.0.0.1:38375/solr"}},
"range":"0-7fffffff",
"state":"recovery",
"shard_parent_zk_session":"72205378922020869"}}}
at __randomizedtesting.SeedInfo.seed([46731582726F1FD5:9CD587A6D6A152A8]:0)
at org.junit.Assert.fail(Assert.java:89)
at org.apache.solr.cloud.SolrCloudTestCase.waitForState(SolrCloudTestCase.java:174)
at org.apache.solr.cloud.SolrCloudTestCase.waitForState(SolrCloudTestCase.java:142)
at org.apache.solr.cloud.SplitShardWithNodeRoleTest.doSplit(SplitShardWithNodeRoleTest.java:90)
at org.apache.solr.cloud.SplitShardWithNodeRoleTest.testSolrClusterWithNodeRoleWithPull(SplitShardWithNodeRoleTest.java:68)
at java.base/jdk.internal.reflect.NativeMethodAccessorImpl.invoke0(Native Method)
at java.base/jdk.internal.reflect.NativeMethodAccessorImpl.invoke(NativeMethodAccessorImpl.java:62)
at java.base/jdk.internal.reflect.DelegatingMethodAccessorImpl.invoke(DelegatingMethodAccessorImpl.java:43)
at java.base/java.lang.reflect.Method.invoke(Method.java:566)
at com.carrotsearch.randomizedtesting.RandomizedRunner.invoke(RandomizedRunner.java:1763)
at com.carrotsearch.randomizedtesting.RandomizedRunner$8.evaluate(RandomizedRunner.java:946)
at com.carrotsearch.randomizedtesting.RandomizedRunner$9.evaluate(RandomizedRunner.java:982)
at com.carrotsearch.randomizedtesting.RandomizedRunner$10.evaluate(RandomizedRunner.java:996)
at com.carrotsearch.randomizedtesting.rules.SystemPropertiesRestoreRule$1.evaluate(SystemPropertiesRestoreRule.java:80)
at org.junit.rules.RunRules.evaluate(RunRules.java:20)
at org.apache.lucene.tests.util.TestRuleSetupTeardownChained$1.evaluate(TestRuleSetupTeardownChained.java:48)
at org.apache.lucene.tests.util.AbstractBeforeAfterRule$1.evaluate(AbstractBeforeAfterRule.java:43)
at org.apache.lucene.tests.util.TestRuleThreadAndTestName$1.evaluate(TestRuleThreadAndTestName.java:45)
at org.apache.lucene.tests.util.TestRuleIgnoreAfterMaxFailures$1.evaluate(TestRuleIgnoreAfterMaxFailures.java:60)
at org.apache.lucene.tests.util.TestRuleMarkFailure$1.evaluate(TestRuleMarkFailure.java:44)
at org.junit.rules.RunRules.evaluate(RunRules.java:20)
at com.carrotsearch.randomizedtesting.rules.StatementAdapter.evaluate(StatementAdapter.java:36)
at com.carrotsearch.randomizedtesting.ThreadLeakControl$StatementRunner.run(ThreadLeakControl.java:390)
at com.carrotsearch.randomizedtesting.ThreadLeakControl.forkTimeoutingTask(ThreadLeakControl.java:843)
at com.carrotsearch.randomizedtesting.ThreadLeakControl$3.evaluate(ThreadLeakControl.java:490)
at com.carrotsearch.randomizedtesting.RandomizedRunner.runSingleTest(RandomizedRunner.java:955)
at com.carrotsearch.randomizedtesting.RandomizedRunner$5.evaluate(RandomizedRunner.java:840)
at com.carrotsearch.randomizedtesting.RandomizedRunner$6.evaluate(RandomizedRunner.java:891)
at com.carrotsearch.randomizedtesting.RandomizedRunner$7.evaluate(RandomizedRunner.java:902)
at com.carrotsearch.randomizedtesting.rules.StatementAdapter.evaluate(StatementAdapter.java:36)
at org.apache.solr.util.LogLevelTestRule$LogLevelStatement.evaluate(LogLevelTestRule.java:63)
at com.carrotsearch.randomizedtesting.rules.StatementAdapter.evaluate(StatementAdapter.java:36)
at org.apache.lucene.tests.util.AbstractBeforeAfterRule$1.evaluate(AbstractBeforeAfterRule.java:43)
at org.apache.lucene.tests.util.AbstractBeforeAfterRule$1.evaluate(AbstractBeforeAfterRule.java:43)
at com.carrotsearch.randomizedtesting.rules.SystemPropertiesRestoreRule$1.evaluate(SystemPropertiesRestoreRule.java:80)
at org.junit.rules.RunRules.evaluate(RunRules.java:20)
at org.apache.lucene.tests.util.AbstractBeforeAfterRule$1.evaluate(AbstractBeforeAfterRule.java:43)
at com.carrotsearch.randomizedtesting.rules.StatementAdapter.evaluate(StatementAdapter.java:36)
at org.apache.lucene.tests.util.TestRuleStoreClassName$1.evaluate(TestRuleStoreClassName.java:38)
at com.carrotsearch.randomizedtesting.rules.NoShadowingOrOverridesOnMethodsRule$1.evaluate(NoShadowingOrOverridesOnMethodsRule.java:40)
at com.carrotsearch.randomizedtesting.rules.NoShadowingOrOverridesOnMethodsRule$1.evaluate(NoShadowingOrOverridesOnMethodsRule.java:40)
at com.carrotsearch.randomizedtesting.rules.StatementAdapter.evaluate(StatementAdapter.java:36)
at com.carrotsearch.randomizedtesting.rules.StatementAdapter.evaluate(StatementAdapter.java:36)
at org.apache.lucene.tests.util.TestRuleAssertionsRequired$1.evaluate(TestRuleAssertionsRequired.java:53)
at org.apache.lucene.tests.util.AbstractBeforeAfterRule$1.evaluate(AbstractBeforeAfterRule.java:43)
at org.apache.lucene.tests.util.TestRuleMarkFailure$1.evaluate(TestRuleMarkFailure.java:44)
at org.apache.lucene.tests.util.TestRuleIgnoreAfterMaxFailures$1.evaluate(TestRuleIgnoreAfterMaxFailures.java:60)
at org.apache.lucene.tests.util.TestRuleIgnoreTestSuites$1.evaluate(TestRuleIgnoreTestSuites.java:47)
at org.junit.rules.RunRules.evaluate(RunRules.java:20)
at com.carrotsearch.randomizedtesting.rules.StatementAdapter.evaluate(StatementAdapter.java:36)
at com.carrotsearch.randomizedtesting.ThreadLeakControl$StatementRunner.run(ThreadLeakControl.java:390)
at com.carrotsearch.randomizedtesting.ThreadLeakControl.lambda$forkTimeoutingTask$0(ThreadLeakControl.java:850)
at java.base/java.lang.Thread.run(Thread.java:829)
Build Log:
[...truncated 5479 lines...]
ERROR: The following test(s) have failed:
- org.apache.solr.cloud.SplitShardWithNodeRoleTest.testSolrClusterWithNodeRoleWithPull (:solr:core)
Test history: https://develocity.apache.org/scans/tests?search.rootProjectNames=solr-root&tests.container=org.apache.solr.cloud.SplitShardWithNodeRoleTest&tests.test=testSolrClusterWithNodeRoleWithPull http://fucit.org/solr-jenkins-reports/history-trend-of-recent-failures.html#series/org.apache.solr.cloud.SplitShardWithNodeRoleTest.testSolrClusterWithNodeRoleWithPull
Test output: /home/jenkins/jenkins-agent/workspace/Solr/Solr-Test-9.x/solr/core/build/test-results/test/outputs/OUTPUT-org.apache.solr.cloud.SplitShardWithNodeRoleTest.txt
Reproduce with: ./gradlew :solr:core:test --tests "org.apache.solr.cloud.SplitShardWithNodeRoleTest.testSolrClusterWithNodeRoleWithPull" -Ptests.haltonfailure=false "-Ptests.jvmargs=-XX:TieredStopAtLevel=1 -XX:+UseParallelGC -XX:ActiveProcessorCount=1 -XX:ReservedCodeCacheSize=120m" -Ptests.seed=46731582726F1FD5 -Ptests.multiplier=2 -Ptests.useSecurityManager=true -Ptests.badapples=false -Ptests.file.encoding=UTF-8
FAILURE: Build failed with an exception.
* What went wrong:
Execution failed for task ':solr:modules:analytics:compileTestJava'.
> Compilation failed; see the compiler error output for details.
* Try:
> Run with --info option to get more log output.
Deprecated Gradle features were used in this build, making it incompatible with Gradle 9.0.
You can use '--warning-mode all' to show the individual deprecation warnings and determine if they come from your own scripts or plugins.
For more on this, please refer to https://docs.gradle.org/8.10/userguide/command_line_interface.html#sec:command_line_warnings in the Gradle documentation.
BUILD FAILED in 44m 38s
165 actionable tasks: 165 executed
Publishing build scan...
https://develocity.apache.org/s/cptzxhyp7wr24
Build step 'Invoke Gradle script' changed build result to FAILURE
Build step 'Invoke Gradle script' marked build as failure
Archiving artifacts
Recording test results
[Checks API] No suitable checks publisher found.
Email was triggered for: Failure - Any
Sending email for trigger: Failure - Any
[JENKINS] Solr » Solr-Test-9.x - Build # 10066 - Still Failing!
Posted by Apache Jenkins Server <je...@builds.apache.org>.
Build: https://ci-builds.apache.org/job/Solr/job/Solr-Test-9.x/10066/
All tests passed
Build Log:
[...truncated 444 lines...]
BUILD FAILED in 43m 53s
165 actionable tasks: 165 executed
Publishing build scan...
https://develocity.apache.org/s/s3dckzh5engeu
Build step 'Invoke Gradle script' changed build result to FAILURE
Build step 'Invoke Gradle script' marked build as failure
Archiving artifacts
Recording test results
[Checks API] No suitable checks publisher found.
Email was triggered for: Failure - Any
Sending email for trigger: Failure - Any
[JENKINS] Solr » Solr-Test-9.x - Build # 10065 - Still Failing!
Posted by Apache Jenkins Server <je...@builds.apache.org>.
Build: https://ci-builds.apache.org/job/Solr/job/Solr-Test-9.x/10065/
All tests passed
Build Log:
[...truncated 445 lines...]
BUILD FAILED in 45m 38s
165 actionable tasks: 165 executed
Publishing build scan...
https://develocity.apache.org/s/25semzuuypvy4
Build step 'Invoke Gradle script' changed build result to FAILURE
Build step 'Invoke Gradle script' marked build as failure
Archiving artifacts
Recording test results
[Checks API] No suitable checks publisher found.
Email was triggered for: Failure - Any
Sending email for trigger: Failure - Any
[JENKINS] Solr » Solr-Test-9.x - Build # 10064 - Still Failing!
Posted by Apache Jenkins Server <je...@builds.apache.org>.
Build: https://ci-builds.apache.org/job/Solr/job/Solr-Test-9.x/10064/
All tests passed
Build Log:
[...truncated 443 lines...]
BUILD FAILED in 43m 51s
165 actionable tasks: 165 executed
Publishing build scan...
https://develocity.apache.org/s/63nvvi7y3tjoi
Build step 'Invoke Gradle script' changed build result to FAILURE
Build step 'Invoke Gradle script' marked build as failure
Archiving artifacts
Recording test results
[Checks API] No suitable checks publisher found.
Email was triggered for: Failure - Any
Sending email for trigger: Failure - Any
[JENKINS] Solr » Solr-Test-9.x - Build # 10063 - Still Failing!
Posted by Apache Jenkins Server <je...@builds.apache.org>.
Build: https://ci-builds.apache.org/job/Solr/job/Solr-Test-9.x/10063/
All tests passed
Build Log:
[...truncated 445 lines...]
BUILD FAILED in 44m 52s
165 actionable tasks: 165 executed
Publishing build scan...
https://develocity.apache.org/s/euu52tvscr6kc
Build step 'Invoke Gradle script' changed build result to FAILURE
Build step 'Invoke Gradle script' marked build as failure
Archiving artifacts
Recording test results
[Checks API] No suitable checks publisher found.
Email was triggered for: Failure - Any
Sending email for trigger: Failure - Any
[JENKINS] Solr » Solr-Test-9.x - Build # 10062 - Still Failing!
Posted by Apache Jenkins Server <je...@builds.apache.org>.
Build: https://ci-builds.apache.org/job/Solr/job/Solr-Test-9.x/10062/
All tests passed
Build Log:
[...truncated 444 lines...]
BUILD FAILED in 44m 8s
165 actionable tasks: 165 executed
Publishing build scan...
https://develocity.apache.org/s/qfyz4rwkri55s
Build step 'Invoke Gradle script' changed build result to FAILURE
Build step 'Invoke Gradle script' marked build as failure
Archiving artifacts
Recording test results
[Checks API] No suitable checks publisher found.
Email was triggered for: Failure - Any
Sending email for trigger: Failure - Any
[JENKINS] Solr » Solr-Test-9.x - Build # 10061 - Still Failing!
Posted by Apache Jenkins Server <je...@builds.apache.org>.
Build: https://ci-builds.apache.org/job/Solr/job/Solr-Test-9.x/10061/
All tests passed
Build Log:
[...truncated 445 lines...]
BUILD FAILED in 46m 4s
165 actionable tasks: 165 executed
Publishing build scan...
https://develocity.apache.org/s/t6uqqknlrqzbq
Build step 'Invoke Gradle script' changed build result to FAILURE
Build step 'Invoke Gradle script' marked build as failure
Archiving artifacts
Recording test results
[Checks API] No suitable checks publisher found.
Email was triggered for: Failure - Any
Sending email for trigger: Failure - Any