You are viewing a plain text version of this content. The canonical link for it is here.
Posted to builds@beam.apache.org by Apache Jenkins Server <je...@builds.apache.org> on 2023/04/28 13:35:41 UTC
Build failed in Jenkins: beam_PostCommit_Java_InfluxDbIO_IT #481
See <https://ci-beam.apache.org/job/beam_PostCommit_Java_InfluxDbIO_IT/481/display/redirect?page=changes>
Changes:
[noreply] [Go SDK] Timers with new datalayer (#26101)
------------------------------------------
[...truncated 196.76 KB...]
work action null (Thread[Execution worker Thread 3,5,main]) completed. Took 0.0 secs.
Resolve mutations for :runners:direct-java:compileJava (Thread[Execution worker Thread 4,5,main]) started.
Resolve mutations for :runners:direct-java:compileJava (Thread[Execution worker Thread 4,5,main]) completed. Took 0.0 secs.
:runners:direct-java:compileJava (Thread[Execution worker,5,main]) started.
> Task :sdks:java:extensions:avro:compileTestJava FROM-CACHE
Custom actions are attached to task ':sdks:java:extensions:avro:compileTestJava'.
Build cache key for task ':sdks:java:extensions:avro:compileTestJava' is 61a3393ca64336483c7fb2d49bb38f3c
Task ':sdks:java:extensions:avro:compileTestJava' is not up-to-date because:
No history is available.
Loaded cache entry for task ':sdks:java:extensions:avro:compileTestJava' with cache key 61a3393ca64336483c7fb2d49bb38f3c
:sdks:java:extensions:avro:compileTestJava (Thread[Execution worker Thread 6,5,main]) completed. Took 0.347 secs.
Resolve mutations for :sdks:java:extensions:avro:testClasses (Thread[Execution worker Thread 2,5,main]) started.
Resolve mutations for :sdks:java:extensions:avro:testClasses (Thread[Execution worker Thread 2,5,main]) completed. Took 0.0 secs.
:sdks:java:extensions:avro:testClasses (Thread[Execution worker Thread 4,5,main]) started.
> Task :sdks:java:extensions:avro:testClasses UP-TO-DATE
Skipping task ':sdks:java:extensions:avro:testClasses' as it has no actions.
:sdks:java:extensions:avro:testClasses (Thread[Execution worker Thread 4,5,main]) completed. Took 0.0 secs.
Resolve mutations for :sdks:java:extensions:avro:testJar (Thread[Execution worker Thread 4,5,main]) started.
Resolve mutations for :sdks:java:extensions:avro:testJar (Thread[Execution worker Thread 4,5,main]) completed. Took 0.0 secs.
:sdks:java:extensions:avro:testJar (Thread[Execution worker Thread 6,5,main]) started.
> Task :sdks:java:extensions:avro:testJar
Caching disabled for task ':sdks:java:extensions:avro:testJar' because:
Not worth caching
Task ':sdks:java:extensions:avro:testJar' is not up-to-date because:
No history is available.
file or directory '<https://ci-beam.apache.org/job/beam_PostCommit_Java_InfluxDbIO_IT/ws/src/sdks/java/extensions/avro/build/resources/test',> not found
:sdks:java:extensions:avro:testJar (Thread[Execution worker Thread 6,5,main]) completed. Took 0.041 secs.
work action resolve beam-sdks-java-extensions-avro-tests.jar (project :sdks:java:extensions:avro) (Thread[Execution worker Thread 2,5,main]) started.
work action null (Thread[Execution worker Thread 2,5,main]) completed. Took 0.0 secs.
> Task :runners:direct-java:compileJava FROM-CACHE
Custom actions are attached to task ':runners:direct-java:compileJava'.
Build cache key for task ':runners:direct-java:compileJava' is 036984ac71851235741ac6844576e01e
Task ':runners:direct-java:compileJava' is not up-to-date because:
No history is available.
Loaded cache entry for task ':runners:direct-java:compileJava' with cache key 036984ac71851235741ac6844576e01e
:runners:direct-java:compileJava (Thread[Execution worker,5,main]) completed. Took 0.129 secs.
Resolve mutations for :runners:direct-java:classes (Thread[Execution worker,5,main]) started.
Resolve mutations for :runners:direct-java:classes (Thread[Execution worker,5,main]) completed. Took 0.0 secs.
:runners:direct-java:classes (Thread[Execution worker,5,main]) started.
> Task :runners:direct-java:classes UP-TO-DATE
Skipping task ':runners:direct-java:classes' as it has no actions.
:runners:direct-java:classes (Thread[Execution worker,5,main]) completed. Took 0.0 secs.
Resolve mutations for :runners:direct-java:shadowJar (Thread[Execution worker Thread 5,5,main]) started.
Resolve mutations for :runners:direct-java:shadowJar (Thread[Execution worker Thread 5,5,main]) completed. Took 0.001 secs.
:runners:direct-java:shadowJar (Thread[Execution worker Thread 4,5,main]) started.
> Task :runners:core-java:compileTestJava FROM-CACHE
Custom actions are attached to task ':runners:core-java:compileTestJava'.
Build cache key for task ':runners:core-java:compileTestJava' is 4821bf69c8fba906c0cc6a4a68bb6540
Task ':runners:core-java:compileTestJava' is not up-to-date because:
No history is available.
Loaded cache entry for task ':runners:core-java:compileTestJava' with cache key 4821bf69c8fba906c0cc6a4a68bb6540
:runners:core-java:compileTestJava (Thread[Execution worker Thread 7,5,main]) completed. Took 0.419 secs.
Resolve mutations for :runners:core-java:testClasses (Thread[included builds,5,main]) started.
Resolve mutations for :runners:core-java:testClasses (Thread[included builds,5,main]) completed. Took 0.0 secs.
:runners:core-java:testClasses (Thread[Execution worker Thread 2,5,main]) started.
> Task :runners:core-java:testClasses UP-TO-DATE
Skipping task ':runners:core-java:testClasses' as it has no actions.
:runners:core-java:testClasses (Thread[Execution worker Thread 2,5,main]) completed. Took 0.0 secs.
Resolve mutations for :runners:core-java:testJar (Thread[Execution worker Thread 3,5,main]) started.
Resolve mutations for :runners:core-java:testJar (Thread[Execution worker Thread 3,5,main]) completed. Took 0.0 secs.
:runners:core-java:testJar (Thread[included builds,5,main]) started.
> Task :runners:core-java:testJar
Caching disabled for task ':runners:core-java:testJar' because:
Not worth caching
Task ':runners:core-java:testJar' is not up-to-date because:
No history is available.
file or directory '<https://ci-beam.apache.org/job/beam_PostCommit_Java_InfluxDbIO_IT/ws/src/runners/core-java/build/resources/test',> not found
:runners:core-java:testJar (Thread[included builds,5,main]) completed. Took 0.054 secs.
work action resolve beam-runners-core-java-tests.jar (project :runners:core-java) (Thread[Execution worker Thread 5,5,main]) started.
work action null (Thread[Execution worker Thread 5,5,main]) completed. Took 0.0 secs.
> Task :runners:direct-java:shadowJar FROM-CACHE
Custom actions are attached to task ':runners:direct-java:shadowJar'.
Build cache key for task ':runners:direct-java:shadowJar' is 3a9a59b02d66ec58a3342f957dbf6d3a
Task ':runners:direct-java:shadowJar' is not up-to-date because:
No history is available.
Loaded cache entry for task ':runners:direct-java:shadowJar' with cache key 3a9a59b02d66ec58a3342f957dbf6d3a
:runners:direct-java:shadowJar (Thread[Execution worker Thread 4,5,main]) completed. Took 0.343 secs.
work action resolve beam-runners-direct-java.jar (project :runners:direct-java) (Thread[included builds,5,main]) started.
work action null (Thread[included builds,5,main]) completed. Took 0.0 secs.
work action resolve beam-runners-direct-java.jar (project :runners:direct-java) (Thread[Execution worker Thread 5,5,main]) started.
work action null (Thread[Execution worker Thread 5,5,main]) completed. Took 0.0 secs.
Resolve mutations for :runners:direct-java:compileTestJava (Thread[Execution worker Thread 4,5,main]) started.
Resolve mutations for :sdks:java:io:influxdb:compileTestJava (Thread[Execution worker Thread 5,5,main]) started.
Resolve mutations for :sdks:java:io:influxdb:compileTestJava (Thread[Execution worker Thread 5,5,main]) completed. Took 0.0 secs.
:sdks:java:io:influxdb:compileTestJava (Thread[included builds,5,main]) started.
Resolve mutations for :runners:direct-java:compileTestJava (Thread[Execution worker Thread 4,5,main]) completed. Took 0.001 secs.
:runners:direct-java:compileTestJava (Thread[Execution worker,5,main]) started.
> Task :runners:direct-java:compileTestJava FROM-CACHE
Custom actions are attached to task ':runners:direct-java:compileTestJava'.
Build cache key for task ':runners:direct-java:compileTestJava' is 05b62639f3780e610777aecff38b3318
Task ':runners:direct-java:compileTestJava' is not up-to-date because:
No history is available.
Loaded cache entry for task ':runners:direct-java:compileTestJava' with cache key 05b62639f3780e610777aecff38b3318
:runners:direct-java:compileTestJava (Thread[Execution worker,5,main]) completed. Took 0.162 secs.
Resolve mutations for :runners:direct-java:testClasses (Thread[Execution worker Thread 4,5,main]) started.
Resolve mutations for :runners:direct-java:testClasses (Thread[Execution worker Thread 4,5,main]) completed. Took 0.0 secs.
:runners:direct-java:testClasses (Thread[Execution worker Thread 5,5,main]) started.
> Task :runners:direct-java:testClasses UP-TO-DATE
Skipping task ':runners:direct-java:testClasses' as it has no actions.
:runners:direct-java:testClasses (Thread[Execution worker Thread 5,5,main]) completed. Took 0.0 secs.
Resolve mutations for :runners:direct-java:shadowTestJar (Thread[Execution worker,5,main]) started.
Resolve mutations for :runners:direct-java:shadowTestJar (Thread[Execution worker,5,main]) completed. Took 0.0 secs.
:runners:direct-java:shadowTestJar (Thread[Execution worker Thread 4,5,main]) started.
> Task :sdks:java:io:influxdb:compileTestJava FROM-CACHE
Custom actions are attached to task ':sdks:java:io:influxdb:compileTestJava'.
Build cache key for task ':sdks:java:io:influxdb:compileTestJava' is c30a62a33e83bdf5dcc075e06c0efe27
Task ':sdks:java:io:influxdb:compileTestJava' is not up-to-date because:
No history is available.
Loaded cache entry for task ':sdks:java:io:influxdb:compileTestJava' with cache key c30a62a33e83bdf5dcc075e06c0efe27
:sdks:java:io:influxdb:compileTestJava (Thread[included builds,5,main]) completed. Took 0.203 secs.
Resolve mutations for :sdks:java:io:influxdb:testClasses (Thread[Execution worker Thread 5,5,main]) started.
Resolve mutations for :sdks:java:io:influxdb:testClasses (Thread[Execution worker Thread 5,5,main]) completed. Took 0.0 secs.
:sdks:java:io:influxdb:testClasses (Thread[Execution worker,5,main]) started.
> Task :sdks:java:io:influxdb:testClasses UP-TO-DATE
Skipping task ':sdks:java:io:influxdb:testClasses' as it has no actions.
:sdks:java:io:influxdb:testClasses (Thread[Execution worker,5,main]) completed. Took 0.0 secs.
> Task :runners:direct-java:shadowTestJar FROM-CACHE
Build cache key for task ':runners:direct-java:shadowTestJar' is 16781bb40368c0020cb35ad08180dd7d
Task ':runners:direct-java:shadowTestJar' is not up-to-date because:
No history is available.
Loaded cache entry for task ':runners:direct-java:shadowTestJar' with cache key 16781bb40368c0020cb35ad08180dd7d
:runners:direct-java:shadowTestJar (Thread[Execution worker Thread 4,5,main]) completed. Took 0.229 secs.
work action resolve beam-runners-direct-java-tests.jar (project :runners:direct-java) (Thread[included builds,5,main]) started.
work action null (Thread[included builds,5,main]) completed. Took 0.0 secs.
Resolve mutations for :sdks:java:io:influxdb:integrationTest (Thread[Execution worker Thread 5,5,main]) started.
Resolve mutations for :sdks:java:io:influxdb:integrationTest (Thread[Execution worker Thread 5,5,main]) completed. Took 0.0 secs.
:sdks:java:io:influxdb:integrationTest (Thread[Execution worker Thread 4,5,main]) started.
producer locations for task group 0 (Thread[Execution worker Thread 5,5,main]) started.
producer locations for task group 0 (Thread[Execution worker Thread 5,5,main]) completed. Took 0.0 secs.
Gradle Test Executor 1 started executing tests.
> Task :sdks:java:io:influxdb:integrationTest
Custom actions are attached to task ':sdks:java:io:influxdb:integrationTest'.
Build cache key for task ':sdks:java:io:influxdb:integrationTest' is 7e5d8f318379a522f0643214f972cb78
Task ':sdks:java:io:influxdb:integrationTest' is not up-to-date because:
Task.upToDateWhen is false.
Starting process 'Gradle Test Executor 1'. Working directory: <https://ci-beam.apache.org/job/beam_PostCommit_Java_InfluxDbIO_IT/ws/src/sdks/java/io/influxdb> Command: /usr/lib/jvm/java-8-openjdk-amd64/bin/java -DbeamTestPipelineOptions=["--influxDBURL=http://34.132.144.244:8086","--influxDBUserName=superadmin","--influxDBPassword=supersecretpassword","--databaseName=db1"] -Djava.security.manager=worker.org.gradle.process.internal.worker.child.BootstrapSecurityManager -Dorg.gradle.internal.worker.tmpdir=<https://ci-beam.apache.org/job/beam_PostCommit_Java_InfluxDbIO_IT/ws/src/sdks/java/io/influxdb/build/tmp/integrationTest/work> -Dorg.gradle.native=false -Xmx2g -Dfile.encoding=UTF-8 -Duser.country=US -Duser.language=en -Duser.variant -ea -cp /home/jenkins/.gradle/caches/7.5.1/workerMain/gradle-worker.jar worker.org.gradle.process.internal.worker.GradleWorkerMain 'Gradle Test Executor 1'
Successfully started process 'Gradle Test Executor 1'
org.apache.beam.sdk.io.influxdb.InfluxDbIOIT STANDARD_ERROR
SLF4J: Class path contains multiple SLF4J bindings.
SLF4J: Found binding in [jar:file:/home/jenkins/.gradle/caches/modules-2/files-2.1/org.slf4j/slf4j-jdk14/1.7.30/d35953dd2fe54ebe39fdf18cfd82fe6eb35b25ed/slf4j-jdk14-1.7.30.jar!/org/slf4j/impl/StaticLoggerBinder.class]
SLF4J: Found binding in [jar:file:/home/jenkins/.gradle/caches/modules-2/files-2.1/org.slf4j/slf4j-simple/1.7.30/e606eac955f55ecf1d8edcccba04eb8ac98088dd/slf4j-simple-1.7.30.jar!/org/slf4j/impl/StaticLoggerBinder.class]
SLF4J: See http://www.slf4j.org/codes.html#multiple_bindings for an explanation.
SLF4J: Actual binding is of type [org.slf4j.impl.JDK14LoggerFactory]
org.apache.beam.sdk.io.influxdb.InfluxDbIOIT > testWriteAndReadWithMultipleMetric FAILED
java.lang.AssertionError: Count All/Flatten.PCollections.out:
Expected: <4000L>
but: was <3999L>
at org.apache.beam.sdk.testing.PAssert$PAssertionSite.capture(PAssert.java:175)
at org.apache.beam.sdk.testing.PAssert.thatSingleton(PAssert.java:498)
at org.apache.beam.sdk.testing.PAssert.thatSingleton(PAssert.java:490)
at org.apache.beam.sdk.io.influxdb.InfluxDbIOIT.testWriteAndReadWithMultipleMetric(InfluxDbIOIT.java:266)
Caused by:
java.lang.AssertionError:
Expected: <4000L>
but: was <3999L>
at org.hamcrest.MatcherAssert.assertThat(MatcherAssert.java:18)
at org.hamcrest.MatcherAssert.assertThat(MatcherAssert.java:6)
at org.apache.beam.sdk.testing.PAssert$AssertIsEqualTo.apply(PAssert.java:1643)
at org.apache.beam.sdk.testing.PAssert$AssertIsEqualTo.apply(PAssert.java:1634)
at org.apache.beam.sdk.testing.PAssert$CheckRelationAgainstExpected.apply(PAssert.java:1299)
at org.apache.beam.sdk.testing.PAssert$CheckRelationAgainstExpected.apply(PAssert.java:1279)
at org.apache.beam.sdk.testing.PAssert.doChecks(PAssert.java:1621)
at org.apache.beam.sdk.testing.PAssert$SingletonCheckerDoFn.processElement(PAssert.java:1614)
at org.apache.beam.sdk.testing.PAssert$SingletonCheckerDoFn$DoFnInvoker.invokeProcessElement(Unknown Source)
at org.apache.beam.repackaged.direct_java.runners.core.SimpleDoFnRunner.invokeProcessElement(SimpleDoFnRunner.java:211)
at org.apache.beam.repackaged.direct_java.runners.core.SimpleDoFnRunner.processElement(SimpleDoFnRunner.java:188)
at org.apache.beam.repackaged.direct_java.runners.core.SimplePushbackSideInputDoFnRunner.processElementInReadyWindows(SimplePushbackSideInputDoFnRunner.java:79)
at org.apache.beam.runners.direct.ParDoEvaluator.processElement(ParDoEvaluator.java:244)
at org.apache.beam.runners.direct.DoFnLifecycleManagerRemovingTransformEvaluator.processElement(DoFnLifecycleManagerRemovingTransformEvaluator.java:54)
at org.apache.beam.runners.direct.DirectTransformExecutor.processElements(DirectTransformExecutor.java:165)
at org.apache.beam.runners.direct.DirectTransformExecutor.run(DirectTransformExecutor.java:129)
at java.util.concurrent.Executors$RunnableAdapter.call(Executors.java:511)
at java.util.concurrent.FutureTask.run(FutureTask.java:266)
at java.util.concurrent.ThreadPoolExecutor.runWorker(ThreadPoolExecutor.java:1149)
at java.util.concurrent.ThreadPoolExecutor$Worker.run(ThreadPoolExecutor.java:624)
at java.lang.Thread.run(Thread.java:750)
Gradle Test Executor 1 finished executing tests.
> Task :sdks:java:io:influxdb:integrationTest
6 tests completed, 1 failed
Finished generating test XML results (0.018 secs) into: <https://ci-beam.apache.org/job/beam_PostCommit_Java_InfluxDbIO_IT/ws/src/sdks/java/io/influxdb/build/test-results/integrationTest>
Generating HTML test report...
Finished generating test html results (0.024 secs) into: <https://ci-beam.apache.org/job/beam_PostCommit_Java_InfluxDbIO_IT/ws/src/sdks/java/io/influxdb/build/reports/tests/integrationTest>
> Task :sdks:java:io:influxdb:integrationTest FAILED
:sdks:java:io:influxdb:integrationTest (Thread[Execution worker Thread 4,5,main]) completed. Took 8.452 secs.
FAILURE: Build failed with an exception.
* What went wrong:
Execution failed for task ':sdks:java:io:influxdb:integrationTest'.
> There were failing tests. See the report at: file://<https://ci-beam.apache.org/job/beam_PostCommit_Java_InfluxDbIO_IT/ws/src/sdks/java/io/influxdb/build/reports/tests/integrationTest/index.html>
* Try:
> Run with --stacktrace option to get the stack trace.
> Run with --debug option to get more log output.
* Get more help at https://help.gradle.org
Deprecated Gradle features were used in this build, making it incompatible with Gradle 8.0.
You can use '--warning-mode all' to show the individual deprecation warnings and determine if they come from your own scripts or plugins.
See https://docs.gradle.org/7.5.1/userguide/command_line_interface.html#sec:command_line_warnings
BUILD FAILED in 32s
80 actionable tasks: 44 executed, 34 from cache, 2 up-to-date
Build scan background action failed.
java.lang.IllegalArgumentException: com.gradle.enterprise.gradleplugin.internal.extension.a is not an interface
at java.lang.reflect.Proxy$ProxyClassFactory.apply(Proxy.java:590)
at java.lang.reflect.Proxy$ProxyClassFactory.apply(Proxy.java:557)
at java.lang.reflect.WeakCache$Factory.get(WeakCache.java:230)
at java.lang.reflect.WeakCache.get(WeakCache.java:127)
at java.lang.reflect.Proxy.getProxyClass0(Proxy.java:419)
at java.lang.reflect.Proxy.newProxyInstance(Proxy.java:719)
at com.gradle.ProxyFactory$ProxyingInvocationHandler.createLocalProxy(ProxyFactory.java:64)
at com.gradle.ProxyFactory$ProxyingInvocationHandler.lambda$adaptActionArg$1(ProxyFactory.java:59)
at com.gradle.enterprise.gradleplugin.internal.extension.b$3.run(SourceFile:100)
at java.util.concurrent.Executors$RunnableAdapter.call(Executors.java:511)
at java.util.concurrent.FutureTask.run(FutureTask.java:266)
at java.util.concurrent.ThreadPoolExecutor.runWorker(ThreadPoolExecutor.java:1149)
at java.util.concurrent.ThreadPoolExecutor$Worker.run(ThreadPoolExecutor.java:624)
at java.lang.Thread.run(Thread.java:750)
Publishing build scan...
https://gradle.com/s/ejdum2qq7k2aa
Build step 'Invoke Gradle script' changed build result to FAILURE
Build step 'Invoke Gradle script' marked build as failure
---------------------------------------------------------------------
To unsubscribe, e-mail: builds-unsubscribe@beam.apache.org
For additional commands, e-mail: builds-help@beam.apache.org
Jenkins build is back to normal : beam_PostCommit_Java_InfluxDbIO_IT #482
Posted by Apache Jenkins Server <je...@builds.apache.org>.
See <https://ci-beam.apache.org/job/beam_PostCommit_Java_InfluxDbIO_IT/482/display/redirect>
---------------------------------------------------------------------
To unsubscribe, e-mail: builds-unsubscribe@beam.apache.org
For additional commands, e-mail: builds-help@beam.apache.org