You are viewing a plain text version of this content. The canonical link for it is here.
Posted to jira@arrow.apache.org by "Antoine Pitrou (Jira)" <ji...@apache.org> on 2022/05/02 13:11:00 UTC
[jira] [Commented] (ARROW-16433) [Release][C++] parquet-arrow-test test fails on windows
[ https://issues.apache.org/jira/browse/ARROW-16433?page=com.atlassian.jira.plugin.system.issuetabpanels:comment-tabpanel&focusedCommentId=17530732#comment-17530732 ]
Antoine Pitrou commented on ARROW-16433:
----------------------------------------
Yeah, I got these under Windows as well, though for some reason they never happen on CI.
[~emkornfield]
> [Release][C++] parquet-arrow-test test fails on windows
> -------------------------------------------------------
>
> Key: ARROW-16433
> URL: https://issues.apache.org/jira/browse/ARROW-16433
> Project: Apache Arrow
> Issue Type: Bug
> Components: C++
> Reporter: Jacob Wujciak-Jens
> Priority: Major
>
> While verifying RC1 on windows this error happened reproducible using "verify-release-candidate.bat"
> {code:java}
> The following tests FAILED:
> 59 - parquet-arrow-test (Failed)
> C:/tmp/arrow-verify-release/apache-arrow-8.0.0/cpp/src/parquet/arrow/arrow_reader_writer_test.cc(1236): error: Expected: this->ReadAndCheckSingleColumnFile(*values) doesn't generate new fatal failures in the current thread.
> Actual: it does.
> [ FAILED ] TestInt96ParquetIO.ReadIntoTimestamp (0 ms)
> {code}
> cc [~apitrou]
--
This message was sent by Atlassian Jira
(v8.20.7#820007)