You are viewing a plain text version of this content. The canonical link for it is here.
Posted to commits@tomee.apache.org by Apache Jenkins Server <je...@builds.apache.org> on 2023/10/11 08:27:47 UTC
Build failed in Jenkins: TomEE » tomee-8.x-build-quick-java8 #31
See <https://ci-builds.apache.org/job/Tomee/job/tomee-8.x-build-quick-java8/31/display/redirect?page=changes>
Changes:
[Richard Zowalla] TOMEE-4252 - Tomcat 9.0.81
[Richard Zowalla] TOMEE-4253 - CXF 3.5.7
[Richard Zowalla] Minor: Regenerated BOMs for 417bb6aa249a9b4998e27f7b295dbb176ae6e1a4
------------------------------------------
[...truncated 7.98 MB...]
[INFO] --- maven-jar-plugin:3.0.2:jar (default-jar) @ tomee-myfaces ---
[INFO] Building jar: <https://ci-builds.apache.org/job/Tomee/job/tomee-8.x-build-quick-java8/ws/tomee/tomee-myfaces/target/tomee-myfaces-8.0.16-SNAPSHOT.jar>
[INFO]
[INFO] --- maven-site-plugin:3.12.1:attach-descriptor (attach-descriptor) @ tomee-myfaces ---
[INFO] Skipping because packaging 'jar' is not pom.
[INFO]
[INFO] --- maven-install-plugin:3.1.0:install (default-install) @ tomee-myfaces ---
[INFO] Installing <https://ci-builds.apache.org/job/Tomee/job/tomee-8.x-build-quick-java8/ws/tomee/tomee-myfaces/pom.xml> to /home/jenkins/.m2/repository/org/apache/tomee/tomee-myfaces/8.0.16-SNAPSHOT/tomee-myfaces-8.0.16-SNAPSHOT.pom
[INFO] Installing <https://ci-builds.apache.org/job/Tomee/job/tomee-8.x-build-quick-java8/ws/tomee/tomee-myfaces/target/tomee-myfaces-8.0.16-SNAPSHOT.jar> to /home/jenkins/.m2/repository/org/apache/tomee/tomee-myfaces/8.0.16-SNAPSHOT/tomee-myfaces-8.0.16-SNAPSHOT.jar
[INFO]
[INFO] --------------------< org.apache.tomee:tomee-util >---------------------
[INFO] Building TomEE :: TomEE :: Util 8.0.16-SNAPSHOT [44/59]
[INFO] --------------------------------[ jar ]---------------------------------
[INFO]
[INFO] --- maven-clean-plugin:3.2.0:clean (default-clean) @ tomee-util ---
[INFO]
[INFO] --- maven-enforcer-plugin:3.1.0:enforce (enforce-maven-version) @ tomee-util ---
[INFO]
[INFO] --- maven-enforcer-plugin:3.1.0:enforce (enforce-java-version) @ tomee-util ---
[INFO]
[INFO] --- maven-remote-resources-plugin:1.5:process (process-resource-bundles) @ tomee-util ---
[INFO]
[INFO] --- maven-resources-plugin:3.0.2:resources (default-resources) @ tomee-util ---
[INFO] Using 'UTF-8' encoding to copy filtered resources.
[INFO] skip non existing resourceDirectory <https://ci-builds.apache.org/job/Tomee/job/tomee-8.x-build-quick-java8/ws/tomee/tomee-util/src/main/resources>
[INFO] Copying 3 resources
[INFO]
[INFO] --- maven-compiler-plugin:3.6.2:compile (default-compile) @ tomee-util ---
[INFO] Changes detected - recompiling the module!
[INFO] Compiling 2 source files to <https://ci-builds.apache.org/job/Tomee/job/tomee-8.x-build-quick-java8/ws/tomee/tomee-util/target/classes>
[INFO]
[INFO] --- dependency-report-plugin:1.0.2:report (default) @ tomee-util ---
[INFO]
[INFO] --- maven-bundle-plugin:3.3.0:manifest (bundle-manifest) @ tomee-util ---
[INFO]
[INFO] --- maven-resources-plugin:3.0.2:testResources (default-testResources) @ tomee-util ---
[INFO] Using 'UTF-8' encoding to copy filtered resources.
[INFO] skip non existing resourceDirectory <https://ci-builds.apache.org/job/Tomee/job/tomee-8.x-build-quick-java8/ws/tomee/tomee-util/src/test/resources>
[INFO] Copying 3 resources
[INFO]
[INFO] --- maven-compiler-plugin:3.6.2:testCompile (default-testCompile) @ tomee-util ---
[INFO] No sources to compile
[INFO]
[INFO] --- maven-surefire-plugin:3.0.0-M5:test (default-test) @ tomee-util ---
[INFO]
[INFO] --- maven-jar-plugin:3.0.2:jar (default-jar) @ tomee-util ---
[INFO] Building jar: <https://ci-builds.apache.org/job/Tomee/job/tomee-8.x-build-quick-java8/ws/tomee/tomee-util/target/tomee-util-8.0.16-SNAPSHOT.jar>
[INFO]
[INFO] --- maven-site-plugin:3.12.1:attach-descriptor (attach-descriptor) @ tomee-util ---
[INFO] Skipping because packaging 'jar' is not pom.
[INFO]
[INFO] --- maven-install-plugin:3.1.0:install (default-install) @ tomee-util ---
[INFO] Installing <https://ci-builds.apache.org/job/Tomee/job/tomee-8.x-build-quick-java8/ws/tomee/tomee-util/pom.xml> to /home/jenkins/.m2/repository/org/apache/tomee/tomee-util/8.0.16-SNAPSHOT/tomee-util-8.0.16-SNAPSHOT.pom
[INFO] Installing <https://ci-builds.apache.org/job/Tomee/job/tomee-8.x-build-quick-java8/ws/tomee/tomee-util/target/tomee-util-8.0.16-SNAPSHOT.jar> to /home/jenkins/.m2/repository/org/apache/tomee/tomee-util/8.0.16-SNAPSHOT/tomee-util-8.0.16-SNAPSHOT.jar
[INFO]
[INFO] ------------------------------------------------------------------------
[INFO] Skipping TomEE :: TomEE :: Web Services
[INFO] This project has been banned from the build due to previous failures.
[INFO] ------------------------------------------------------------------------
[INFO]
[INFO] ------------------------------------------------------------------------
[INFO] Skipping TomEE :: TomEE :: TomEE Embedded
[INFO] This project has been banned from the build due to previous failures.
[INFO] ------------------------------------------------------------------------
[INFO]
[INFO] ------------------------------------------------------------------------
[INFO] Skipping TomEE :: TomEE :: Security
[INFO] This project has been banned from the build due to previous failures.
[INFO] ------------------------------------------------------------------------
[INFO]
[INFO] ------------------------------------------------------------------------
[INFO] Skipping TomEE :: TomEE :: MicroProfile Webapp
[INFO] This project has been banned from the build due to previous failures.
[INFO] ------------------------------------------------------------------------
[INFO]
[INFO] ------------------------------------------------------------------------
[INFO] Skipping TomEE :: TomEE :: Webapp
[INFO] This project has been banned from the build due to previous failures.
[INFO] ------------------------------------------------------------------------
[INFO]
[INFO] -----------------------< org.apache.tomee:utils >-----------------------
[INFO] Building TomEE :: Utils 8.0.16-SNAPSHOT [45/59]
[INFO] --------------------------------[ pom ]---------------------------------
[INFO]
[INFO] --- maven-clean-plugin:3.2.0:clean (default-clean) @ utils ---
[INFO]
[INFO] --- maven-enforcer-plugin:3.1.0:enforce (enforce-maven-version) @ utils ---
[INFO]
[INFO] --- maven-enforcer-plugin:3.1.0:enforce (enforce-java-version) @ utils ---
[INFO]
[INFO] --- maven-remote-resources-plugin:1.5:process (process-resource-bundles) @ utils ---
[INFO]
[INFO] --- dependency-report-plugin:1.0.2:report (default) @ utils ---
[INFO] No dependencies to report
[INFO]
[INFO] --- maven-bundle-plugin:3.3.0:manifest (bundle-manifest) @ utils ---
[WARNING] Ignoring project type pom - supportedProjectTypes = [bundle, jar, maven-plugin]
[INFO]
[INFO] --- maven-site-plugin:3.12.1:attach-descriptor (attach-descriptor) @ utils ---
[INFO] No site descriptor found: nothing to attach.
[INFO]
[INFO] --- maven-install-plugin:3.1.0:install (default-install) @ utils ---
[INFO] Installing <https://ci-builds.apache.org/job/Tomee/job/tomee-8.x-build-quick-java8/ws/utils/pom.xml> to /home/jenkins/.m2/repository/org/apache/tomee/utils/8.0.16-SNAPSHOT/utils-8.0.16-SNAPSHOT.pom
[INFO]
[INFO] -------------< org.apache.tomee:openejb-core-eclipselink >--------------
[INFO] Building TomEE :: Utils :: Core EclipseLink 8.0.16-SNAPSHOT [46/59]
[INFO] --------------------------------[ jar ]---------------------------------
[INFO]
[INFO] --- maven-clean-plugin:3.2.0:clean (default-clean) @ openejb-core-eclipselink ---
[INFO]
[INFO] --- maven-enforcer-plugin:3.1.0:enforce (enforce-maven-version) @ openejb-core-eclipselink ---
[INFO]
[INFO] --- maven-enforcer-plugin:3.1.0:enforce (enforce-java-version) @ openejb-core-eclipselink ---
[INFO]
[INFO] --- maven-remote-resources-plugin:1.5:process (process-resource-bundles) @ openejb-core-eclipselink ---
[INFO]
[INFO] --- maven-resources-plugin:3.0.2:resources (default-resources) @ openejb-core-eclipselink ---
[INFO] Using 'UTF-8' encoding to copy filtered resources.
[INFO] Copying 1 resource
[INFO] Copying 3 resources
[INFO]
[INFO] --- maven-compiler-plugin:3.6.2:compile (default-compile) @ openejb-core-eclipselink ---
[INFO] No sources to compile
[INFO]
[INFO] --- dependency-report-plugin:1.0.2:report (default) @ openejb-core-eclipselink ---
[INFO]
[INFO] --- maven-bundle-plugin:3.3.0:manifest (bundle-manifest) @ openejb-core-eclipselink ---
[WARNING] Manifest org.apache.tomee:openejb-core-eclipselink:jar:8.0.16-SNAPSHOT : Unused Export-Package instructions: [org.apache.tomee*]
[INFO]
[INFO] --- maven-resources-plugin:3.0.2:testResources (default-testResources) @ openejb-core-eclipselink ---
[INFO] Using 'UTF-8' encoding to copy filtered resources.
[INFO] skip non existing resourceDirectory <https://ci-builds.apache.org/job/Tomee/job/tomee-8.x-build-quick-java8/ws/utils/openejb-core-eclipselink/src/test/resources>
[INFO] Copying 3 resources
[INFO]
[INFO] --- maven-compiler-plugin:3.6.2:testCompile (default-testCompile) @ openejb-core-eclipselink ---
[INFO] No sources to compile
[INFO]
[INFO] --- maven-surefire-plugin:3.0.0-M5:test (default-test) @ openejb-core-eclipselink ---
[INFO]
[INFO] --- maven-jar-plugin:3.0.2:jar (default-jar) @ openejb-core-eclipselink ---
[INFO] Building jar: <https://ci-builds.apache.org/job/Tomee/job/tomee-8.x-build-quick-java8/ws/utils/openejb-core-eclipselink/target/openejb-core-eclipselink-8.0.16-SNAPSHOT.jar>
[INFO]
[INFO] --- maven-site-plugin:3.12.1:attach-descriptor (attach-descriptor) @ openejb-core-eclipselink ---
[INFO] Skipping because packaging 'jar' is not pom.
[INFO]
[INFO] --- maven-install-plugin:3.1.0:install (default-install) @ openejb-core-eclipselink ---
[INFO] Installing <https://ci-builds.apache.org/job/Tomee/job/tomee-8.x-build-quick-java8/ws/utils/openejb-core-eclipselink/pom.xml> to /home/jenkins/.m2/repository/org/apache/tomee/openejb-core-eclipselink/8.0.16-SNAPSHOT/openejb-core-eclipselink-8.0.16-SNAPSHOT.pom
[INFO] Installing <https://ci-builds.apache.org/job/Tomee/job/tomee-8.x-build-quick-java8/ws/utils/openejb-core-eclipselink/target/openejb-core-eclipselink-8.0.16-SNAPSHOT.jar> to /home/jenkins/.m2/repository/org/apache/tomee/openejb-core-eclipselink/8.0.16-SNAPSHOT/openejb-core-eclipselink-8.0.16-SNAPSHOT.jar
[INFO]
[INFO] ------------------------------------------------------------------------
[INFO] Skipping TomEE :: TomEE :: Plume Webapp
[INFO] This project has been banned from the build due to previous failures.
[INFO] ------------------------------------------------------------------------
[INFO]
[INFO] ------------------------------------------------------------------------
[INFO] Skipping TomEE :: TomEE :: Plus Webapp
[INFO] This project has been banned from the build due to previous failures.
[INFO] ------------------------------------------------------------------------
[INFO]
[INFO] ------------------------------------------------------------------------
[INFO] Skipping TomEE :: TomEE :: Apache TomEE
[INFO] This project has been banned from the build due to previous failures.
[INFO] ------------------------------------------------------------------------
[INFO] ------------------------------------------------------------------------
[INFO] Reactor Summary for Apache OpenEJB 8.0.16-SNAPSHOT:
[INFO]
[INFO] Apache OpenEJB ..................................... SUCCESS [ 1.272 s]
[INFO] TomEE :: Deps ...................................... SUCCESS [ 0.024 s]
[INFO] TomEE :: Deps :: Taglibs Shade ..................... SUCCESS [01:01 min]
[INFO] TomEE :: Deps :: CXF Shade ......................... SUCCESS [ 31.483 s]
[INFO] TomEE :: Deps :: Servicemix Bcel Shade ............. SUCCESS [ 1.902 s]
[INFO] TomEE :: BOMs ...................................... SUCCESS [ 0.022 s]
[INFO] TomEE :: BOMs :: JAXB Runtime ...................... SUCCESS [ 0.081 s]
[INFO] TomEE :: Container ................................. SUCCESS [ 0.018 s]
[INFO] TomEE :: Container :: MBean Annotation API ......... SUCCESS [ 0.465 s]
[INFO] TomEE :: Container :: JPA Integration .............. SUCCESS [ 0.744 s]
[INFO] TomEE :: Container :: API .......................... SUCCESS [ 0.175 s]
[INFO] TomEE :: Container :: Loader ....................... SUCCESS [ 17.990 s]
[INFO] TomEE :: Container :: Java Agent ................... SUCCESS [ 0.176 s]
[INFO] TomEE :: Container :: Java EE ...................... SUCCESS [ 20.222 s]
[INFO] TomEE :: Container :: Java EE Accessors ............ SUCCESS [ 6.201 s]
[INFO] TomEE :: iTests .................................... SUCCESS [ 0.029 s]
[INFO] TomEE :: iTests :: Beans ........................... SUCCESS [ 3.984 s]
[INFO] TomEE :: iTests :: Interceptor Beans ............... SUCCESS [ 0.392 s]
[INFO] TomEE :: iTests :: Servlets ........................ SUCCESS [ 0.348 s]
[INFO] TomEE :: iTests :: Client .......................... SUCCESS [ 4.037 s]
[INFO] TomEE :: iTests :: App ............................. SUCCESS [ 0.623 s]
[INFO] TomEE :: iTests :: Failover EJB .................... SUCCESS [ 0.181 s]
[INFO] TomEE :: Container :: Core ......................... SUCCESS [20:34 min]
[INFO] TomEE :: TomEE ..................................... SUCCESS [ 0.408 s]
[INFO] TomEE :: TomEE :: Config ........................... SUCCESS [ 0.512 s]
[INFO] TomEE :: Server .................................... SUCCESS [ 0.018 s]
[INFO] TomEE :: Server :: Client .......................... SUCCESS [ 11.138 s]
[INFO] TomEE :: TomEE :: Common ........................... SUCCESS [ 8.143 s]
[INFO] TomEE :: TomEE :: Juli ............................. SUCCESS [ 19.487 s]
[INFO] TomEE :: TomEE :: Loader ........................... SUCCESS [ 2.027 s]
[INFO] TomEE :: TomEE :: JDBC ............................. FAILURE [ 12.246 s]
[INFO] TomEE :: Server :: Core ............................ SUCCESS [ 5.045 s]
[INFO] TomEE :: Server :: Multicast Discovery ............. SUCCESS [ 29.709 s]
[INFO] TomEE :: Server :: EJBd ............................ SUCCESS [01:50 min]
[INFO] TomEE :: Server :: Http ............................ SUCCESS [ 36.423 s]
[INFO] TomEE :: TomEE :: Catalina ......................... SKIPPED
[INFO] TomEE :: Server :: REST ............................ SUCCESS [ 1.287 s]
[INFO] TomEE :: Server :: CXF Transport ................... SUCCESS [ 0.813 s]
[INFO] TomEE :: Server :: CXF RS .......................... SUCCESS [03:09 min]
[INFO] TomEE :: Microprofile JWT .......................... SKIPPED
[INFO] TomEE :: TomEE :: MicroProfile ..................... SUCCESS [ 0.316 s]
[INFO] TomEE :: TomEE :: MicroProfile Common .............. SKIPPED
[INFO] TomEE :: Server :: Webservices ..................... SUCCESS [ 1.704 s]
[INFO] TomEE :: Server :: CXF ............................. SUCCESS [ 44.636 s]
[INFO] TomEE :: Server :: Hsql ............................ SUCCESS [ 7.729 s]
[INFO] TomEE :: TomEE :: RS Web Services .................. SKIPPED
[INFO] TomEE :: TomEE :: Mojarra .......................... SKIPPED
[INFO] TomEE :: TomEE :: MyFaces .......................... SUCCESS [ 0.574 s]
[INFO] TomEE :: TomEE :: Util ............................. SUCCESS [ 0.342 s]
[INFO] TomEE :: TomEE :: Web Services ..................... SKIPPED
[INFO] TomEE :: TomEE :: TomEE Embedded ................... SKIPPED
[INFO] TomEE :: TomEE :: Security ......................... SKIPPED
[INFO] TomEE :: TomEE :: MicroProfile Webapp .............. SKIPPED
[INFO] TomEE :: TomEE :: Webapp ........................... SKIPPED
[INFO] TomEE :: Utils ..................................... SUCCESS [ 0.019 s]
[INFO] TomEE :: Utils :: Core EclipseLink ................. SUCCESS [ 0.280 s]
[INFO] TomEE :: TomEE :: Plume Webapp ..................... SKIPPED
[INFO] TomEE :: TomEE :: Plus Webapp ...................... SKIPPED
[INFO] TomEE :: TomEE :: Apache TomEE ..................... SKIPPED
[INFO] ------------------------------------------------------------------------
[INFO] BUILD FAILURE
[INFO] ------------------------------------------------------------------------
[INFO] Total time: 31:10 min
[INFO] Finished at: 2023-10-11T08:27:32Z
[INFO] ------------------------------------------------------------------------
[ERROR] Failed to execute goal org.apache.maven.plugins:maven-surefire-plugin:3.0.0-M5:test (default-test) on project tomee-jdbc: There are test failures.
[ERROR]
[ERROR] Please refer to <https://ci-builds.apache.org/job/Tomee/job/tomee-8.x-build-quick-java8/ws/tomee/tomee-jdbc/target/surefire-reports> for the individual test results.
[ERROR] Please refer to dump files (if any exist) [date].dump, [date]-jvmRun[N].dump and [date].dumpstream.
[ERROR] -> [Help 1]
[ERROR]
[ERROR] To see the full stack trace of the errors, re-run Maven with the -e switch.
[ERROR] Re-run Maven using the -X switch to enable full debug logging.
[ERROR]
[ERROR] For more information about the errors and possible solutions, please read the following articles:
[ERROR] [Help 1] http://cwiki.apache.org/confluence/display/MAVEN/MojoFailureException
[ERROR]
[ERROR] After correcting the problems, you can resume the build with the command
[ERROR] mvn <args> -rf :tomee-jdbc
Build step 'Invoke top-level Maven targets' marked build as failure
INFO: Processing JUnit
INFO: [JUnit] - 639 test report file(s) were found with the pattern '**/target/surefire-reports/TEST-*.xml' relative to '<https://ci-builds.apache.org/job/Tomee/job/tomee-8.x-build-quick-java8/ws/'> for the testing framework 'JUnit'.
INFO: Setting the build status to SUCCESS
Jenkins build is back to normal : TomEE » tomee-8.x-build-quick-java8 #33
Posted by Apache Jenkins Server <je...@builds.apache.org>.
See <https://ci-builds.apache.org/job/Tomee/job/tomee-8.x-build-quick-java8/33/display/redirect?page=changes>
Build failed in Jenkins: TomEE » tomee-8.x-build-quick-java8 #32
Posted by Apache Jenkins Server <je...@builds.apache.org>.
See <https://ci-builds.apache.org/job/Tomee/job/tomee-8.x-build-quick-java8/32/display/redirect>
Changes:
------------------------------------------
[...truncated 7.84 MB...]
[INFO] --- maven-jar-plugin:3.0.2:jar (default-jar) @ tomee-myfaces ---
[INFO] Building jar: <https://ci-builds.apache.org/job/Tomee/job/tomee-8.x-build-quick-java8/ws/tomee/tomee-myfaces/target/tomee-myfaces-8.0.16-SNAPSHOT.jar>
[INFO]
[INFO] --- maven-site-plugin:3.12.1:attach-descriptor (attach-descriptor) @ tomee-myfaces ---
[INFO] Skipping because packaging 'jar' is not pom.
[INFO]
[INFO] --- maven-install-plugin:3.1.0:install (default-install) @ tomee-myfaces ---
[INFO] Installing <https://ci-builds.apache.org/job/Tomee/job/tomee-8.x-build-quick-java8/ws/tomee/tomee-myfaces/pom.xml> to /home/jenkins/.m2/repository/org/apache/tomee/tomee-myfaces/8.0.16-SNAPSHOT/tomee-myfaces-8.0.16-SNAPSHOT.pom
[INFO] Installing <https://ci-builds.apache.org/job/Tomee/job/tomee-8.x-build-quick-java8/ws/tomee/tomee-myfaces/target/tomee-myfaces-8.0.16-SNAPSHOT.jar> to /home/jenkins/.m2/repository/org/apache/tomee/tomee-myfaces/8.0.16-SNAPSHOT/tomee-myfaces-8.0.16-SNAPSHOT.jar
[INFO]
[INFO] --------------------< org.apache.tomee:tomee-util >---------------------
[INFO] Building TomEE :: TomEE :: Util 8.0.16-SNAPSHOT [44/59]
[INFO] --------------------------------[ jar ]---------------------------------
[INFO]
[INFO] --- maven-clean-plugin:3.2.0:clean (default-clean) @ tomee-util ---
[INFO]
[INFO] --- maven-enforcer-plugin:3.1.0:enforce (enforce-maven-version) @ tomee-util ---
[INFO]
[INFO] --- maven-enforcer-plugin:3.1.0:enforce (enforce-java-version) @ tomee-util ---
[INFO]
[INFO] --- maven-remote-resources-plugin:1.5:process (process-resource-bundles) @ tomee-util ---
[INFO]
[INFO] --- maven-resources-plugin:3.0.2:resources (default-resources) @ tomee-util ---
[INFO] Using 'UTF-8' encoding to copy filtered resources.
[INFO] skip non existing resourceDirectory <https://ci-builds.apache.org/job/Tomee/job/tomee-8.x-build-quick-java8/ws/tomee/tomee-util/src/main/resources>
[INFO] Copying 3 resources
[INFO]
[INFO] --- maven-compiler-plugin:3.6.2:compile (default-compile) @ tomee-util ---
[INFO] Changes detected - recompiling the module!
[INFO] Compiling 2 source files to <https://ci-builds.apache.org/job/Tomee/job/tomee-8.x-build-quick-java8/ws/tomee/tomee-util/target/classes>
[INFO]
[INFO] --- dependency-report-plugin:1.0.2:report (default) @ tomee-util ---
[INFO]
[INFO] --- maven-bundle-plugin:3.3.0:manifest (bundle-manifest) @ tomee-util ---
[INFO]
[INFO] --- maven-resources-plugin:3.0.2:testResources (default-testResources) @ tomee-util ---
[INFO] Using 'UTF-8' encoding to copy filtered resources.
[INFO] skip non existing resourceDirectory <https://ci-builds.apache.org/job/Tomee/job/tomee-8.x-build-quick-java8/ws/tomee/tomee-util/src/test/resources>
[INFO] Copying 3 resources
[INFO]
[INFO] --- maven-compiler-plugin:3.6.2:testCompile (default-testCompile) @ tomee-util ---
[INFO] No sources to compile
[INFO]
[INFO] --- maven-surefire-plugin:3.0.0-M5:test (default-test) @ tomee-util ---
[INFO]
[INFO] --- maven-jar-plugin:3.0.2:jar (default-jar) @ tomee-util ---
[INFO] Building jar: <https://ci-builds.apache.org/job/Tomee/job/tomee-8.x-build-quick-java8/ws/tomee/tomee-util/target/tomee-util-8.0.16-SNAPSHOT.jar>
[INFO]
[INFO] --- maven-site-plugin:3.12.1:attach-descriptor (attach-descriptor) @ tomee-util ---
[INFO] Skipping because packaging 'jar' is not pom.
[INFO]
[INFO] --- maven-install-plugin:3.1.0:install (default-install) @ tomee-util ---
[INFO] Installing <https://ci-builds.apache.org/job/Tomee/job/tomee-8.x-build-quick-java8/ws/tomee/tomee-util/pom.xml> to /home/jenkins/.m2/repository/org/apache/tomee/tomee-util/8.0.16-SNAPSHOT/tomee-util-8.0.16-SNAPSHOT.pom
[INFO] Installing <https://ci-builds.apache.org/job/Tomee/job/tomee-8.x-build-quick-java8/ws/tomee/tomee-util/target/tomee-util-8.0.16-SNAPSHOT.jar> to /home/jenkins/.m2/repository/org/apache/tomee/tomee-util/8.0.16-SNAPSHOT/tomee-util-8.0.16-SNAPSHOT.jar
[INFO]
[INFO] ------------------------------------------------------------------------
[INFO] Skipping TomEE :: TomEE :: Web Services
[INFO] This project has been banned from the build due to previous failures.
[INFO] ------------------------------------------------------------------------
[INFO]
[INFO] ------------------------------------------------------------------------
[INFO] Skipping TomEE :: TomEE :: TomEE Embedded
[INFO] This project has been banned from the build due to previous failures.
[INFO] ------------------------------------------------------------------------
[INFO]
[INFO] ------------------------------------------------------------------------
[INFO] Skipping TomEE :: TomEE :: Security
[INFO] This project has been banned from the build due to previous failures.
[INFO] ------------------------------------------------------------------------
[INFO]
[INFO] ------------------------------------------------------------------------
[INFO] Skipping TomEE :: TomEE :: MicroProfile Webapp
[INFO] This project has been banned from the build due to previous failures.
[INFO] ------------------------------------------------------------------------
[INFO]
[INFO] ------------------------------------------------------------------------
[INFO] Skipping TomEE :: TomEE :: Webapp
[INFO] This project has been banned from the build due to previous failures.
[INFO] ------------------------------------------------------------------------
[INFO]
[INFO] -----------------------< org.apache.tomee:utils >-----------------------
[INFO] Building TomEE :: Utils 8.0.16-SNAPSHOT [45/59]
[INFO] --------------------------------[ pom ]---------------------------------
[INFO]
[INFO] --- maven-clean-plugin:3.2.0:clean (default-clean) @ utils ---
[INFO]
[INFO] --- maven-enforcer-plugin:3.1.0:enforce (enforce-maven-version) @ utils ---
[INFO]
[INFO] --- maven-enforcer-plugin:3.1.0:enforce (enforce-java-version) @ utils ---
[INFO]
[INFO] --- maven-remote-resources-plugin:1.5:process (process-resource-bundles) @ utils ---
[INFO]
[INFO] --- dependency-report-plugin:1.0.2:report (default) @ utils ---
[INFO] No dependencies to report
[INFO]
[INFO] --- maven-bundle-plugin:3.3.0:manifest (bundle-manifest) @ utils ---
[WARNING] Ignoring project type pom - supportedProjectTypes = [bundle, jar, maven-plugin]
[INFO]
[INFO] --- maven-site-plugin:3.12.1:attach-descriptor (attach-descriptor) @ utils ---
[INFO] No site descriptor found: nothing to attach.
[INFO]
[INFO] --- maven-install-plugin:3.1.0:install (default-install) @ utils ---
[INFO] Installing <https://ci-builds.apache.org/job/Tomee/job/tomee-8.x-build-quick-java8/ws/utils/pom.xml> to /home/jenkins/.m2/repository/org/apache/tomee/utils/8.0.16-SNAPSHOT/utils-8.0.16-SNAPSHOT.pom
[INFO]
[INFO] -------------< org.apache.tomee:openejb-core-eclipselink >--------------
[INFO] Building TomEE :: Utils :: Core EclipseLink 8.0.16-SNAPSHOT [46/59]
[INFO] --------------------------------[ jar ]---------------------------------
[INFO]
[INFO] --- maven-clean-plugin:3.2.0:clean (default-clean) @ openejb-core-eclipselink ---
[INFO]
[INFO] --- maven-enforcer-plugin:3.1.0:enforce (enforce-maven-version) @ openejb-core-eclipselink ---
[INFO]
[INFO] --- maven-enforcer-plugin:3.1.0:enforce (enforce-java-version) @ openejb-core-eclipselink ---
[INFO]
[INFO] --- maven-remote-resources-plugin:1.5:process (process-resource-bundles) @ openejb-core-eclipselink ---
[INFO]
[INFO] --- maven-resources-plugin:3.0.2:resources (default-resources) @ openejb-core-eclipselink ---
[INFO] Using 'UTF-8' encoding to copy filtered resources.
[INFO] Copying 1 resource
[INFO] Copying 3 resources
[INFO]
[INFO] --- maven-compiler-plugin:3.6.2:compile (default-compile) @ openejb-core-eclipselink ---
[INFO] No sources to compile
[INFO]
[INFO] --- dependency-report-plugin:1.0.2:report (default) @ openejb-core-eclipselink ---
[INFO]
[INFO] --- maven-bundle-plugin:3.3.0:manifest (bundle-manifest) @ openejb-core-eclipselink ---
[WARNING] Manifest org.apache.tomee:openejb-core-eclipselink:jar:8.0.16-SNAPSHOT : Unused Export-Package instructions: [org.apache.tomee*]
[INFO]
[INFO] --- maven-resources-plugin:3.0.2:testResources (default-testResources) @ openejb-core-eclipselink ---
[INFO] Using 'UTF-8' encoding to copy filtered resources.
[INFO] skip non existing resourceDirectory <https://ci-builds.apache.org/job/Tomee/job/tomee-8.x-build-quick-java8/ws/utils/openejb-core-eclipselink/src/test/resources>
[INFO] Copying 3 resources
[INFO]
[INFO] --- maven-compiler-plugin:3.6.2:testCompile (default-testCompile) @ openejb-core-eclipselink ---
[INFO] No sources to compile
[INFO]
[INFO] --- maven-surefire-plugin:3.0.0-M5:test (default-test) @ openejb-core-eclipselink ---
[INFO]
[INFO] --- maven-jar-plugin:3.0.2:jar (default-jar) @ openejb-core-eclipselink ---
[INFO] Building jar: <https://ci-builds.apache.org/job/Tomee/job/tomee-8.x-build-quick-java8/ws/utils/openejb-core-eclipselink/target/openejb-core-eclipselink-8.0.16-SNAPSHOT.jar>
[INFO]
[INFO] --- maven-site-plugin:3.12.1:attach-descriptor (attach-descriptor) @ openejb-core-eclipselink ---
[INFO] Skipping because packaging 'jar' is not pom.
[INFO]
[INFO] --- maven-install-plugin:3.1.0:install (default-install) @ openejb-core-eclipselink ---
[INFO] Installing <https://ci-builds.apache.org/job/Tomee/job/tomee-8.x-build-quick-java8/ws/utils/openejb-core-eclipselink/pom.xml> to /home/jenkins/.m2/repository/org/apache/tomee/openejb-core-eclipselink/8.0.16-SNAPSHOT/openejb-core-eclipselink-8.0.16-SNAPSHOT.pom
[INFO] Installing <https://ci-builds.apache.org/job/Tomee/job/tomee-8.x-build-quick-java8/ws/utils/openejb-core-eclipselink/target/openejb-core-eclipselink-8.0.16-SNAPSHOT.jar> to /home/jenkins/.m2/repository/org/apache/tomee/openejb-core-eclipselink/8.0.16-SNAPSHOT/openejb-core-eclipselink-8.0.16-SNAPSHOT.jar
[INFO]
[INFO] ------------------------------------------------------------------------
[INFO] Skipping TomEE :: TomEE :: Plume Webapp
[INFO] This project has been banned from the build due to previous failures.
[INFO] ------------------------------------------------------------------------
[INFO]
[INFO] ------------------------------------------------------------------------
[INFO] Skipping TomEE :: TomEE :: Plus Webapp
[INFO] This project has been banned from the build due to previous failures.
[INFO] ------------------------------------------------------------------------
[INFO]
[INFO] ------------------------------------------------------------------------
[INFO] Skipping TomEE :: TomEE :: Apache TomEE
[INFO] This project has been banned from the build due to previous failures.
[INFO] ------------------------------------------------------------------------
[INFO] ------------------------------------------------------------------------
[INFO] Reactor Summary for Apache OpenEJB 8.0.16-SNAPSHOT:
[INFO]
[INFO] Apache OpenEJB ..................................... SUCCESS [ 5.409 s]
[INFO] TomEE :: Deps ...................................... SUCCESS [ 0.047 s]
[INFO] TomEE :: Deps :: Taglibs Shade ..................... SUCCESS [ 52.016 s]
[INFO] TomEE :: Deps :: CXF Shade ......................... SUCCESS [ 6.393 s]
[INFO] TomEE :: Deps :: Servicemix Bcel Shade ............. SUCCESS [ 2.678 s]
[INFO] TomEE :: BOMs ...................................... SUCCESS [ 0.018 s]
[INFO] TomEE :: BOMs :: JAXB Runtime ...................... SUCCESS [ 0.093 s]
[INFO] TomEE :: Container ................................. SUCCESS [ 0.016 s]
[INFO] TomEE :: Container :: MBean Annotation API ......... SUCCESS [ 0.476 s]
[INFO] TomEE :: Container :: JPA Integration .............. SUCCESS [ 0.752 s]
[INFO] TomEE :: Container :: API .......................... SUCCESS [ 0.169 s]
[INFO] TomEE :: Container :: Loader ....................... SUCCESS [ 15.423 s]
[INFO] TomEE :: Container :: Java Agent ................... SUCCESS [ 0.158 s]
[INFO] TomEE :: Container :: Java EE ...................... SUCCESS [ 18.292 s]
[INFO] TomEE :: Container :: Java EE Accessors ............ SUCCESS [ 6.359 s]
[INFO] TomEE :: iTests .................................... SUCCESS [ 0.141 s]
[INFO] TomEE :: iTests :: Beans ........................... SUCCESS [ 4.207 s]
[INFO] TomEE :: iTests :: Interceptor Beans ............... SUCCESS [ 0.240 s]
[INFO] TomEE :: iTests :: Servlets ........................ SUCCESS [ 0.193 s]
[INFO] TomEE :: iTests :: Client .......................... SUCCESS [ 3.866 s]
[INFO] TomEE :: iTests :: App ............................. SUCCESS [ 0.520 s]
[INFO] TomEE :: iTests :: Failover EJB .................... SUCCESS [ 0.162 s]
[INFO] TomEE :: Container :: Core ......................... SUCCESS [20:14 min]
[INFO] TomEE :: TomEE ..................................... SUCCESS [ 0.363 s]
[INFO] TomEE :: TomEE :: Config ........................... SUCCESS [ 0.464 s]
[INFO] TomEE :: Server .................................... SUCCESS [ 0.015 s]
[INFO] TomEE :: Server :: Client .......................... SUCCESS [ 10.395 s]
[INFO] TomEE :: TomEE :: Common ........................... SUCCESS [ 1.493 s]
[INFO] TomEE :: TomEE :: Juli ............................. SUCCESS [ 18.524 s]
[INFO] TomEE :: TomEE :: Loader ........................... SUCCESS [ 1.704 s]
[INFO] TomEE :: TomEE :: JDBC ............................. FAILURE [ 10.295 s]
[INFO] TomEE :: Server :: Core ............................ SUCCESS [ 4.878 s]
[INFO] TomEE :: Server :: Multicast Discovery ............. SUCCESS [ 29.677 s]
[INFO] TomEE :: Server :: EJBd ............................ SUCCESS [01:49 min]
[INFO] TomEE :: Server :: Http ............................ SUCCESS [ 35.708 s]
[INFO] TomEE :: TomEE :: Catalina ......................... SKIPPED
[INFO] TomEE :: Server :: REST ............................ SUCCESS [ 1.214 s]
[INFO] TomEE :: Server :: CXF Transport ................... SUCCESS [ 0.717 s]
[INFO] TomEE :: Server :: CXF RS .......................... SUCCESS [03:06 min]
[INFO] TomEE :: Microprofile JWT .......................... SKIPPED
[INFO] TomEE :: TomEE :: MicroProfile ..................... SUCCESS [ 0.374 s]
[INFO] TomEE :: TomEE :: MicroProfile Common .............. SKIPPED
[INFO] TomEE :: Server :: Webservices ..................... SUCCESS [ 1.760 s]
[INFO] TomEE :: Server :: CXF ............................. SUCCESS [ 45.900 s]
[INFO] TomEE :: Server :: Hsql ............................ SUCCESS [ 7.506 s]
[INFO] TomEE :: TomEE :: RS Web Services .................. SKIPPED
[INFO] TomEE :: TomEE :: Mojarra .......................... SKIPPED
[INFO] TomEE :: TomEE :: MyFaces .......................... SUCCESS [ 0.626 s]
[INFO] TomEE :: TomEE :: Util ............................. SUCCESS [ 0.503 s]
[INFO] TomEE :: TomEE :: Web Services ..................... SKIPPED
[INFO] TomEE :: TomEE :: TomEE Embedded ................... SKIPPED
[INFO] TomEE :: TomEE :: Security ......................... SKIPPED
[INFO] TomEE :: TomEE :: MicroProfile Webapp .............. SKIPPED
[INFO] TomEE :: TomEE :: Webapp ........................... SKIPPED
[INFO] TomEE :: Utils ..................................... SUCCESS [ 0.014 s]
[INFO] TomEE :: Utils :: Core EclipseLink ................. SUCCESS [ 0.402 s]
[INFO] TomEE :: TomEE :: Plume Webapp ..................... SKIPPED
[INFO] TomEE :: TomEE :: Plus Webapp ...................... SKIPPED
[INFO] TomEE :: TomEE :: Apache TomEE ..................... SKIPPED
[INFO] ------------------------------------------------------------------------
[INFO] BUILD FAILURE
[INFO] ------------------------------------------------------------------------
[INFO] Total time: 30:05 min
[INFO] Finished at: 2023-10-11T09:27:50Z
[INFO] ------------------------------------------------------------------------
[ERROR] Failed to execute goal org.apache.maven.plugins:maven-surefire-plugin:3.0.0-M5:test (default-test) on project tomee-jdbc: There are test failures.
[ERROR]
[ERROR] Please refer to <https://ci-builds.apache.org/job/Tomee/job/tomee-8.x-build-quick-java8/ws/tomee/tomee-jdbc/target/surefire-reports> for the individual test results.
[ERROR] Please refer to dump files (if any exist) [date].dump, [date]-jvmRun[N].dump and [date].dumpstream.
[ERROR] -> [Help 1]
[ERROR]
[ERROR] To see the full stack trace of the errors, re-run Maven with the -e switch.
[ERROR] Re-run Maven using the -X switch to enable full debug logging.
[ERROR]
[ERROR] For more information about the errors and possible solutions, please read the following articles:
[ERROR] [Help 1] http://cwiki.apache.org/confluence/display/MAVEN/MojoFailureException
[ERROR]
[ERROR] After correcting the problems, you can resume the build with the command
[ERROR] mvn <args> -rf :tomee-jdbc
Build step 'Invoke top-level Maven targets' marked build as failure
INFO: Processing JUnit
INFO: [JUnit] - 639 test report file(s) were found with the pattern '**/target/surefire-reports/TEST-*.xml' relative to '<https://ci-builds.apache.org/job/Tomee/job/tomee-8.x-build-quick-java8/ws/'> for the testing framework 'JUnit'.
INFO: Setting the build status to SUCCESS