You are viewing a plain text version of this content. The canonical link for it is here.
Posted to dev@jackrabbit.apache.org by Apache Hudson Server <hu...@hudson.zones.apache.org> on 2010/06/04 19:10:09 UTC

Build failed in Hudson: Jackrabbit-trunk #1164

See <http://hudson.zones.apache.org/hudson/job/Jackrabbit-trunk/1164/changes>

Changes:

[stefan] JCR-2632: Concurrent Session.move() operations failure

------------------------------------------
[...truncated 717 lines...]
	at com.sun.org.apache.xerces.internal.jaxp.DocumentBuilderImpl.parse(DocumentBuilderImpl.java:292)
	at javax.xml.parsers.DocumentBuilder.parse(DocumentBuilder.java:172)
	at org.apache.felix.obrplugin.ObrUpdate.parseFile(ObrUpdate.java:347)
	at org.apache.felix.obrplugin.ObrUpdate.parseRepositoryXml(ObrUpdate.java:324)
	at org.apache.felix.obrplugin.ObrInstall.execute(ObrInstall.java:140)
	at org.apache.maven.plugin.DefaultPluginManager.executeMojo(DefaultPluginManager.java:451)
	at hudson.maven.agent.PluginManagerInterceptor.executeMojo(PluginManagerInterceptor.java:182)
	at org.apache.maven.lifecycle.DefaultLifecycleExecutor.executeGoals(DefaultLifecycleExecutor.java:558)
	at org.apache.maven.lifecycle.DefaultLifecycleExecutor.executeGoalWithLifecycle(DefaultLifecycleExecutor.java:499)
	at org.apache.maven.lifecycle.DefaultLifecycleExecutor.executeGoal(DefaultLifecycleExecutor.java:478)
	at org.apache.maven.lifecycle.DefaultLifecycleExecutor.executeGoalAndHandleFailures(DefaultLifecycleExecutor.java:330)
	at org.apache.maven.lifecycle.DefaultLifecycleExecutor.executeTaskSegments(DefaultLifecycleExecutor.java:291)
	at org.apache.maven.lifecycle.DefaultLifecycleExecutor.execute(DefaultLifecycleExecutor.java:142)
	at org.apache.maven.lifecycle.LifecycleExecutorInterceptor.execute(LifecycleExecutorInterceptor.java:65)
	at org.apache.maven.DefaultMaven.doExecute(DefaultMaven.java:336)
	at org.apache.maven.DefaultMaven.execute(DefaultMaven.java:129)
	at org.apache.maven.cli.MavenCli.main(MavenCli.java:287)
	at sun.reflect.NativeMethodAccessorImpl.invoke0(Native Method)
	at sun.reflect.NativeMethodAccessorImpl.invoke(NativeMethodAccessorImpl.java:39)
	at sun.reflect.DelegatingMethodAccessorImpl.invoke(DelegatingMethodAccessorImpl.java:25)
	at java.lang.reflect.Method.invoke(Method.java:592)
	at org.codehaus.classworlds.Launcher.launchEnhanced(Launcher.java:315)
	at org.codehaus.classworlds.Launcher.launch(Launcher.java:255)
	at hudson.maven.agent.Main.launch(Main.java:165)
	at hudson.maven.MavenBuilder.call(MavenBuilder.java:159)
	at hudson.maven.MavenModuleSetBuild$Builder.call(MavenModuleSetBuild.java:688)
	at hudson.maven.MavenModuleSetBuild$Builder.call(MavenModuleSetBuild.java:632)
	at hudson.remoting.UserRequest.perform(UserRequest.java:114)
	at hudson.remoting.UserRequest.perform(UserRequest.java:48)
	at hudson.remoting.Request$2.run(Request.java:270)
	at java.util.concurrent.Executors$RunnableAdapter.call(Executors.java:417)
	at java.util.concurrent.FutureTask$Sync.innerRun(FutureTask.java:269)
	at java.util.concurrent.FutureTask.run(FutureTask.java:123)
	at java.util.concurrent.ThreadPoolExecutor$Worker.runTask(ThreadPoolExecutor.java:651)
	at java.util.concurrent.ThreadPoolExecutor$Worker.run(ThreadPoolExecutor.java:676)
	at java.lang.Thread.run(Thread.java:595)
[INFO] Writing OBR metadata

[TASKS] Skipping maven reporter: there is already a result available.[INFO] [deploy:deploy]
[INFO] Retrieving previous build number from apache.snapshots.https

Uploading: https://repository.apache.org/content/repositories/snapshots/org/apache/jackrabbit/jackrabbit-spi-commons/2.2-SNAPSHOT/jackrabbit-spi-commons-2.2-20100604.170254-57.jar
709K uploaded
[INFO] Retrieving previous metadata from apache.snapshots.https
[INFO] Uploading repository metadata for: 'artifact org.apache.jackrabbit:jackrabbit-spi-commons'
[INFO] Retrieving previous metadata from apache.snapshots.https
[INFO] Uploading repository metadata for: 'snapshot org.apache.jackrabbit:jackrabbit-spi-commons:2.2-SNAPSHOT'
[INFO] Uploading project information for jackrabbit-spi-commons 2.2-20100604.170254-57
[TASKS] Skipping maven reporter: there is already a result available.[INFO] [bundle:deploy]
[INFO] Remote OBR update disabled (enable with -DremoteOBR)

[TASKS] Skipping maven reporter: there is already a result available.
[HUDSON] Archiving <http://hudson.zones.apache.org/hudson/job/Jackrabbit-trunk/ws/trunk/jackrabbit-spi-commons/pom.xml> to /export/home/hudson/hudson/jobs/Jackrabbit-trunk/modules/org.apache.jackrabbit$jackrabbit-spi-commons/builds/2010-06-04_17-02-14/archive/org.apache.jackrabbit/jackrabbit-spi-commons/2.2-SNAPSHOT/pom.xml
[HUDSON] Archiving <http://hudson.zones.apache.org/hudson/job/Jackrabbit-trunk/ws/trunk/jackrabbit-spi-commons/target/jackrabbit-spi-commons-2.2-SNAPSHOT.jar> to /export/home/hudson/hudson/jobs/Jackrabbit-trunk/modules/org.apache.jackrabbit$jackrabbit-spi-commons/builds/2010-06-04_17-02-14/archive/org.apache.jackrabbit/jackrabbit-spi-commons/2.2-20100604.170254-57/jackrabbit-spi-commons-2.2-SNAPSHOT.jar
[INFO] ------------------------------------------------------------------------
[INFO] Building Jackrabbit Core
[INFO]    task-segment: [clean, deploy]
[INFO] ------------------------------------------------------------------------
[INFO] [clean:clean]
[INFO] Deleting file set: <http://hudson.zones.apache.org/hudson/job/Jackrabbit-trunk/ws/trunk/jackrabbit-core/target> (included: [**], excluded: [])
[TASKS] Scanning folder '<http://hudson.zones.apache.org/hudson/job/Jackrabbit-trunk/ws/trunk/jackrabbit-core/src/main/java'> for tasks ... 
[TASKS] Found 195.
[TASKS] Scanning folder '<http://hudson.zones.apache.org/hudson/job/Jackrabbit-trunk/ws/trunk/jackrabbit-core/src/test/java'> for tasks ... 
[TASKS] Found 25.
[TASKS] Scanning folder '<http://hudson.zones.apache.org/hudson/job/Jackrabbit-trunk/ws/trunk/jackrabbit-core/src/main/resources'> for tasks ... 
[TASKS] Found 0.
[TASKS] Scanning folder '<http://hudson.zones.apache.org/hudson/job/Jackrabbit-trunk/ws/trunk/jackrabbit-core/src/main/resources-filtered'> for tasks ... 
[TASKS] Found 0.
[TASKS] Scanning folder '<http://hudson.zones.apache.org/hudson/job/Jackrabbit-trunk/ws/trunk/jackrabbit-core/src/test/resources'> for tasks ... 
[TASKS] Found 0.
[INFO] snapshot org.apache.jackrabbit:jackrabbit-api:2.2-SNAPSHOT: checking for updates from apache.snapshots
[INFO] snapshot org.apache.jackrabbit:jackrabbit-spi-commons:2.2-SNAPSHOT: checking for updates from apache.snapshots
[INFO] [remote-resources:process {execution: default}]
[TASKS] Skipping maven reporter: there is already a result available.
[INFO] [resources:resources]
[INFO] Using 'UTF-8' encoding to copy filtered resources.
[INFO] Copying 72 resources
[INFO] Copying 1 resource
[INFO] Copying 3 resources
[TASKS] Skipping maven reporter: there is already a result available.
[INFO] [compiler:compile]
[INFO] Compiling 686 source files to <http://hudson.zones.apache.org/hudson/job/Jackrabbit-trunk/ws/trunk/jackrabbit-core/target/classes>
[TASKS] Skipping maven reporter: there is already a result available.[INFO] [resources:testResources]
[INFO] Using 'UTF-8' encoding to copy filtered resources.
[INFO] Copying 20 resources

[INFO] Copying 3 resources
[TASKS] Skipping maven reporter: there is already a result available.
[INFO] [antrun:run {execution: process-test-resources}]
[INFO] Executing tasks
     [copy] Copying 34 files to <http://hudson.zones.apache.org/hudson/job/Jackrabbit-trunk/ws/trunk/jackrabbit-core/target/repository>
     [copy] Copying 34 files to <http://hudson.zones.apache.org/hudson/job/Jackrabbit-trunk/ws/trunk/jackrabbit-core/target/repository-2>
[INFO] Executed tasks
[TASKS] Skipping maven reporter: there is already a result available.
[INFO] [compiler:testCompile]
[INFO] Compiling 288 source files to <http://hudson.zones.apache.org/hudson/job/Jackrabbit-trunk/ws/trunk/jackrabbit-core/target/test-classes>
[TASKS] Skipping maven reporter: there is already a result available.
[INFO] [surefire:test]
[INFO] Surefire report directory: <http://hudson.zones.apache.org/hudson/job/Jackrabbit-trunk/ws/trunk/jackrabbit-core/target/surefire-reports>

-------------------------------------------------------
 T E S T S
-------------------------------------------------------
Running org.apache.jackrabbit.core.version.TestAll
Tests run: 5, Failures: 0, Errors: 0, Skipped: 0, Time elapsed: 10.714 sec
Running org.apache.jackrabbit.core.security.authorization.principalbased.TestAll
Tests run: 88, Failures: 0, Errors: 0, Skipped: 0, Time elapsed: 0.353 sec
Running org.apache.jackrabbit.core.security.authorization.acl.TestAll
Tests run: 95, Failures: 0, Errors: 0, Skipped: 0, Time elapsed: 8.191 sec
Running org.apache.jackrabbit.api.security.TestAll
Tests run: 4, Failures: 0, Errors: 0, Skipped: 0, Time elapsed: 0.013 sec
Running org.apache.jackrabbit.core.config.TestAll
Tests run: 24, Failures: 0, Errors: 0, Skipped: 0, Time elapsed: 0.254 sec
Running org.apache.jackrabbit.core.query.lucene.directory.TestAll
Tests run: 6, Failures: 0, Errors: 0, Skipped: 0, Time elapsed: 0.038 sec
Running org.apache.jackrabbit.core.security.user.TestAll
Tests run: 151, Failures: 0, Errors: 0, Skipped: 0, Time elapsed: 3.274 sec
Running org.apache.jackrabbit.core.security.authentication.TestAll
Tests run: 11, Failures: 0, Errors: 0, Skipped: 0, Time elapsed: 0.022 sec
Running org.apache.jackrabbit.core.journal.TestAll
Tests run: 4, Failures: 0, Errors: 0, Skipped: 0, Time elapsed: 1.244 sec
Running org.apache.jackrabbit.api.security.principal.TestAll
Tests run: 16, Failures: 0, Errors: 0, Skipped: 0, Time elapsed: 0.108 sec
Running org.apache.jackrabbit.core.state.TestAll
Tests run: 15, Failures: 0, Errors: 0, Skipped: 0, Time elapsed: 3.254 sec
Running org.apache.jackrabbit.core.lock.TestAll
Tests run: 1, Failures: 0, Errors: 0, Skipped: 0, Time elapsed: 0.011 sec
Running org.apache.jackrabbit.core.security.TestAll
Tests run: 16, Failures: 0, Errors: 0, Skipped: 0, Time elapsed: 0.623 sec
Running org.apache.jackrabbit.core.security.principal.TestAll
Tests run: 3, Failures: 0, Errors: 0, Skipped: 0, Time elapsed: 0.095 sec
Running org.apache.jackrabbit.core.util.TestAll
Tests run: 4, Failures: 0, Errors: 0, Skipped: 0, Time elapsed: 2.073 sec
Running org.apache.jackrabbit.api.security.user.TestAll
Tests run: 75, Failures: 0, Errors: 0, Skipped: 0, Time elapsed: 1.397 sec
Running org.apache.jackrabbit.core.cluster.TestAll
Tests run: 9, Failures: 0, Errors: 0, Skipped: 0, Time elapsed: 0.038 sec
Running org.apache.jackrabbit.core.nodetype.xml.TestAll
Tests run: 38, Failures: 0, Errors: 0, Skipped: 0, Time elapsed: 0.778 sec
Running org.apache.jackrabbit.core.TestAll
Tests run: 127, Failures: 0, Errors: 0, Skipped: 0, Time elapsed: 2.896 sec
Running org.apache.jackrabbit.core.fs.TestAll
Tests run: 3, Failures: 0, Errors: 0, Skipped: 0, Time elapsed: 0.603 sec
Running org.apache.jackrabbit.core.security.authorization.combined.TestAll
Tests run: 40, Failures: 0, Errors: 0, Skipped: 0, Time elapsed: 0.894 sec
Running org.apache.jackrabbit.core.xml.TestAll
Tests run: 13, Failures: 0, Errors: 0, Skipped: 0, Time elapsed: 0.244 sec
Running org.apache.jackrabbit.core.util.db.TestAll
Tests run: 13, Failures: 0, Errors: 0, Skipped: 0, Time elapsed: 0.206 sec
Running org.apache.jackrabbit.core.observation.TestAll
Tests run: 14, Failures: 0, Errors: 0, Skipped: 0, Time elapsed: 0.326 sec
Running org.apache.jackrabbit.core.retention.TestAll
Tests run: 5, Failures: 0, Errors: 0, Skipped: 0, Time elapsed: 0.042 sec
Running org.apache.jackrabbit.core.value.TestAll
Tests run: 92, Failures: 0, Errors: 0, Skipped: 0, Time elapsed: 0.078 sec
Running org.apache.jackrabbit.core.nodetype.TestAll
Tests run: 1, Failures: 0, Errors: 0, Skipped: 0, Time elapsed: 0.496 sec
Running org.apache.jackrabbit.core.id.TestAll
Tests run: 6, Failures: 0, Errors: 0, Skipped: 0, Time elapsed: 0.005 sec
Running org.apache.jackrabbit.core.query.lucene.TestAll
Tests run: 13, Failures: 0, Errors: 0, Skipped: 0, Time elapsed: 3.887 sec
Running org.apache.jackrabbit.core.query.TestAll
Tests run: 162, Failures: 0, Errors: 0, Skipped: 0, Time elapsed: 7.028 sec
Running org.apache.jackrabbit.core.security.authorization.TestAll
Tests run: 24, Failures: 0, Errors: 0, Skipped: 0, Time elapsed: 0.07 sec
Running org.apache.jackrabbit.core.data.TestAll
Tests run: 23, Failures: 0, Errors: 0, Skipped: 0, Time elapsed: 9.885 sec

Results :

Tests run: 1101, Failures: 0, Errors: 0, Skipped: 0

[TASKS] Skipping maven reporter: there is already a result available.
[HUDSON] Recording test results
[INFO] [jar:jar]
[INFO] Building jar: <http://hudson.zones.apache.org/hudson/job/Jackrabbit-trunk/ws/trunk/jackrabbit-core/target/jackrabbit-core-2.2-SNAPSHOT.jar>
[TASKS] Skipping maven reporter: there is already a result available.
[INFO] [surefire:test {execution: do_test}]
[INFO] Surefire report directory: <http://hudson.zones.apache.org/hudson/job/Jackrabbit-trunk/ws/trunk/jackrabbit-core/target/surefire-reports>

-------------------------------------------------------
 T E S T S
-------------------------------------------------------
Running org.apache.jackrabbit.core.integration.MassiveWildcardTest
Tests run: 1, Failures: 0, Errors: 0, Skipped: 0, Time elapsed: 14.242 sec
Running org.apache.jackrabbit.core.integration.BackwardsCompatibilityTest
Tests run: 1, Failures: 0, Errors: 0, Skipped: 0, Time elapsed: 9.238 sec
Running org.apache.jackrabbit.core.integration.SessionImplTest
Tests run: 3, Failures: 0, Errors: 0, Skipped: 0, Time elapsed: 0.622 sec
Running org.apache.jackrabbit.core.integration.RepositoryLockTest
Tests run: 1, Failures: 0, Errors: 0, Skipped: 0, Time elapsed: 1.46 sec
Running org.apache.jackrabbit.core.integration.AxisQueryTest
Tests run: 1, Failures: 0, Errors: 0, Skipped: 0, Time elapsed: 10.653 sec
Running org.apache.jackrabbit.core.integration.RestoreSameNameSiblingTest
Tests run: 1, Failures: 0, Errors: 0, Skipped: 0, Time elapsed: 0.086 sec
Running org.apache.jackrabbit.core.integration.ConcurrentQueriesWithUpdatesTest
Tests run: 1, Failures: 0, Errors: 0, Skipped: 0, Time elapsed: 15.472 sec
Running org.apache.jackrabbit.core.integration.GQLTest
Tests run: 18, Failures: 0, Errors: 0, Skipped: 0, Time elapsed: 0.555 sec
Running org.apache.jackrabbit.core.integration.WorkspaceInitTest
Tests run: 1, Failures: 0, Errors: 0, Skipped: 0, Time elapsed: 10.043 sec
Running org.apache.jackrabbit.core.integration.NodeImplTest
Tests run: 2, Failures: 0, Errors: 0, Skipped: 0, Time elapsed: 0.03 sec
Running org.apache.jackrabbit.core.integration.MassiveRangeTest
Tests run: 1, Failures: 0, Errors: 0, Skipped: 0, Time elapsed: 3.32 sec
Running org.apache.jackrabbit.core.integration.JCRAPITest
Tests run: 1897, Failures: 0, Errors: 0, Skipped: 0, Time elapsed: 32.952 sec
Running org.apache.jackrabbit.core.integration.VersioningTest
Tests run: 1, Failures: 0, Errors: 0, Skipped: 0, Time elapsed: 0.188 sec
Running org.apache.jackrabbit.core.integration.RepositoryFactoryImplTest
Tests run: 6, Failures: 0, Errors: 0, Skipped: 0, Time elapsed: 3.593 sec
Running org.apache.jackrabbit.core.integration.ConcurrentQueryTest
Tests run: 2, Failures: 0, Errors: 0, Skipped: 0, Time elapsed: 3.574 sec

Results :

Tests run: 1937, Failures: 0, Errors: 0, Skipped: 0

[TASKS] Skipping maven reporter: there is already a result available.
[HUDSON] Recording test results
[INFO] [apache-rat:check {execution: default}]
[INFO] Exclude: src/main/javadoc/**/*.uxf
[INFO] Exclude: src/test/repository/**
[INFO] Exclude: src/test/resources/**/*.txt
[INFO] Exclude: src/test/resources/**/*.rtf
[INFO] Exclude: src/test/resources/**/*.cnd
[INFO] Exclude: src/test/compatibility/**/target/**
[INFO] Exclude: src/test/compatibility/**/.*/**
[INFO] Exclude: src/test/compatibility/repositories.zip
[INFO] Exclude: repository/**
[INFO] Exclude: *.log
[TASKS] Skipping maven reporter: there is already a result available.
[HUDSON] Archiving <http://hudson.zones.apache.org/hudson/job/Jackrabbit-trunk/ws/trunk/jackrabbit-core/pom.xml> to /export/home/hudson/hudson/jobs/Jackrabbit-trunk/modules/org.apache.jackrabbit$jackrabbit-core/builds/2010-06-04_17-02-14/archive/org.apache.jackrabbit/jackrabbit-core/2.2-SNAPSHOT/pom.xml
[HUDSON] Archiving <http://hudson.zones.apache.org/hudson/job/Jackrabbit-trunk/ws/trunk/jackrabbit-core/target/jackrabbit-core-2.2-SNAPSHOT.jar> to /export/home/hudson/hudson/jobs/Jackrabbit-trunk/modules/org.apache.jackrabbit$jackrabbit-core/builds/2010-06-04_17-02-14/archive/org.apache.jackrabbit/jackrabbit-core/2.2-SNAPSHOT/jackrabbit-core-2.2-SNAPSHOT.jar
[INFO] ------------------------------------------------------------------------
[ERROR] BUILD FAILURE
[INFO] ------------------------------------------------------------------------
[INFO] Too many unapproved licenses: 1
[INFO] ------------------------------------------------------------------------
[INFO] For more information, run Maven with the -e switch
[INFO] ------------------------------------------------------------------------
[INFO] Total time: 6 minutes 52 seconds
[INFO] Finished at: Fri Jun 04 17:09:24 UTC 2010
[INFO] Final Memory: 71M/326M
[INFO] ------------------------------------------------------------------------
Sending e-mails to: dev@jackrabbit.apache.org
channel stopped
[locks-and-latches] Releasing all the locks
[locks-and-latches] All the locks released


Hudson build is back to normal : Jackrabbit-trunk #1165

Posted by Apache Hudson Server <hu...@hudson.zones.apache.org>.
See <http://hudson.zones.apache.org/hudson/job/Jackrabbit-trunk/1165/changes>



Re: Build failed in Hudson: Jackrabbit-trunk #1164

Posted by Stefan Guggisberg <st...@day.com>.
mea culpa (forgot a license header), fixed it in rev. 951559

cheers
stefan

On Fri, Jun 4, 2010 at 7:10 PM, Apache Hudson Server
<hu...@hudson.zones.apache.org> wrote:
> See <http://hudson.zones.apache.org/hudson/job/Jackrabbit-trunk/1164/changes>
>
> Changes:
>
> [stefan] JCR-2632: Concurrent Session.move() operations failure
>
> ------------------------------------------
> [...truncated 717 lines...]
>        at com.sun.org.apache.xerces.internal.jaxp.DocumentBuilderImpl.parse(DocumentBuilderImpl.java:292)
>        at javax.xml.parsers.DocumentBuilder.parse(DocumentBuilder.java:172)
>        at org.apache.felix.obrplugin.ObrUpdate.parseFile(ObrUpdate.java:347)
>        at org.apache.felix.obrplugin.ObrUpdate.parseRepositoryXml(ObrUpdate.java:324)
>        at org.apache.felix.obrplugin.ObrInstall.execute(ObrInstall.java:140)
>        at org.apache.maven.plugin.DefaultPluginManager.executeMojo(DefaultPluginManager.java:451)
>        at hudson.maven.agent.PluginManagerInterceptor.executeMojo(PluginManagerInterceptor.java:182)
>        at org.apache.maven.lifecycle.DefaultLifecycleExecutor.executeGoals(DefaultLifecycleExecutor.java:558)
>        at org.apache.maven.lifecycle.DefaultLifecycleExecutor.executeGoalWithLifecycle(DefaultLifecycleExecutor.java:499)
>        at org.apache.maven.lifecycle.DefaultLifecycleExecutor.executeGoal(DefaultLifecycleExecutor.java:478)
>        at org.apache.maven.lifecycle.DefaultLifecycleExecutor.executeGoalAndHandleFailures(DefaultLifecycleExecutor.java:330)
>        at org.apache.maven.lifecycle.DefaultLifecycleExecutor.executeTaskSegments(DefaultLifecycleExecutor.java:291)
>        at org.apache.maven.lifecycle.DefaultLifecycleExecutor.execute(DefaultLifecycleExecutor.java:142)
>        at org.apache.maven.lifecycle.LifecycleExecutorInterceptor.execute(LifecycleExecutorInterceptor.java:65)
>        at org.apache.maven.DefaultMaven.doExecute(DefaultMaven.java:336)
>        at org.apache.maven.DefaultMaven.execute(DefaultMaven.java:129)
>        at org.apache.maven.cli.MavenCli.main(MavenCli.java:287)
>        at sun.reflect.NativeMethodAccessorImpl.invoke0(Native Method)
>        at sun.reflect.NativeMethodAccessorImpl.invoke(NativeMethodAccessorImpl.java:39)
>        at sun.reflect.DelegatingMethodAccessorImpl.invoke(DelegatingMethodAccessorImpl.java:25)
>        at java.lang.reflect.Method.invoke(Method.java:592)
>        at org.codehaus.classworlds.Launcher.launchEnhanced(Launcher.java:315)
>        at org.codehaus.classworlds.Launcher.launch(Launcher.java:255)
>        at hudson.maven.agent.Main.launch(Main.java:165)
>        at hudson.maven.MavenBuilder.call(MavenBuilder.java:159)
>        at hudson.maven.MavenModuleSetBuild$Builder.call(MavenModuleSetBuild.java:688)
>        at hudson.maven.MavenModuleSetBuild$Builder.call(MavenModuleSetBuild.java:632)
>        at hudson.remoting.UserRequest.perform(UserRequest.java:114)
>        at hudson.remoting.UserRequest.perform(UserRequest.java:48)
>        at hudson.remoting.Request$2.run(Request.java:270)
>        at java.util.concurrent.Executors$RunnableAdapter.call(Executors.java:417)
>        at java.util.concurrent.FutureTask$Sync.innerRun(FutureTask.java:269)
>        at java.util.concurrent.FutureTask.run(FutureTask.java:123)
>        at java.util.concurrent.ThreadPoolExecutor$Worker.runTask(ThreadPoolExecutor.java:651)
>        at java.util.concurrent.ThreadPoolExecutor$Worker.run(ThreadPoolExecutor.java:676)
>        at java.lang.Thread.run(Thread.java:595)
> [INFO] Writing OBR metadata
>
> [TASKS] Skipping maven reporter: there is already a result available.[INFO] [deploy:deploy]
> [INFO] Retrieving previous build number from apache.snapshots.https
>
> Uploading: https://repository.apache.org/content/repositories/snapshots/org/apache/jackrabbit/jackrabbit-spi-commons/2.2-SNAPSHOT/jackrabbit-spi-commons-2.2-20100604.170254-57.jar
> 709K uploaded
> [INFO] Retrieving previous metadata from apache.snapshots.https
> [INFO] Uploading repository metadata for: 'artifact org.apache.jackrabbit:jackrabbit-spi-commons'
> [INFO] Retrieving previous metadata from apache.snapshots.https
> [INFO] Uploading repository metadata for: 'snapshot org.apache.jackrabbit:jackrabbit-spi-commons:2.2-SNAPSHOT'
> [INFO] Uploading project information for jackrabbit-spi-commons 2.2-20100604.170254-57
> [TASKS] Skipping maven reporter: there is already a result available.[INFO] [bundle:deploy]
> [INFO] Remote OBR update disabled (enable with -DremoteOBR)
>
> [TASKS] Skipping maven reporter: there is already a result available.
> [HUDSON] Archiving <http://hudson.zones.apache.org/hudson/job/Jackrabbit-trunk/ws/trunk/jackrabbit-spi-commons/pom.xml> to /export/home/hudson/hudson/jobs/Jackrabbit-trunk/modules/org.apache.jackrabbit$jackrabbit-spi-commons/builds/2010-06-04_17-02-14/archive/org.apache.jackrabbit/jackrabbit-spi-commons/2.2-SNAPSHOT/pom.xml
> [HUDSON] Archiving <http://hudson.zones.apache.org/hudson/job/Jackrabbit-trunk/ws/trunk/jackrabbit-spi-commons/target/jackrabbit-spi-commons-2.2-SNAPSHOT.jar> to /export/home/hudson/hudson/jobs/Jackrabbit-trunk/modules/org.apache.jackrabbit$jackrabbit-spi-commons/builds/2010-06-04_17-02-14/archive/org.apache.jackrabbit/jackrabbit-spi-commons/2.2-20100604.170254-57/jackrabbit-spi-commons-2.2-SNAPSHOT.jar
> [INFO] ------------------------------------------------------------------------
> [INFO] Building Jackrabbit Core
> [INFO]    task-segment: [clean, deploy]
> [INFO] ------------------------------------------------------------------------
> [INFO] [clean:clean]
> [INFO] Deleting file set: <http://hudson.zones.apache.org/hudson/job/Jackrabbit-trunk/ws/trunk/jackrabbit-core/target> (included: [**], excluded: [])
> [TASKS] Scanning folder '<http://hudson.zones.apache.org/hudson/job/Jackrabbit-trunk/ws/trunk/jackrabbit-core/src/main/java'> for tasks ...
> [TASKS] Found 195.
> [TASKS] Scanning folder '<http://hudson.zones.apache.org/hudson/job/Jackrabbit-trunk/ws/trunk/jackrabbit-core/src/test/java'> for tasks ...
> [TASKS] Found 25.
> [TASKS] Scanning folder '<http://hudson.zones.apache.org/hudson/job/Jackrabbit-trunk/ws/trunk/jackrabbit-core/src/main/resources'> for tasks ...
> [TASKS] Found 0.
> [TASKS] Scanning folder '<http://hudson.zones.apache.org/hudson/job/Jackrabbit-trunk/ws/trunk/jackrabbit-core/src/main/resources-filtered'> for tasks ...
> [TASKS] Found 0.
> [TASKS] Scanning folder '<http://hudson.zones.apache.org/hudson/job/Jackrabbit-trunk/ws/trunk/jackrabbit-core/src/test/resources'> for tasks ...
> [TASKS] Found 0.
> [INFO] snapshot org.apache.jackrabbit:jackrabbit-api:2.2-SNAPSHOT: checking for updates from apache.snapshots
> [INFO] snapshot org.apache.jackrabbit:jackrabbit-spi-commons:2.2-SNAPSHOT: checking for updates from apache.snapshots
> [INFO] [remote-resources:process {execution: default}]
> [TASKS] Skipping maven reporter: there is already a result available.
> [INFO] [resources:resources]
> [INFO] Using 'UTF-8' encoding to copy filtered resources.
> [INFO] Copying 72 resources
> [INFO] Copying 1 resource
> [INFO] Copying 3 resources
> [TASKS] Skipping maven reporter: there is already a result available.
> [INFO] [compiler:compile]
> [INFO] Compiling 686 source files to <http://hudson.zones.apache.org/hudson/job/Jackrabbit-trunk/ws/trunk/jackrabbit-core/target/classes>
> [TASKS] Skipping maven reporter: there is already a result available.[INFO] [resources:testResources]
> [INFO] Using 'UTF-8' encoding to copy filtered resources.
> [INFO] Copying 20 resources
>
> [INFO] Copying 3 resources
> [TASKS] Skipping maven reporter: there is already a result available.
> [INFO] [antrun:run {execution: process-test-resources}]
> [INFO] Executing tasks
>     [copy] Copying 34 files to <http://hudson.zones.apache.org/hudson/job/Jackrabbit-trunk/ws/trunk/jackrabbit-core/target/repository>
>     [copy] Copying 34 files to <http://hudson.zones.apache.org/hudson/job/Jackrabbit-trunk/ws/trunk/jackrabbit-core/target/repository-2>
> [INFO] Executed tasks
> [TASKS] Skipping maven reporter: there is already a result available.
> [INFO] [compiler:testCompile]
> [INFO] Compiling 288 source files to <http://hudson.zones.apache.org/hudson/job/Jackrabbit-trunk/ws/trunk/jackrabbit-core/target/test-classes>
> [TASKS] Skipping maven reporter: there is already a result available.
> [INFO] [surefire:test]
> [INFO] Surefire report directory: <http://hudson.zones.apache.org/hudson/job/Jackrabbit-trunk/ws/trunk/jackrabbit-core/target/surefire-reports>
>
> -------------------------------------------------------
>  T E S T S
> -------------------------------------------------------
> Running org.apache.jackrabbit.core.version.TestAll
> Tests run: 5, Failures: 0, Errors: 0, Skipped: 0, Time elapsed: 10.714 sec
> Running org.apache.jackrabbit.core.security.authorization.principalbased.TestAll
> Tests run: 88, Failures: 0, Errors: 0, Skipped: 0, Time elapsed: 0.353 sec
> Running org.apache.jackrabbit.core.security.authorization.acl.TestAll
> Tests run: 95, Failures: 0, Errors: 0, Skipped: 0, Time elapsed: 8.191 sec
> Running org.apache.jackrabbit.api.security.TestAll
> Tests run: 4, Failures: 0, Errors: 0, Skipped: 0, Time elapsed: 0.013 sec
> Running org.apache.jackrabbit.core.config.TestAll
> Tests run: 24, Failures: 0, Errors: 0, Skipped: 0, Time elapsed: 0.254 sec
> Running org.apache.jackrabbit.core.query.lucene.directory.TestAll
> Tests run: 6, Failures: 0, Errors: 0, Skipped: 0, Time elapsed: 0.038 sec
> Running org.apache.jackrabbit.core.security.user.TestAll
> Tests run: 151, Failures: 0, Errors: 0, Skipped: 0, Time elapsed: 3.274 sec
> Running org.apache.jackrabbit.core.security.authentication.TestAll
> Tests run: 11, Failures: 0, Errors: 0, Skipped: 0, Time elapsed: 0.022 sec
> Running org.apache.jackrabbit.core.journal.TestAll
> Tests run: 4, Failures: 0, Errors: 0, Skipped: 0, Time elapsed: 1.244 sec
> Running org.apache.jackrabbit.api.security.principal.TestAll
> Tests run: 16, Failures: 0, Errors: 0, Skipped: 0, Time elapsed: 0.108 sec
> Running org.apache.jackrabbit.core.state.TestAll
> Tests run: 15, Failures: 0, Errors: 0, Skipped: 0, Time elapsed: 3.254 sec
> Running org.apache.jackrabbit.core.lock.TestAll
> Tests run: 1, Failures: 0, Errors: 0, Skipped: 0, Time elapsed: 0.011 sec
> Running org.apache.jackrabbit.core.security.TestAll
> Tests run: 16, Failures: 0, Errors: 0, Skipped: 0, Time elapsed: 0.623 sec
> Running org.apache.jackrabbit.core.security.principal.TestAll
> Tests run: 3, Failures: 0, Errors: 0, Skipped: 0, Time elapsed: 0.095 sec
> Running org.apache.jackrabbit.core.util.TestAll
> Tests run: 4, Failures: 0, Errors: 0, Skipped: 0, Time elapsed: 2.073 sec
> Running org.apache.jackrabbit.api.security.user.TestAll
> Tests run: 75, Failures: 0, Errors: 0, Skipped: 0, Time elapsed: 1.397 sec
> Running org.apache.jackrabbit.core.cluster.TestAll
> Tests run: 9, Failures: 0, Errors: 0, Skipped: 0, Time elapsed: 0.038 sec
> Running org.apache.jackrabbit.core.nodetype.xml.TestAll
> Tests run: 38, Failures: 0, Errors: 0, Skipped: 0, Time elapsed: 0.778 sec
> Running org.apache.jackrabbit.core.TestAll
> Tests run: 127, Failures: 0, Errors: 0, Skipped: 0, Time elapsed: 2.896 sec
> Running org.apache.jackrabbit.core.fs.TestAll
> Tests run: 3, Failures: 0, Errors: 0, Skipped: 0, Time elapsed: 0.603 sec
> Running org.apache.jackrabbit.core.security.authorization.combined.TestAll
> Tests run: 40, Failures: 0, Errors: 0, Skipped: 0, Time elapsed: 0.894 sec
> Running org.apache.jackrabbit.core.xml.TestAll
> Tests run: 13, Failures: 0, Errors: 0, Skipped: 0, Time elapsed: 0.244 sec
> Running org.apache.jackrabbit.core.util.db.TestAll
> Tests run: 13, Failures: 0, Errors: 0, Skipped: 0, Time elapsed: 0.206 sec
> Running org.apache.jackrabbit.core.observation.TestAll
> Tests run: 14, Failures: 0, Errors: 0, Skipped: 0, Time elapsed: 0.326 sec
> Running org.apache.jackrabbit.core.retention.TestAll
> Tests run: 5, Failures: 0, Errors: 0, Skipped: 0, Time elapsed: 0.042 sec
> Running org.apache.jackrabbit.core.value.TestAll
> Tests run: 92, Failures: 0, Errors: 0, Skipped: 0, Time elapsed: 0.078 sec
> Running org.apache.jackrabbit.core.nodetype.TestAll
> Tests run: 1, Failures: 0, Errors: 0, Skipped: 0, Time elapsed: 0.496 sec
> Running org.apache.jackrabbit.core.id.TestAll
> Tests run: 6, Failures: 0, Errors: 0, Skipped: 0, Time elapsed: 0.005 sec
> Running org.apache.jackrabbit.core.query.lucene.TestAll
> Tests run: 13, Failures: 0, Errors: 0, Skipped: 0, Time elapsed: 3.887 sec
> Running org.apache.jackrabbit.core.query.TestAll
> Tests run: 162, Failures: 0, Errors: 0, Skipped: 0, Time elapsed: 7.028 sec
> Running org.apache.jackrabbit.core.security.authorization.TestAll
> Tests run: 24, Failures: 0, Errors: 0, Skipped: 0, Time elapsed: 0.07 sec
> Running org.apache.jackrabbit.core.data.TestAll
> Tests run: 23, Failures: 0, Errors: 0, Skipped: 0, Time elapsed: 9.885 sec
>
> Results :
>
> Tests run: 1101, Failures: 0, Errors: 0, Skipped: 0
>
> [TASKS] Skipping maven reporter: there is already a result available.
> [HUDSON] Recording test results
> [INFO] [jar:jar]
> [INFO] Building jar: <http://hudson.zones.apache.org/hudson/job/Jackrabbit-trunk/ws/trunk/jackrabbit-core/target/jackrabbit-core-2.2-SNAPSHOT.jar>
> [TASKS] Skipping maven reporter: there is already a result available.
> [INFO] [surefire:test {execution: do_test}]
> [INFO] Surefire report directory: <http://hudson.zones.apache.org/hudson/job/Jackrabbit-trunk/ws/trunk/jackrabbit-core/target/surefire-reports>
>
> -------------------------------------------------------
>  T E S T S
> -------------------------------------------------------
> Running org.apache.jackrabbit.core.integration.MassiveWildcardTest
> Tests run: 1, Failures: 0, Errors: 0, Skipped: 0, Time elapsed: 14.242 sec
> Running org.apache.jackrabbit.core.integration.BackwardsCompatibilityTest
> Tests run: 1, Failures: 0, Errors: 0, Skipped: 0, Time elapsed: 9.238 sec
> Running org.apache.jackrabbit.core.integration.SessionImplTest
> Tests run: 3, Failures: 0, Errors: 0, Skipped: 0, Time elapsed: 0.622 sec
> Running org.apache.jackrabbit.core.integration.RepositoryLockTest
> Tests run: 1, Failures: 0, Errors: 0, Skipped: 0, Time elapsed: 1.46 sec
> Running org.apache.jackrabbit.core.integration.AxisQueryTest
> Tests run: 1, Failures: 0, Errors: 0, Skipped: 0, Time elapsed: 10.653 sec
> Running org.apache.jackrabbit.core.integration.RestoreSameNameSiblingTest
> Tests run: 1, Failures: 0, Errors: 0, Skipped: 0, Time elapsed: 0.086 sec
> Running org.apache.jackrabbit.core.integration.ConcurrentQueriesWithUpdatesTest
> Tests run: 1, Failures: 0, Errors: 0, Skipped: 0, Time elapsed: 15.472 sec
> Running org.apache.jackrabbit.core.integration.GQLTest
> Tests run: 18, Failures: 0, Errors: 0, Skipped: 0, Time elapsed: 0.555 sec
> Running org.apache.jackrabbit.core.integration.WorkspaceInitTest
> Tests run: 1, Failures: 0, Errors: 0, Skipped: 0, Time elapsed: 10.043 sec
> Running org.apache.jackrabbit.core.integration.NodeImplTest
> Tests run: 2, Failures: 0, Errors: 0, Skipped: 0, Time elapsed: 0.03 sec
> Running org.apache.jackrabbit.core.integration.MassiveRangeTest
> Tests run: 1, Failures: 0, Errors: 0, Skipped: 0, Time elapsed: 3.32 sec
> Running org.apache.jackrabbit.core.integration.JCRAPITest
> Tests run: 1897, Failures: 0, Errors: 0, Skipped: 0, Time elapsed: 32.952 sec
> Running org.apache.jackrabbit.core.integration.VersioningTest
> Tests run: 1, Failures: 0, Errors: 0, Skipped: 0, Time elapsed: 0.188 sec
> Running org.apache.jackrabbit.core.integration.RepositoryFactoryImplTest
> Tests run: 6, Failures: 0, Errors: 0, Skipped: 0, Time elapsed: 3.593 sec
> Running org.apache.jackrabbit.core.integration.ConcurrentQueryTest
> Tests run: 2, Failures: 0, Errors: 0, Skipped: 0, Time elapsed: 3.574 sec
>
> Results :
>
> Tests run: 1937, Failures: 0, Errors: 0, Skipped: 0
>
> [TASKS] Skipping maven reporter: there is already a result available.
> [HUDSON] Recording test results
> [INFO] [apache-rat:check {execution: default}]
> [INFO] Exclude: src/main/javadoc/**/*.uxf
> [INFO] Exclude: src/test/repository/**
> [INFO] Exclude: src/test/resources/**/*.txt
> [INFO] Exclude: src/test/resources/**/*.rtf
> [INFO] Exclude: src/test/resources/**/*.cnd
> [INFO] Exclude: src/test/compatibility/**/target/**
> [INFO] Exclude: src/test/compatibility/**/.*/**
> [INFO] Exclude: src/test/compatibility/repositories.zip
> [INFO] Exclude: repository/**
> [INFO] Exclude: *.log
> [TASKS] Skipping maven reporter: there is already a result available.
> [HUDSON] Archiving <http://hudson.zones.apache.org/hudson/job/Jackrabbit-trunk/ws/trunk/jackrabbit-core/pom.xml> to /export/home/hudson/hudson/jobs/Jackrabbit-trunk/modules/org.apache.jackrabbit$jackrabbit-core/builds/2010-06-04_17-02-14/archive/org.apache.jackrabbit/jackrabbit-core/2.2-SNAPSHOT/pom.xml
> [HUDSON] Archiving <http://hudson.zones.apache.org/hudson/job/Jackrabbit-trunk/ws/trunk/jackrabbit-core/target/jackrabbit-core-2.2-SNAPSHOT.jar> to /export/home/hudson/hudson/jobs/Jackrabbit-trunk/modules/org.apache.jackrabbit$jackrabbit-core/builds/2010-06-04_17-02-14/archive/org.apache.jackrabbit/jackrabbit-core/2.2-SNAPSHOT/jackrabbit-core-2.2-SNAPSHOT.jar
> [INFO] ------------------------------------------------------------------------
> [ERROR] BUILD FAILURE
> [INFO] ------------------------------------------------------------------------
> [INFO] Too many unapproved licenses: 1
> [INFO] ------------------------------------------------------------------------
> [INFO] For more information, run Maven with the -e switch
> [INFO] ------------------------------------------------------------------------
> [INFO] Total time: 6 minutes 52 seconds
> [INFO] Finished at: Fri Jun 04 17:09:24 UTC 2010
> [INFO] Final Memory: 71M/326M
> [INFO] ------------------------------------------------------------------------
> Sending e-mails to: dev@jackrabbit.apache.org
> channel stopped
> [locks-and-latches] Releasing all the locks
> [locks-and-latches] All the locks released
>
>