You are viewing a plain text version of this content. The canonical link for it is here.
Posted to dev@lucene.apache.org by Policeman Jenkins Server <je...@thetaphi.de> on 2018/11/14 17:48:42 UTC
[JENKINS] Lucene-Solr-master-MacOSX (64bit/jdk-9) - Build # 4925 -
Still Unstable!
Build: https://jenkins.thetaphi.de/job/Lucene-Solr-master-MacOSX/4925/
Java: 64bit/jdk-9 -XX:+UseCompressedOops -XX:+UseSerialGC
5 tests failed.
FAILED: org.apache.solr.cloud.TestTlogReplica.testRecovery
Error Message:
Can not find doc 7 in https://127.0.0.1:51633/solr
Stack Trace:
java.lang.AssertionError: Can not find doc 7 in https://127.0.0.1:51633/solr
at __randomizedtesting.SeedInfo.seed([EEDE29EE60EA9EE6:2F2E50424DBA5441]:0)
at org.junit.Assert.fail(Assert.java:93)
at org.junit.Assert.assertTrue(Assert.java:43)
at org.junit.Assert.assertNotNull(Assert.java:526)
at org.apache.solr.cloud.TestTlogReplica.checkRTG(TestTlogReplica.java:902)
at org.apache.solr.cloud.TestTlogReplica.testRecovery(TestTlogReplica.java:567)
at java.base/jdk.internal.reflect.NativeMethodAccessorImpl.invoke0(Native Method)
at java.base/jdk.internal.reflect.NativeMethodAccessorImpl.invoke(NativeMethodAccessorImpl.java:62)
at java.base/jdk.internal.reflect.DelegatingMethodAccessorImpl.invoke(DelegatingMethodAccessorImpl.java:43)
at java.base/java.lang.reflect.Method.invoke(Method.java:564)
at com.carrotsearch.randomizedtesting.RandomizedRunner.invoke(RandomizedRunner.java:1742)
at com.carrotsearch.randomizedtesting.RandomizedRunner$8.evaluate(RandomizedRunner.java:935)
at com.carrotsearch.randomizedtesting.RandomizedRunner$9.evaluate(RandomizedRunner.java:971)
at com.carrotsearch.randomizedtesting.RandomizedRunner$10.evaluate(RandomizedRunner.java:985)
at com.carrotsearch.randomizedtesting.rules.SystemPropertiesRestoreRule$1.evaluate(SystemPropertiesRestoreRule.java:57)
at org.apache.lucene.util.TestRuleSetupTeardownChained$1.evaluate(TestRuleSetupTeardownChained.java:49)
at org.apache.lucene.util.AbstractBeforeAfterRule$1.evaluate(AbstractBeforeAfterRule.java:45)
at org.apache.lucene.util.TestRuleThreadAndTestName$1.evaluate(TestRuleThreadAndTestName.java:48)
at org.apache.lucene.util.TestRuleIgnoreAfterMaxFailures$1.evaluate(TestRuleIgnoreAfterMaxFailures.java:64)
at org.apache.lucene.util.TestRuleMarkFailure$1.evaluate(TestRuleMarkFailure.java:47)
at com.carrotsearch.randomizedtesting.rules.StatementAdapter.evaluate(StatementAdapter.java:36)
at com.carrotsearch.randomizedtesting.ThreadLeakControl$StatementRunner.run(ThreadLeakControl.java:368)
at com.carrotsearch.randomizedtesting.ThreadLeakControl.forkTimeoutingTask(ThreadLeakControl.java:817)
at com.carrotsearch.randomizedtesting.ThreadLeakControl$3.evaluate(ThreadLeakControl.java:468)
at com.carrotsearch.randomizedtesting.RandomizedRunner.runSingleTest(RandomizedRunner.java:944)
at com.carrotsearch.randomizedtesting.RandomizedRunner$5.evaluate(RandomizedRunner.java:830)
at com.carrotsearch.randomizedtesting.RandomizedRunner$6.evaluate(RandomizedRunner.java:880)
at com.carrotsearch.randomizedtesting.RandomizedRunner$7.evaluate(RandomizedRunner.java:891)
at com.carrotsearch.randomizedtesting.rules.StatementAdapter.evaluate(StatementAdapter.java:36)
at com.carrotsearch.randomizedtesting.rules.SystemPropertiesRestoreRule$1.evaluate(SystemPropertiesRestoreRule.java:57)
at org.apache.lucene.util.AbstractBeforeAfterRule$1.evaluate(AbstractBeforeAfterRule.java:45)
at com.carrotsearch.randomizedtesting.rules.StatementAdapter.evaluate(StatementAdapter.java:36)
at org.apache.lucene.util.TestRuleStoreClassName$1.evaluate(TestRuleStoreClassName.java:41)
at com.carrotsearch.randomizedtesting.rules.NoShadowingOrOverridesOnMethodsRule$1.evaluate(NoShadowingOrOverridesOnMethodsRule.java:40)
at com.carrotsearch.randomizedtesting.rules.NoShadowingOrOverridesOnMethodsRule$1.evaluate(NoShadowingOrOverridesOnMethodsRule.java:40)
at com.carrotsearch.randomizedtesting.rules.StatementAdapter.evaluate(StatementAdapter.java:36)
at com.carrotsearch.randomizedtesting.rules.StatementAdapter.evaluate(StatementAdapter.java:36)
at org.apache.lucene.util.TestRuleAssertionsRequired$1.evaluate(TestRuleAssertionsRequired.java:53)
at org.apache.lucene.util.TestRuleMarkFailure$1.evaluate(TestRuleMarkFailure.java:47)
at org.apache.lucene.util.TestRuleIgnoreAfterMaxFailures$1.evaluate(TestRuleIgnoreAfterMaxFailures.java:64)
at org.apache.lucene.util.TestRuleIgnoreTestSuites$1.evaluate(TestRuleIgnoreTestSuites.java:54)
at com.carrotsearch.randomizedtesting.rules.StatementAdapter.evaluate(StatementAdapter.java:36)
at com.carrotsearch.randomizedtesting.ThreadLeakControl$StatementRunner.run(ThreadLeakControl.java:368)
at java.base/java.lang.Thread.run(Thread.java:844)
FAILED: org.apache.solr.cloud.TestTlogReplica.testRecovery
Error Message:
Can not find doc 7 in https://127.0.0.1:51948/solr
Stack Trace:
java.lang.AssertionError: Can not find doc 7 in https://127.0.0.1:51948/solr
at __randomizedtesting.SeedInfo.seed([EEDE29EE60EA9EE6:2F2E50424DBA5441]:0)
at org.junit.Assert.fail(Assert.java:93)
at org.junit.Assert.assertTrue(Assert.java:43)
at org.junit.Assert.assertNotNull(Assert.java:526)
at org.apache.solr.cloud.TestTlogReplica.checkRTG(TestTlogReplica.java:902)
at org.apache.solr.cloud.TestTlogReplica.testRecovery(TestTlogReplica.java:567)
at java.base/jdk.internal.reflect.NativeMethodAccessorImpl.invoke0(Native Method)
at java.base/jdk.internal.reflect.NativeMethodAccessorImpl.invoke(NativeMethodAccessorImpl.java:62)
at java.base/jdk.internal.reflect.DelegatingMethodAccessorImpl.invoke(DelegatingMethodAccessorImpl.java:43)
at java.base/java.lang.reflect.Method.invoke(Method.java:564)
at com.carrotsearch.randomizedtesting.RandomizedRunner.invoke(RandomizedRunner.java:1742)
at com.carrotsearch.randomizedtesting.RandomizedRunner$8.evaluate(RandomizedRunner.java:935)
at com.carrotsearch.randomizedtesting.RandomizedRunner$9.evaluate(RandomizedRunner.java:971)
at com.carrotsearch.randomizedtesting.RandomizedRunner$10.evaluate(RandomizedRunner.java:985)
at com.carrotsearch.randomizedtesting.rules.SystemPropertiesRestoreRule$1.evaluate(SystemPropertiesRestoreRule.java:57)
at org.apache.lucene.util.TestRuleSetupTeardownChained$1.evaluate(TestRuleSetupTeardownChained.java:49)
at org.apache.lucene.util.AbstractBeforeAfterRule$1.evaluate(AbstractBeforeAfterRule.java:45)
at org.apache.lucene.util.TestRuleThreadAndTestName$1.evaluate(TestRuleThreadAndTestName.java:48)
at org.apache.lucene.util.TestRuleIgnoreAfterMaxFailures$1.evaluate(TestRuleIgnoreAfterMaxFailures.java:64)
at org.apache.lucene.util.TestRuleMarkFailure$1.evaluate(TestRuleMarkFailure.java:47)
at com.carrotsearch.randomizedtesting.rules.StatementAdapter.evaluate(StatementAdapter.java:36)
at com.carrotsearch.randomizedtesting.ThreadLeakControl$StatementRunner.run(ThreadLeakControl.java:368)
at com.carrotsearch.randomizedtesting.ThreadLeakControl.forkTimeoutingTask(ThreadLeakControl.java:817)
at com.carrotsearch.randomizedtesting.ThreadLeakControl$3.evaluate(ThreadLeakControl.java:468)
at com.carrotsearch.randomizedtesting.RandomizedRunner.runSingleTest(RandomizedRunner.java:944)
at com.carrotsearch.randomizedtesting.RandomizedRunner$5.evaluate(RandomizedRunner.java:830)
at com.carrotsearch.randomizedtesting.RandomizedRunner$6.evaluate(RandomizedRunner.java:880)
at com.carrotsearch.randomizedtesting.RandomizedRunner$7.evaluate(RandomizedRunner.java:891)
at com.carrotsearch.randomizedtesting.rules.StatementAdapter.evaluate(StatementAdapter.java:36)
at com.carrotsearch.randomizedtesting.rules.SystemPropertiesRestoreRule$1.evaluate(SystemPropertiesRestoreRule.java:57)
at org.apache.lucene.util.AbstractBeforeAfterRule$1.evaluate(AbstractBeforeAfterRule.java:45)
at com.carrotsearch.randomizedtesting.rules.StatementAdapter.evaluate(StatementAdapter.java:36)
at org.apache.lucene.util.TestRuleStoreClassName$1.evaluate(TestRuleStoreClassName.java:41)
at com.carrotsearch.randomizedtesting.rules.NoShadowingOrOverridesOnMethodsRule$1.evaluate(NoShadowingOrOverridesOnMethodsRule.java:40)
at com.carrotsearch.randomizedtesting.rules.NoShadowingOrOverridesOnMethodsRule$1.evaluate(NoShadowingOrOverridesOnMethodsRule.java:40)
at com.carrotsearch.randomizedtesting.rules.StatementAdapter.evaluate(StatementAdapter.java:36)
at com.carrotsearch.randomizedtesting.rules.StatementAdapter.evaluate(StatementAdapter.java:36)
at org.apache.lucene.util.TestRuleAssertionsRequired$1.evaluate(TestRuleAssertionsRequired.java:53)
at org.apache.lucene.util.TestRuleMarkFailure$1.evaluate(TestRuleMarkFailure.java:47)
at org.apache.lucene.util.TestRuleIgnoreAfterMaxFailures$1.evaluate(TestRuleIgnoreAfterMaxFailures.java:64)
at org.apache.lucene.util.TestRuleIgnoreTestSuites$1.evaluate(TestRuleIgnoreTestSuites.java:54)
at com.carrotsearch.randomizedtesting.rules.StatementAdapter.evaluate(StatementAdapter.java:36)
at com.carrotsearch.randomizedtesting.ThreadLeakControl$StatementRunner.run(ThreadLeakControl.java:368)
at java.base/java.lang.Thread.run(Thread.java:844)
FAILED: org.apache.solr.cloud.TestTlogReplica.testRecovery
Error Message:
Can not find doc 7 in https://127.0.0.1:51967/solr
Stack Trace:
java.lang.AssertionError: Can not find doc 7 in https://127.0.0.1:51967/solr
at __randomizedtesting.SeedInfo.seed([EEDE29EE60EA9EE6:2F2E50424DBA5441]:0)
at org.junit.Assert.fail(Assert.java:93)
at org.junit.Assert.assertTrue(Assert.java:43)
at org.junit.Assert.assertNotNull(Assert.java:526)
at org.apache.solr.cloud.TestTlogReplica.checkRTG(TestTlogReplica.java:902)
at org.apache.solr.cloud.TestTlogReplica.testRecovery(TestTlogReplica.java:567)
at java.base/jdk.internal.reflect.NativeMethodAccessorImpl.invoke0(Native Method)
at java.base/jdk.internal.reflect.NativeMethodAccessorImpl.invoke(NativeMethodAccessorImpl.java:62)
at java.base/jdk.internal.reflect.DelegatingMethodAccessorImpl.invoke(DelegatingMethodAccessorImpl.java:43)
at java.base/java.lang.reflect.Method.invoke(Method.java:564)
at com.carrotsearch.randomizedtesting.RandomizedRunner.invoke(RandomizedRunner.java:1742)
at com.carrotsearch.randomizedtesting.RandomizedRunner$8.evaluate(RandomizedRunner.java:935)
at com.carrotsearch.randomizedtesting.RandomizedRunner$9.evaluate(RandomizedRunner.java:971)
at com.carrotsearch.randomizedtesting.RandomizedRunner$10.evaluate(RandomizedRunner.java:985)
at com.carrotsearch.randomizedtesting.rules.SystemPropertiesRestoreRule$1.evaluate(SystemPropertiesRestoreRule.java:57)
at org.apache.lucene.util.TestRuleSetupTeardownChained$1.evaluate(TestRuleSetupTeardownChained.java:49)
at org.apache.lucene.util.AbstractBeforeAfterRule$1.evaluate(AbstractBeforeAfterRule.java:45)
at org.apache.lucene.util.TestRuleThreadAndTestName$1.evaluate(TestRuleThreadAndTestName.java:48)
at org.apache.lucene.util.TestRuleIgnoreAfterMaxFailures$1.evaluate(TestRuleIgnoreAfterMaxFailures.java:64)
at org.apache.lucene.util.TestRuleMarkFailure$1.evaluate(TestRuleMarkFailure.java:47)
at com.carrotsearch.randomizedtesting.rules.StatementAdapter.evaluate(StatementAdapter.java:36)
at com.carrotsearch.randomizedtesting.ThreadLeakControl$StatementRunner.run(ThreadLeakControl.java:368)
at com.carrotsearch.randomizedtesting.ThreadLeakControl.forkTimeoutingTask(ThreadLeakControl.java:817)
at com.carrotsearch.randomizedtesting.ThreadLeakControl$3.evaluate(ThreadLeakControl.java:468)
at com.carrotsearch.randomizedtesting.RandomizedRunner.runSingleTest(RandomizedRunner.java:944)
at com.carrotsearch.randomizedtesting.RandomizedRunner$5.evaluate(RandomizedRunner.java:830)
at com.carrotsearch.randomizedtesting.RandomizedRunner$6.evaluate(RandomizedRunner.java:880)
at com.carrotsearch.randomizedtesting.RandomizedRunner$7.evaluate(RandomizedRunner.java:891)
at com.carrotsearch.randomizedtesting.rules.StatementAdapter.evaluate(StatementAdapter.java:36)
at com.carrotsearch.randomizedtesting.rules.SystemPropertiesRestoreRule$1.evaluate(SystemPropertiesRestoreRule.java:57)
at org.apache.lucene.util.AbstractBeforeAfterRule$1.evaluate(AbstractBeforeAfterRule.java:45)
at com.carrotsearch.randomizedtesting.rules.StatementAdapter.evaluate(StatementAdapter.java:36)
at org.apache.lucene.util.TestRuleStoreClassName$1.evaluate(TestRuleStoreClassName.java:41)
at com.carrotsearch.randomizedtesting.rules.NoShadowingOrOverridesOnMethodsRule$1.evaluate(NoShadowingOrOverridesOnMethodsRule.java:40)
at com.carrotsearch.randomizedtesting.rules.NoShadowingOrOverridesOnMethodsRule$1.evaluate(NoShadowingOrOverridesOnMethodsRule.java:40)
at com.carrotsearch.randomizedtesting.rules.StatementAdapter.evaluate(StatementAdapter.java:36)
at com.carrotsearch.randomizedtesting.rules.StatementAdapter.evaluate(StatementAdapter.java:36)
at org.apache.lucene.util.TestRuleAssertionsRequired$1.evaluate(TestRuleAssertionsRequired.java:53)
at org.apache.lucene.util.TestRuleMarkFailure$1.evaluate(TestRuleMarkFailure.java:47)
at org.apache.lucene.util.TestRuleIgnoreAfterMaxFailures$1.evaluate(TestRuleIgnoreAfterMaxFailures.java:64)
at org.apache.lucene.util.TestRuleIgnoreTestSuites$1.evaluate(TestRuleIgnoreTestSuites.java:54)
at com.carrotsearch.randomizedtesting.rules.StatementAdapter.evaluate(StatementAdapter.java:36)
at com.carrotsearch.randomizedtesting.ThreadLeakControl$StatementRunner.run(ThreadLeakControl.java:368)
at java.base/java.lang.Thread.run(Thread.java:844)
FAILED: org.apache.solr.cloud.TestTlogReplica.testRecovery
Error Message:
Can not find doc 7 in https://127.0.0.1:52259/solr
Stack Trace:
java.lang.AssertionError: Can not find doc 7 in https://127.0.0.1:52259/solr
at __randomizedtesting.SeedInfo.seed([EEDE29EE60EA9EE6:2F2E50424DBA5441]:0)
at org.junit.Assert.fail(Assert.java:93)
at org.junit.Assert.assertTrue(Assert.java:43)
at org.junit.Assert.assertNotNull(Assert.java:526)
at org.apache.solr.cloud.TestTlogReplica.checkRTG(TestTlogReplica.java:902)
at org.apache.solr.cloud.TestTlogReplica.testRecovery(TestTlogReplica.java:567)
at java.base/jdk.internal.reflect.NativeMethodAccessorImpl.invoke0(Native Method)
at java.base/jdk.internal.reflect.NativeMethodAccessorImpl.invoke(NativeMethodAccessorImpl.java:62)
at java.base/jdk.internal.reflect.DelegatingMethodAccessorImpl.invoke(DelegatingMethodAccessorImpl.java:43)
at java.base/java.lang.reflect.Method.invoke(Method.java:564)
at com.carrotsearch.randomizedtesting.RandomizedRunner.invoke(RandomizedRunner.java:1742)
at com.carrotsearch.randomizedtesting.RandomizedRunner$8.evaluate(RandomizedRunner.java:935)
at com.carrotsearch.randomizedtesting.RandomizedRunner$9.evaluate(RandomizedRunner.java:971)
at com.carrotsearch.randomizedtesting.RandomizedRunner$10.evaluate(RandomizedRunner.java:985)
at com.carrotsearch.randomizedtesting.rules.SystemPropertiesRestoreRule$1.evaluate(SystemPropertiesRestoreRule.java:57)
at org.apache.lucene.util.TestRuleSetupTeardownChained$1.evaluate(TestRuleSetupTeardownChained.java:49)
at org.apache.lucene.util.AbstractBeforeAfterRule$1.evaluate(AbstractBeforeAfterRule.java:45)
at org.apache.lucene.util.TestRuleThreadAndTestName$1.evaluate(TestRuleThreadAndTestName.java:48)
at org.apache.lucene.util.TestRuleIgnoreAfterMaxFailures$1.evaluate(TestRuleIgnoreAfterMaxFailures.java:64)
at org.apache.lucene.util.TestRuleMarkFailure$1.evaluate(TestRuleMarkFailure.java:47)
at com.carrotsearch.randomizedtesting.rules.StatementAdapter.evaluate(StatementAdapter.java:36)
at com.carrotsearch.randomizedtesting.ThreadLeakControl$StatementRunner.run(ThreadLeakControl.java:368)
at com.carrotsearch.randomizedtesting.ThreadLeakControl.forkTimeoutingTask(ThreadLeakControl.java:817)
at com.carrotsearch.randomizedtesting.ThreadLeakControl$3.evaluate(ThreadLeakControl.java:468)
at com.carrotsearch.randomizedtesting.RandomizedRunner.runSingleTest(RandomizedRunner.java:944)
at com.carrotsearch.randomizedtesting.RandomizedRunner$5.evaluate(RandomizedRunner.java:830)
at com.carrotsearch.randomizedtesting.RandomizedRunner$6.evaluate(RandomizedRunner.java:880)
at com.carrotsearch.randomizedtesting.RandomizedRunner$7.evaluate(RandomizedRunner.java:891)
at com.carrotsearch.randomizedtesting.rules.StatementAdapter.evaluate(StatementAdapter.java:36)
at com.carrotsearch.randomizedtesting.rules.SystemPropertiesRestoreRule$1.evaluate(SystemPropertiesRestoreRule.java:57)
at org.apache.lucene.util.AbstractBeforeAfterRule$1.evaluate(AbstractBeforeAfterRule.java:45)
at com.carrotsearch.randomizedtesting.rules.StatementAdapter.evaluate(StatementAdapter.java:36)
at org.apache.lucene.util.TestRuleStoreClassName$1.evaluate(TestRuleStoreClassName.java:41)
at com.carrotsearch.randomizedtesting.rules.NoShadowingOrOverridesOnMethodsRule$1.evaluate(NoShadowingOrOverridesOnMethodsRule.java:40)
at com.carrotsearch.randomizedtesting.rules.NoShadowingOrOverridesOnMethodsRule$1.evaluate(NoShadowingOrOverridesOnMethodsRule.java:40)
at com.carrotsearch.randomizedtesting.rules.StatementAdapter.evaluate(StatementAdapter.java:36)
at com.carrotsearch.randomizedtesting.rules.StatementAdapter.evaluate(StatementAdapter.java:36)
at org.apache.lucene.util.TestRuleAssertionsRequired$1.evaluate(TestRuleAssertionsRequired.java:53)
at org.apache.lucene.util.TestRuleMarkFailure$1.evaluate(TestRuleMarkFailure.java:47)
at org.apache.lucene.util.TestRuleIgnoreAfterMaxFailures$1.evaluate(TestRuleIgnoreAfterMaxFailures.java:64)
at org.apache.lucene.util.TestRuleIgnoreTestSuites$1.evaluate(TestRuleIgnoreTestSuites.java:54)
at com.carrotsearch.randomizedtesting.rules.StatementAdapter.evaluate(StatementAdapter.java:36)
at com.carrotsearch.randomizedtesting.ThreadLeakControl$StatementRunner.run(ThreadLeakControl.java:368)
at java.base/java.lang.Thread.run(Thread.java:844)
FAILED: org.apache.solr.cloud.TestTlogReplica.testRecovery
Error Message:
Can not find doc 7 in https://127.0.0.1:58565/solr
Stack Trace:
java.lang.AssertionError: Can not find doc 7 in https://127.0.0.1:58565/solr
at __randomizedtesting.SeedInfo.seed([EEDE29EE60EA9EE6:2F2E50424DBA5441]:0)
at org.junit.Assert.fail(Assert.java:93)
at org.junit.Assert.assertTrue(Assert.java:43)
at org.junit.Assert.assertNotNull(Assert.java:526)
at org.apache.solr.cloud.TestTlogReplica.checkRTG(TestTlogReplica.java:902)
at org.apache.solr.cloud.TestTlogReplica.testRecovery(TestTlogReplica.java:567)
at java.base/jdk.internal.reflect.NativeMethodAccessorImpl.invoke0(Native Method)
at java.base/jdk.internal.reflect.NativeMethodAccessorImpl.invoke(NativeMethodAccessorImpl.java:62)
at java.base/jdk.internal.reflect.DelegatingMethodAccessorImpl.invoke(DelegatingMethodAccessorImpl.java:43)
at java.base/java.lang.reflect.Method.invoke(Method.java:564)
at com.carrotsearch.randomizedtesting.RandomizedRunner.invoke(RandomizedRunner.java:1742)
at com.carrotsearch.randomizedtesting.RandomizedRunner$8.evaluate(RandomizedRunner.java:935)
at com.carrotsearch.randomizedtesting.RandomizedRunner$9.evaluate(RandomizedRunner.java:971)
at com.carrotsearch.randomizedtesting.RandomizedRunner$10.evaluate(RandomizedRunner.java:985)
at com.carrotsearch.randomizedtesting.rules.SystemPropertiesRestoreRule$1.evaluate(SystemPropertiesRestoreRule.java:57)
at org.apache.lucene.util.TestRuleSetupTeardownChained$1.evaluate(TestRuleSetupTeardownChained.java:49)
at org.apache.lucene.util.AbstractBeforeAfterRule$1.evaluate(AbstractBeforeAfterRule.java:45)
at org.apache.lucene.util.TestRuleThreadAndTestName$1.evaluate(TestRuleThreadAndTestName.java:48)
at org.apache.lucene.util.TestRuleIgnoreAfterMaxFailures$1.evaluate(TestRuleIgnoreAfterMaxFailures.java:64)
at org.apache.lucene.util.TestRuleMarkFailure$1.evaluate(TestRuleMarkFailure.java:47)
at com.carrotsearch.randomizedtesting.rules.StatementAdapter.evaluate(StatementAdapter.java:36)
at com.carrotsearch.randomizedtesting.ThreadLeakControl$StatementRunner.run(ThreadLeakControl.java:368)
at com.carrotsearch.randomizedtesting.ThreadLeakControl.forkTimeoutingTask(ThreadLeakControl.java:817)
at com.carrotsearch.randomizedtesting.ThreadLeakControl$3.evaluate(ThreadLeakControl.java:468)
at com.carrotsearch.randomizedtesting.RandomizedRunner.runSingleTest(RandomizedRunner.java:944)
at com.carrotsearch.randomizedtesting.RandomizedRunner$5.evaluate(RandomizedRunner.java:830)
at com.carrotsearch.randomizedtesting.RandomizedRunner$6.evaluate(RandomizedRunner.java:880)
at com.carrotsearch.randomizedtesting.RandomizedRunner$7.evaluate(RandomizedRunner.java:891)
at com.carrotsearch.randomizedtesting.rules.StatementAdapter.evaluate(StatementAdapter.java:36)
at com.carrotsearch.randomizedtesting.rules.SystemPropertiesRestoreRule$1.evaluate(SystemPropertiesRestoreRule.java:57)
at org.apache.lucene.util.AbstractBeforeAfterRule$1.evaluate(AbstractBeforeAfterRule.java:45)
at com.carrotsearch.randomizedtesting.rules.StatementAdapter.evaluate(StatementAdapter.java:36)
at org.apache.lucene.util.TestRuleStoreClassName$1.evaluate(TestRuleStoreClassName.java:41)
at com.carrotsearch.randomizedtesting.rules.NoShadowingOrOverridesOnMethodsRule$1.evaluate(NoShadowingOrOverridesOnMethodsRule.java:40)
at com.carrotsearch.randomizedtesting.rules.NoShadowingOrOverridesOnMethodsRule$1.evaluate(NoShadowingOrOverridesOnMethodsRule.java:40)
at com.carrotsearch.randomizedtesting.rules.StatementAdapter.evaluate(StatementAdapter.java:36)
at com.carrotsearch.randomizedtesting.rules.StatementAdapter.evaluate(StatementAdapter.java:36)
at org.apache.lucene.util.TestRuleAssertionsRequired$1.evaluate(TestRuleAssertionsRequired.java:53)
at org.apache.lucene.util.TestRuleMarkFailure$1.evaluate(TestRuleMarkFailure.java:47)
at org.apache.lucene.util.TestRuleIgnoreAfterMaxFailures$1.evaluate(TestRuleIgnoreAfterMaxFailures.java:64)
at org.apache.lucene.util.TestRuleIgnoreTestSuites$1.evaluate(TestRuleIgnoreTestSuites.java:54)
at com.carrotsearch.randomizedtesting.rules.StatementAdapter.evaluate(StatementAdapter.java:36)
at com.carrotsearch.randomizedtesting.ThreadLeakControl$StatementRunner.run(ThreadLeakControl.java:368)
at java.base/java.lang.Thread.run(Thread.java:844)
Build Log:
[...truncated 13992 lines...]
[junit4] Suite: org.apache.solr.cloud.TestTlogReplica
[junit4] 2> Creating dataDir: /Users/jenkins/workspace/Lucene-Solr-master-MacOSX/solr/build/solr-core/test/J1/temp/solr.cloud.TestTlogReplica_EEDE29EE60EA9EE6-001/init-core-data-001
[junit4] 2> 2432800 WARN (SUITE-TestTlogReplica-seed#[EEDE29EE60EA9EE6]-worker) [ ] o.a.s.SolrTestCaseJ4 startTrackingSearchers: numOpens=16 numCloses=16
[junit4] 2> 2432800 INFO (SUITE-TestTlogReplica-seed#[EEDE29EE60EA9EE6]-worker) [ ] o.a.s.SolrTestCaseJ4 Using PointFields (NUMERIC_POINTS_SYSPROP=true) w/NUMERIC_DOCVALUES_SYSPROP=true
[junit4] 2> 2432801 INFO (SUITE-TestTlogReplica-seed#[EEDE29EE60EA9EE6]-worker) [ ] o.a.s.SolrTestCaseJ4 Randomized ssl (true) and clientAuth (false) via: @org.apache.solr.util.RandomizeSSL(reason="", value=0.0/0.0, ssl=0.0/0.0, clientAuth=0.0/0.0) w/ MAC_OS_X supressed clientAuth
[junit4] 2> 2432810 INFO (SUITE-TestTlogReplica-seed#[EEDE29EE60EA9EE6]-worker) [ ] o.a.s.SolrTestCaseJ4 SecureRandom sanity checks: test.solr.allowed.securerandom=null & java.security.egd=file:/dev/./urandom
[junit4] 2> 2432810 INFO (SUITE-TestTlogReplica-seed#[EEDE29EE60EA9EE6]-worker) [ ] o.a.s.c.MiniSolrCloudCluster Starting cluster of 2 servers in /Users/jenkins/workspace/Lucene-Solr-master-MacOSX/solr/build/solr-core/test/J1/temp/solr.cloud.TestTlogReplica_EEDE29EE60EA9EE6-001/tempDir-001
[junit4] 2> 2432810 INFO (SUITE-TestTlogReplica-seed#[EEDE29EE60EA9EE6]-worker) [ ] o.a.s.c.ZkTestServer STARTING ZK TEST SERVER
[junit4] 2> 2432811 INFO (Thread-2089) [ ] o.a.s.c.ZkTestServer client port:0.0.0.0/0.0.0.0:0
[junit4] 2> 2432811 INFO (Thread-2089) [ ] o.a.s.c.ZkTestServer Starting server
[junit4] 2> 2432815 ERROR (Thread-2089) [ ] o.a.z.s.ZooKeeperServer ZKShutdownHandler is not registered, so ZooKeeper server won't take any action on ERROR or SHUTDOWN server state changes
[junit4] 2> 2432913 INFO (SUITE-TestTlogReplica-seed#[EEDE29EE60EA9EE6]-worker) [ ] o.a.s.c.ZkTestServer start zk server on port:58562
[junit4] 2> 2432926 INFO (zkConnectionManagerCallback-5309-thread-1) [ ] o.a.s.c.c.ConnectionManager zkClient has connected
[junit4] 2> 2432957 INFO (jetty-launcher-5306-thread-2) [ ] o.e.j.s.Server jetty-9.4.11.v20180605; built: 2018-06-05T18:24:03.829Z; git: d5fc0523cfa96bfebfbda19606cad384d772f04c; jvm 9+181
[junit4] 2> 2432958 INFO (jetty-launcher-5306-thread-1) [ ] o.e.j.s.Server jetty-9.4.11.v20180605; built: 2018-06-05T18:24:03.829Z; git: d5fc0523cfa96bfebfbda19606cad384d772f04c; jvm 9+181
[junit4] 2> 2432959 INFO (jetty-launcher-5306-thread-2) [ ] o.e.j.s.session DefaultSessionIdManager workerName=node0
[junit4] 2> 2432959 INFO (jetty-launcher-5306-thread-2) [ ] o.e.j.s.session No SessionScavenger set, using defaults
[junit4] 2> 2432959 INFO (jetty-launcher-5306-thread-2) [ ] o.e.j.s.session node0 Scavenging every 660000ms
[junit4] 2> 2432960 INFO (jetty-launcher-5306-thread-2) [ ] o.e.j.s.h.ContextHandler Started o.e.j.s.ServletContextHandler@6d6b654f{/solr,null,AVAILABLE}
[junit4] 2> 2432962 INFO (jetty-launcher-5306-thread-1) [ ] o.e.j.s.session DefaultSessionIdManager workerName=node0
[junit4] 2> 2432962 INFO (jetty-launcher-5306-thread-1) [ ] o.e.j.s.session No SessionScavenger set, using defaults
[junit4] 2> 2432962 INFO (jetty-launcher-5306-thread-1) [ ] o.e.j.s.session node0 Scavenging every 600000ms
[junit4] 2> 2432962 INFO (jetty-launcher-5306-thread-2) [ ] o.e.j.s.AbstractConnector Started ServerConnector@73f0c761{SSL,[ssl, http/1.1]}{127.0.0.1:58565}
[junit4] 2> 2432962 INFO (jetty-launcher-5306-thread-2) [ ] o.e.j.s.Server Started @2433072ms
[junit4] 2> 2432962 INFO (jetty-launcher-5306-thread-1) [ ] o.e.j.s.h.ContextHandler Started o.e.j.s.ServletContextHandler@482ed7b2{/solr,null,AVAILABLE}
[junit4] 2> 2432962 INFO (jetty-launcher-5306-thread-2) [ ] o.a.s.c.s.e.JettySolrRunner Jetty properties: {hostContext=/solr, hostPort=58565}
[junit4] 2> 2432962 ERROR (jetty-launcher-5306-thread-2) [ ] o.a.s.u.StartupLoggingUtils Missing Java Option solr.log.dir. Logging may be missing or incomplete.
[junit4] 2> 2432962 INFO (jetty-launcher-5306-thread-2) [ ] o.a.s.s.SolrDispatchFilter Using logger factory org.apache.logging.slf4j.Log4jLoggerFactory
[junit4] 2> 2432963 INFO (jetty-launcher-5306-thread-1) [ ] o.e.j.s.AbstractConnector Started ServerConnector@6a53c018{SSL,[ssl, http/1.1]}{127.0.0.1:58566}
[junit4] 2> 2432963 INFO (jetty-launcher-5306-thread-1) [ ] o.e.j.s.Server Started @2433072ms
[junit4] 2> 2432963 INFO (jetty-launcher-5306-thread-1) [ ] o.a.s.c.s.e.JettySolrRunner Jetty properties: {hostContext=/solr, hostPort=58566}
[junit4] 2> 2432963 INFO (jetty-launcher-5306-thread-2) [ ] o.a.s.s.SolrDispatchFilter ___ _ Welcome to Apache Solr? version 8.0.0
[junit4] 2> 2432963 INFO (jetty-launcher-5306-thread-2) [ ] o.a.s.s.SolrDispatchFilter / __| ___| |_ _ Starting in cloud mode on port null
[junit4] 2> 2432963 INFO (jetty-launcher-5306-thread-2) [ ] o.a.s.s.SolrDispatchFilter \__ \/ _ \ | '_| Install dir: null
[junit4] 2> 2432963 ERROR (jetty-launcher-5306-thread-1) [ ] o.a.s.u.StartupLoggingUtils Missing Java Option solr.log.dir. Logging may be missing or incomplete.
[junit4] 2> 2432963 INFO (jetty-launcher-5306-thread-1) [ ] o.a.s.s.SolrDispatchFilter Using logger factory org.apache.logging.slf4j.Log4jLoggerFactory
[junit4] 2> 2432963 INFO (jetty-launcher-5306-thread-2) [ ] o.a.s.s.SolrDispatchFilter |___/\___/_|_| Start time: 2018-11-14T16:55:20.292710Z
[junit4] 2> 2432963 INFO (jetty-launcher-5306-thread-1) [ ] o.a.s.s.SolrDispatchFilter ___ _ Welcome to Apache Solr? version 8.0.0
[junit4] 2> 2432963 INFO (jetty-launcher-5306-thread-1) [ ] o.a.s.s.SolrDispatchFilter / __| ___| |_ _ Starting in cloud mode on port null
[junit4] 2> 2432963 INFO (jetty-launcher-5306-thread-1) [ ] o.a.s.s.SolrDispatchFilter \__ \/ _ \ | '_| Install dir: null
[junit4] 2> 2432963 INFO (jetty-launcher-5306-thread-1) [ ] o.a.s.s.SolrDispatchFilter |___/\___/_|_| Start time: 2018-11-14T16:55:20.292950Z
[junit4] 2> 2432966 INFO (zkConnectionManagerCallback-5311-thread-1) [ ] o.a.s.c.c.ConnectionManager zkClient has connected
[junit4] 2> 2432966 INFO (jetty-launcher-5306-thread-2) [ ] o.a.s.s.SolrDispatchFilter solr.xml found in ZooKeeper. Loading...
[junit4] 2> 2432969 INFO (zkConnectionManagerCallback-5313-thread-1) [ ] o.a.s.c.c.ConnectionManager zkClient has connected
[junit4] 2> 2432969 INFO (jetty-launcher-5306-thread-1) [ ] o.a.s.s.SolrDispatchFilter solr.xml found in ZooKeeper. Loading...
[junit4] 2> 2433271 INFO (jetty-launcher-5306-thread-1) [ ] o.a.s.c.ZkContainer Zookeeper client=127.0.0.1:58562/solr
[junit4] 2> 2433276 INFO (zkConnectionManagerCallback-5317-thread-1) [ ] o.a.s.c.c.ConnectionManager zkClient has connected
[junit4] 2> 2433307 INFO (zkConnectionManagerCallback-5319-thread-1) [ ] o.a.s.c.c.ConnectionManager zkClient has connected
[junit4] 2> 2433580 INFO (jetty-launcher-5306-thread-1) [n:127.0.0.1:58566_solr ] o.a.s.c.OverseerElectionContext I am going to be the leader 127.0.0.1:58566_solr
[junit4] 2> 2433582 INFO (jetty-launcher-5306-thread-1) [n:127.0.0.1:58566_solr ] o.a.s.c.Overseer Overseer (id=72110765190283268-127.0.0.1:58566_solr-n_0000000000) starting
[junit4] 2> 2433593 INFO (zkConnectionManagerCallback-5326-thread-1) [ ] o.a.s.c.c.ConnectionManager zkClient has connected
[junit4] 2> 2433601 INFO (jetty-launcher-5306-thread-1) [n:127.0.0.1:58566_solr ] o.a.s.c.s.i.ZkClientClusterStateProvider Cluster at 127.0.0.1:58562/solr ready
[junit4] 2> 2433602 INFO (OverseerStateUpdate-72110765190283268-127.0.0.1:58566_solr-n_0000000000) [n:127.0.0.1:58566_solr ] o.a.s.c.Overseer Starting to work on the main queue : 127.0.0.1:58566_solr
[junit4] 2> 2433622 INFO (jetty-launcher-5306-thread-1) [n:127.0.0.1:58566_solr ] o.a.s.c.ZkController Register node as live in ZooKeeper:/live_nodes/127.0.0.1:58566_solr
[junit4] 2> 2433626 INFO (zkCallback-5325-thread-1) [ ] o.a.s.c.c.ZkStateReader Updated live nodes from ZooKeeper... (0) -> (1)
[junit4] 2> 2433627 INFO (zkCallback-5318-thread-1) [ ] o.a.s.c.c.ZkStateReader Updated live nodes from ZooKeeper... (0) -> (1)
[junit4] 2> 2433648 INFO (jetty-launcher-5306-thread-2) [ ] o.a.s.c.ZkContainer Zookeeper client=127.0.0.1:58562/solr
[junit4] 2> 2433664 INFO (jetty-launcher-5306-thread-1) [n:127.0.0.1:58566_solr ] o.a.s.h.a.MetricsHistoryHandler No .system collection, keeping metrics history in memory.
[junit4] 2> 2433665 INFO (zkConnectionManagerCallback-5330-thread-1) [ ] o.a.s.c.c.ConnectionManager zkClient has connected
[junit4] 2> 2433668 INFO (zkConnectionManagerCallback-5333-thread-1) [ ] o.a.s.c.c.ConnectionManager zkClient has connected
[junit4] 2> 2433689 INFO (jetty-launcher-5306-thread-2) [n:127.0.0.1:58565_solr ] o.a.s.c.c.ZkStateReader Updated live nodes from ZooKeeper... (0) -> (1)
[junit4] 2> 2433701 INFO (jetty-launcher-5306-thread-1) [n:127.0.0.1:58566_solr ] o.a.s.m.r.SolrJmxReporter JMX monitoring for 'solr_58566.solr.node' (registry 'solr.node') enabled at server: com.sun.jmx.mbeanserver.JmxMBeanServer@4c75925e
[junit4] 2> 2433710 INFO (jetty-launcher-5306-thread-1) [n:127.0.0.1:58566_solr ] o.a.s.m.r.SolrJmxReporter JMX monitoring for 'solr_58566.solr.jvm' (registry 'solr.jvm') enabled at server: com.sun.jmx.mbeanserver.JmxMBeanServer@4c75925e
[junit4] 2> 2433710 INFO (jetty-launcher-5306-thread-1) [n:127.0.0.1:58566_solr ] o.a.s.m.r.SolrJmxReporter JMX monitoring for 'solr_58566.solr.jetty' (registry 'solr.jetty') enabled at server: com.sun.jmx.mbeanserver.JmxMBeanServer@4c75925e
[junit4] 2> 2433711 INFO (jetty-launcher-5306-thread-1) [n:127.0.0.1:58566_solr ] o.a.s.c.CorePropertiesLocator Found 0 core definitions underneath /Users/jenkins/workspace/Lucene-Solr-master-MacOSX/solr/build/solr-core/test/J1/temp/solr.cloud.TestTlogReplica_EEDE29EE60EA9EE6-001/tempDir-001/node1/.
[junit4] 2> 2433728 INFO (jetty-launcher-5306-thread-2) [n:127.0.0.1:58565_solr ] o.a.s.c.TransientSolrCoreCacheDefault Allocating transient cache for 2147483647 transient cores
[junit4] 2> 2433729 INFO (jetty-launcher-5306-thread-2) [n:127.0.0.1:58565_solr ] o.a.s.c.ZkController Register node as live in ZooKeeper:/live_nodes/127.0.0.1:58565_solr
[junit4] 2> 2433729 DEBUG (OverseerStateUpdate-72110765190283268-127.0.0.1:58566_solr-n_0000000000) [n:127.0.0.1:58566_solr ] o.a.s.c.Overseer processMessage: queueSize: 1, message = {
[junit4] 2> "operation":"downnode",
[junit4] 2> "node_name":"127.0.0.1:58565_solr"} current state version: 0
[junit4] 2> 2433731 INFO (zkCallback-5325-thread-1) [ ] o.a.s.c.c.ZkStateReader Updated live nodes from ZooKeeper... (1) -> (2)
[junit4] 2> 2433731 INFO (zkCallback-5332-thread-1) [ ] o.a.s.c.c.ZkStateReader Updated live nodes from ZooKeeper... (1) -> (2)
[junit4] 2> 2433732 INFO (zkCallback-5318-thread-1) [ ] o.a.s.c.c.ZkStateReader Updated live nodes from ZooKeeper... (1) -> (2)
[junit4] 2> 2433769 INFO (zkConnectionManagerCallback-5340-thread-1) [ ] o.a.s.c.c.ConnectionManager zkClient has connected
[junit4] 2> 2433770 INFO (jetty-launcher-5306-thread-2) [n:127.0.0.1:58565_solr ] o.a.s.c.c.ZkStateReader Updated live nodes from ZooKeeper... (0) -> (2)
[junit4] 2> 2433772 INFO (jetty-launcher-5306-thread-2) [n:127.0.0.1:58565_solr ] o.a.s.c.s.i.ZkClientClusterStateProvider Cluster at 127.0.0.1:58562/solr ready
[junit4] 2> 2433772 INFO (jetty-launcher-5306-thread-2) [n:127.0.0.1:58565_solr ] o.a.s.h.a.MetricsHistoryHandler No .system collection, keeping metrics history in memory.
[junit4] 2> 2433793 INFO (jetty-launcher-5306-thread-2) [n:127.0.0.1:58565_solr ] o.a.s.m.r.SolrJmxReporter JMX monitoring for 'solr_58565.solr.node' (registry 'solr.node') enabled at server: com.sun.jmx.mbeanserver.JmxMBeanServer@4c75925e
[junit4] 2> 2433806 INFO (jetty-launcher-5306-thread-2) [n:127.0.0.1:58565_solr ] o.a.s.m.r.SolrJmxReporter JMX monitoring for 'solr_58565.solr.jvm' (registry 'solr.jvm') enabled at server: com.sun.jmx.mbeanserver.JmxMBeanServer@4c75925e
[junit4] 2> 2433806 INFO (jetty-launcher-5306-thread-2) [n:127.0.0.1:58565_solr ] o.a.s.m.r.SolrJmxReporter JMX monitoring for 'solr_58565.solr.jetty' (registry 'solr.jetty') enabled at server: com.sun.jmx.mbeanserver.JmxMBeanServer@4c75925e
[junit4] 2> 2433807 INFO (jetty-launcher-5306-thread-2) [n:127.0.0.1:58565_solr ] o.a.s.c.CorePropertiesLocator Found 0 core definitions underneath /Users/jenkins/workspace/Lucene-Solr-master-MacOSX/solr/build/solr-core/test/J1/temp/solr.cloud.TestTlogReplica_EEDE29EE60EA9EE6-001/tempDir-001/node2/.
[junit4] 2> 2433888 INFO (zkConnectionManagerCallback-5343-thread-1) [ ] o.a.s.c.c.ConnectionManager zkClient has connected
[junit4] 2> 2433896 WARN (NIOServerCxn.Factory:0.0.0.0/0.0.0.0:0) [ ] o.a.z.s.NIOServerCnxn Unable to read additional data from client sessionid 0x100305bdfa60009, likely client has closed socket
[junit4] 2> 2433917 INFO (zkConnectionManagerCallback-5348-thread-1) [ ] o.a.s.c.c.ConnectionManager zkClient has connected
[junit4] 2> 2433919 INFO (SUITE-TestTlogReplica-seed#[EEDE29EE60EA9EE6]-worker) [ ] o.a.s.c.c.ZkStateReader Updated live nodes from ZooKeeper... (0) -> (2)
[junit4] 2> 2433920 INFO (SUITE-TestTlogReplica-seed#[EEDE29EE60EA9EE6]-worker) [ ] o.a.s.c.s.i.ZkClientClusterStateProvider Cluster at 127.0.0.1:58562/solr ready
[junit4] 2> 2433939 INFO (SUITE-TestTlogReplica-seed#[EEDE29EE60EA9EE6]-worker) [ ] o.a.s.c.TestTlogReplica Using legacyCloud?: false
[junit4] 2> 2433985 INFO (qtp275683838-14447) [n:127.0.0.1:58565_solr ] o.a.s.h.a.CollectionsHandler Invoked Collection Action :clusterprop with params val=false&name=legacyCloud&action=CLUSTERPROP&wt=javabin&version=2 and sendToOCPQueue=true
[junit4] 2> 2433987 INFO (qtp275683838-14447) [n:127.0.0.1:58565_solr ] o.a.s.s.HttpSolrCall [admin] webapp=null path=/admin/collections params={val=false&name=legacyCloud&action=CLUSTERPROP&wt=javabin&version=2} status=0 QTime=2
[junit4] 2> 2434029 INFO (TEST-TestTlogReplica.testKillTlogReplica-seed#[EEDE29EE60EA9EE6]) [ ] o.a.s.SolrTestCaseJ4 ###Starting testKillTlogReplica
[junit4] 2> 2434032 INFO (qtp275683838-14445) [n:127.0.0.1:58565_solr ] o.a.s.h.a.CollectionsHandler Invoked Collection Action :create with params pullReplicas=0&collection.configName=conf&maxShardsPerNode=100&name=tlog_replica_test_kill_tlog_replica&nrtReplicas=0&action=CREATE&numShards=1&tlogReplicas=2&wt=javabin&version=2 and sendToOCPQueue=true
[junit4] 2> 2434035 INFO (OverseerThreadFactory-5480-thread-1-processing-n:127.0.0.1:58566_solr) [n:127.0.0.1:58566_solr ] o.a.s.c.a.c.CreateCollectionCmd Create collection tlog_replica_test_kill_tlog_replica
[junit4] 2> 2434044 DEBUG (OverseerStateUpdate-72110765190283268-127.0.0.1:58566_solr-n_0000000000) [n:127.0.0.1:58566_solr ] o.a.s.c.Overseer processMessage: queueSize: 1, message = {
[junit4] 2> "name":"tlog_replica_test_kill_tlog_replica",
[junit4] 2> "fromApi":"true",
[junit4] 2> "collection.configName":"conf",
[junit4] 2> "numShards":"1",
[junit4] 2> "maxShardsPerNode":"100",
[junit4] 2> "pullReplicas":"0",
[junit4] 2> "tlogReplicas":"2",
[junit4] 2> "nrtReplicas":"0",
[junit4] 2> "stateFormat":"2",
[junit4] 2> "replicationFactor":"0",
[junit4] 2> "operation":"create"} current state version: 0
[junit4] 2> 2434165 INFO (qtp275683838-14448) [n:127.0.0.1:58565_solr ] o.a.s.s.HttpSolrCall [admin] webapp=null path=/admin/metrics params={prefix=CONTAINER.fs.usableSpace,CONTAINER.fs.totalSpace,CORE.coreName&wt=javabin&version=2&group=solr.node,solr.core} status=0 QTime=0
[junit4] 2> 2434184 INFO (qtp2080385080-14454) [n:127.0.0.1:58566_solr ] o.a.s.s.HttpSolrCall [admin] webapp=null path=/admin/metrics params={prefix=CONTAINER.fs.usableSpace,CONTAINER.fs.totalSpace,CORE.coreName&wt=javabin&version=2&group=solr.node,solr.core} status=0 QTime=0
[junit4] 2> 2434193 DEBUG (OverseerStateUpdate-72110765190283268-127.0.0.1:58566_solr-n_0000000000) [n:127.0.0.1:58566_solr ] o.a.s.c.Overseer processMessage: queueSize: 1, message = {
[junit4] 2> "operation":"ADDREPLICA",
[junit4] 2> "collection":"tlog_replica_test_kill_tlog_replica",
[junit4] 2> "shard":"shard1",
[junit4] 2> "core":"tlog_replica_test_kill_tlog_replica_shard1_replica_t1",
[junit4] 2> "state":"down",
[junit4] 2> "base_url":"https://127.0.0.1:58566/solr",
[junit4] 2> "type":"TLOG",
[junit4] 2> "waitForFinalState":"false"} current state version: 0
[junit4] 2> 2434193 INFO (OverseerStateUpdate-72110765190283268-127.0.0.1:58566_solr-n_0000000000) [n:127.0.0.1:58566_solr ] o.a.s.c.o.SliceMutator createReplica() {
[junit4] 2> "operation":"ADDREPLICA",
[junit4] 2> "collection":"tlog_replica_test_kill_tlog_replica",
[junit4] 2> "shard":"shard1",
[junit4] 2> "core":"tlog_replica_test_kill_tlog_replica_shard1_replica_t1",
[junit4] 2> "state":"down",
[junit4] 2> "base_url":"https://127.0.0.1:58566/solr",
[junit4] 2> "type":"TLOG",
[junit4] 2> "waitForFinalState":"false"}
[junit4] 2> 2434198 DEBUG (OverseerStateUpdate-72110765190283268-127.0.0.1:58566_solr-n_0000000000) [n:127.0.0.1:58566_solr ] o.a.s.c.Overseer processMessage: queueSize: 2, message = {
[junit4] 2> "operation":"ADDREPLICA",
[junit4] 2> "collection":"tlog_replica_test_kill_tlog_replica",
[junit4] 2> "shard":"shard1",
[junit4] 2> "core":"tlog_replica_test_kill_tlog_replica_shard1_replica_t2",
[junit4] 2> "state":"down",
[junit4] 2> "base_url":"https://127.0.0.1:58565/solr",
[junit4] 2> "type":"TLOG",
[junit4] 2> "waitForFinalState":"false"} current state version: 0
[junit4] 2> 2434198 INFO (OverseerStateUpdate-72110765190283268-127.0.0.1:58566_solr-n_0000000000) [n:127.0.0.1:58566_solr ] o.a.s.c.o.SliceMutator createReplica() {
[junit4] 2> "operation":"ADDREPLICA",
[junit4] 2> "collection":"tlog_replica_test_kill_tlog_replica",
[junit4] 2> "shard":"shard1",
[junit4] 2> "core":"tlog_replica_test_kill_tlog_replica_shard1_replica_t2",
[junit4] 2> "state":"down",
[junit4] 2> "base_url":"https://127.0.0.1:58565/solr",
[junit4] 2> "type":"TLOG",
[junit4] 2> "waitForFinalState":"false"}
[junit4] 2> 2434453 INFO (qtp275683838-14448) [n:127.0.0.1:58565_solr x:tlog_replica_test_kill_tlog_replica_shard1_replica_t2] o.a.s.h.a.CoreAdminOperation core create command qt=/admin/cores&coreNodeName=core_node4&collection.configName=conf&newCollection=true&name=tlog_replica_test_kill_tlog_replica_shard1_replica_t2&action=CREATE&numShards=1&collection=tlog_replica_test_kill_tlog_replica&shard=shard1&wt=javabin&version=2&replicaType=TLOG
[junit4] 2> 2434464 INFO (qtp2080385080-14454) [n:127.0.0.1:58566_solr x:tlog_replica_test_kill_tlog_replica_shard1_replica_t1] o.a.s.h.a.CoreAdminOperation core create command qt=/admin/cores&coreNodeName=core_node3&collection.configName=conf&newCollection=true&name=tlog_replica_test_kill_tlog_replica_shard1_replica_t1&action=CREATE&numShards=1&collection=tlog_replica_test_kill_tlog_replica&shard=shard1&wt=javabin&version=2&replicaType=TLOG
[junit4] 2> 2434464 INFO (qtp2080385080-14454) [n:127.0.0.1:58566_solr x:tlog_replica_test_kill_tlog_replica_shard1_replica_t1] o.a.s.c.TransientSolrCoreCacheDefault Allocating transient cache for 2147483647 transient cores
[junit4] 2> 2434469 DEBUG (OverseerStateUpdate-72110765190283268-127.0.0.1:58566_solr-n_0000000000) [n:127.0.0.1:58566_solr ] o.a.s.c.Overseer processMessage: queueSize: 1, message = {
[junit4] 2> "core":"tlog_replica_test_kill_tlog_replica_shard1_replica_t2",
[junit4] 2> "core_node_name":"core_node4",
[junit4] 2> "roles":null,
[junit4] 2> "base_url":"https://127.0.0.1:58565/solr",
[junit4] 2> "node_name":"127.0.0.1:58565_solr",
[junit4] 2> "numShards":"1",
[junit4] 2> "state":"down",
[junit4] 2> "shard":"shard1",
[junit4] 2> "collection":"tlog_replica_test_kill_tlog_replica",
[junit4] 2> "type":"TLOG",
[junit4] 2> "force_set_state":"false",
[junit4] 2> "operation":"state"} current state version: 0
[junit4] 2> 2434478 DEBUG (OverseerStateUpdate-72110765190283268-127.0.0.1:58566_solr-n_0000000000) [n:127.0.0.1:58566_solr ] o.a.s.c.Overseer processMessage: queueSize: 2, message = {
[junit4] 2> "core":"tlog_replica_test_kill_tlog_replica_shard1_replica_t1",
[junit4] 2> "core_node_name":"core_node3",
[junit4] 2> "roles":null,
[junit4] 2> "base_url":"https://127.0.0.1:58566/solr",
[junit4] 2> "node_name":"127.0.0.1:58566_solr",
[junit4] 2> "numShards":"1",
[junit4] 2> "state":"down",
[junit4] 2> "shard":"shard1",
[junit4] 2> "collection":"tlog_replica_test_kill_tlog_replica",
[junit4] 2> "type":"TLOG",
[junit4] 2> "force_set_state":"false",
[junit4] 2> "operation":"state"} current state version: 0
[junit4] 2> 2435478 INFO (qtp275683838-14448) [n:127.0.0.1:58565_solr c:tlog_replica_test_kill_tlog_replica s:shard1 r:core_node4 x:tlog_replica_test_kill_tlog_replica_shard1_replica_t2] o.a.s.c.SolrConfig Using Lucene MatchVersion: 8.0.0
[junit4] 2> 2435484 INFO (qtp275683838-14448) [n:127.0.0.1:58565_solr c:tlog_replica_test_kill_tlog_replica s:shard1 r:core_node4 x:tlog_replica_test_kill_tlog_replica_shard1_replica_t2] o.a.s.s.IndexSchema [tlog_replica_test_kill_tlog_replica_shard1_replica_t2] Schema name=minimal
[junit4] 2> 2435485 INFO (qtp275683838-14448) [n:127.0.0.1:58565_solr c:tlog_replica_test_kill_tlog_replica s:shard1 r:core_node4 x:tlog_replica_test_kill_tlog_replica_shard1_replica_t2] o.a.s.s.IndexSchema Loaded schema minimal/1.1 with uniqueid field id
[junit4] 2> 2435486 INFO (qtp275683838-14448) [n:127.0.0.1:58565_solr c:tlog_replica_test_kill_tlog_replica s:shard1 r:core_node4 x:tlog_replica_test_kill_tlog_replica_shard1_replica_t2] o.a.s.c.CoreContainer Creating SolrCore 'tlog_replica_test_kill_tlog_replica_shard1_replica_t2' using configuration from collection tlog_replica_test_kill_tlog_replica, trusted=true
[junit4] 2> 2435488 INFO (qtp275683838-14448) [n:127.0.0.1:58565_solr c:tlog_replica_test_kill_tlog_replica s:shard1 r:core_node4 x:tlog_replica_test_kill_tlog_replica_shard1_replica_t2] o.a.s.m.r.SolrJmxReporter JMX monitoring for 'solr_58565.solr.core.tlog_replica_test_kill_tlog_replica.shard1.replica_t2' (registry 'solr.core.tlog_replica_test_kill_tlog_replica.shard1.replica_t2') enabled at server: com.sun.jmx.mbeanserver.JmxMBeanServer@4c75925e
[junit4] 2> 2435488 INFO (qtp275683838-14448) [n:127.0.0.1:58565_solr c:tlog_replica_test_kill_tlog_replica s:shard1 r:core_node4 x:tlog_replica_test_kill_tlog_replica_shard1_replica_t2] o.a.s.c.SolrCore [[tlog_replica_test_kill_tlog_replica_shard1_replica_t2] ] Opening new SolrCore at [/Users/jenkins/workspace/Lucene-Solr-master-MacOSX/solr/build/solr-core/test/J1/temp/solr.cloud.TestTlogReplica_EEDE29EE60EA9EE6-001/tempDir-001/node2/tlog_replica_test_kill_tlog_replica_shard1_replica_t2], dataDir=[/Users/jenkins/workspace/Lucene-Solr-master-MacOSX/solr/build/solr-core/test/J1/temp/solr.cloud.TestTlogReplica_EEDE29EE60EA9EE6-001/tempDir-001/node2/./tlog_replica_test_kill_tlog_replica_shard1_replica_t2/data/]
[junit4] 2> 2435493 INFO (qtp2080385080-14454) [n:127.0.0.1:58566_solr c:tlog_replica_test_kill_tlog_replica s:shard1 r:core_node3 x:tlog_replica_test_kill_tlog_replica_shard1_replica_t1] o.a.s.c.SolrConfig Using Lucene MatchVersion: 8.0.0
[junit4] 2> 2435498 INFO (qtp2080385080-14454) [n:127.0.0.1:58566_solr c:tlog_replica_test_kill_tlog_replica s:shard1 r:core_node3 x:tlog_replica_test_kill_tlog_replica_shard1_replica_t1] o.a.s.s.IndexSchema [tlog_replica_test_kill_tlog_replica_shard1_replica_t1] Schema name=minimal
[junit4] 2> 2435500 INFO (qtp2080385080-14454) [n:127.0.0.1:58566_solr c:tlog_replica_test_kill_tlog_replica s:shard1 r:core_node3 x:tlog_replica_test_kill_tlog_replica_shard1_replica_t1] o.a.s.s.IndexSchema Loaded schema minimal/1.1 with uniqueid field id
[junit4] 2> 2435500 INFO (qtp2080385080-14454) [n:127.0.0.1:58566_solr c:tlog_replica_test_kill_tlog_replica s:shard1 r:core_node3 x:tlog_replica_test_kill_tlog_replica_shard1_replica_t1] o.a.s.c.CoreContainer Creating SolrCore 'tlog_replica_test_kill_tlog_replica_shard1_replica_t1' using configuration from collection tlog_replica_test_kill_tlog_replica, trusted=true
[junit4] 2> 2435500 INFO (qtp2080385080-14454) [n:127.0.0.1:58566_solr c:tlog_replica_test_kill_tlog_replica s:shard1 r:core_node3 x:tlog_replica_test_kill_tlog_replica_shard1_replica_t1] o.a.s.m.r.SolrJmxReporter JMX monitoring for 'solr_58566.solr.core.tlog_replica_test_kill_tlog_replica.shard1.replica_t1' (registry 'solr.core.tlog_replica_test_kill_tlog_replica.shard1.replica_t1') enabled at server: com.sun.jmx.mbeanserver.JmxMBeanServer@4c75925e
[junit4] 2> 2435500 INFO (qtp2080385080-14454) [n:127.0.0.1:58566_solr c:tlog_replica_test_kill_tlog_replica s:shard1 r:core_node3 x:tlog_replica_test_kill_tlog_replica_shard1_replica_t1] o.a.s.c.SolrCore [[tlog_replica_test_kill_tlog_replica_shard1_replica_t1] ] Opening new SolrCore at [/Users/jenkins/workspace/Lucene-Solr-master-MacOSX/solr/build/solr-core/test/J1/temp/solr.cloud.TestTlogReplica_EEDE29EE60EA9EE6-001/tempDir-001/node1/tlog_replica_test_kill_tlog_replica_shard1_replica_t1], dataDir=[/Users/jenkins/workspace/Lucene-Solr-master-MacOSX/solr/build/solr-core/test/J1/temp/solr.cloud.TestTlogReplica_EEDE29EE60EA9EE6-001/tempDir-001/node1/./tlog_replica_test_kill_tlog_replica_shard1_replica_t1/data/]
[junit4] 2> 2435575 INFO (qtp275683838-14448) [n:127.0.0.1:58565_solr c:tlog_replica_test_kill_tlog_replica s:shard1 r:core_node4 x:tlog_replica_test_kill_tlog_replica_shard1_replica_t2] o.a.s.u.UpdateHandler Using UpdateLog implementation: org.apache.solr.update.UpdateLog
[junit4] 2> 2435575 INFO (qtp275683838-14448) [n:127.0.0.1:58565_solr c:tlog_replica_test_kill_tlog_replica s:shard1 r:core_node4 x:tlog_replica_test_kill_tlog_replica_shard1_replica_t2] o.a.s.u.UpdateLog Initializing UpdateLog: dataDir=null defaultSyncLevel=FLUSH numRecordsToKeep=100 maxNumLogsToKeep=10 numVersionBuckets=65536
[junit4] 2> 2435578 INFO (qtp275683838-14448) [n:127.0.0.1:58565_solr c:tlog_replica_test_kill_tlog_replica s:shard1 r:core_node4 x:tlog_replica_test_kill_tlog_replica_shard1_replica_t2] o.a.s.u.CommitTracker Hard AutoCommit: disabled
[junit4] 2> 2435578 INFO (qtp275683838-14448) [n:127.0.0.1:58565_solr c:tlog_replica_test_kill_tlog_replica s:shard1 r:core_node4 x:tlog_replica_test_kill_tlog_replica_shard1_replica_t2] o.a.s.u.CommitTracker Soft AutoCommit: disabled
[junit4] 2> 2435579 INFO (qtp275683838-14448) [n:127.0.0.1:58565_solr c:tlog_replica_test_kill_tlog_replica s:shard1 r:core_node4 x:tlog_replica_test_kill_tlog_replica_shard1_replica_t2] o.a.s.s.SolrIndexSearcher Opening [Searcher@19ca3f83[tlog_replica_test_kill_tlog_replica_shard1_replica_t2] main]
[junit4] 2> 2435581 INFO (qtp275683838-14448) [n:127.0.0.1:58565_solr c:tlog_replica_test_kill_tlog_replica s:shard1 r:core_node4 x:tlog_replica_test_kill_tlog_replica_shard1_replica_t2] o.a.s.r.ManagedResourceStorage Configured ZooKeeperStorageIO with znodeBase: /configs/conf
[junit4] 2> 2435582 INFO (qtp275683838-14448) [n:127.0.0.1:58565_solr c:tlog_replica_test_kill_tlog_replica s:shard1 r:core_node4 x:tlog_replica_test_kill_tlog_replica_shard1_replica_t2] o.a.s.r.ManagedResourceStorage Loaded null at path _rest_managed.json using ZooKeeperStorageIO:path=/configs/conf
[junit4] 2> 2435582 INFO (qtp275683838-14448) [n:127.0.0.1:58565_solr c:tlog_replica_test_kill_tlog_replica s:shard1 r:core_node4 x:tlog_replica_test_kill_tlog_replica_shard1_replica_t2] o.a.s.h.ReplicationHandler Commits will be reserved for 10000ms.
[junit4] 2> 2435583 INFO (qtp275683838-14448) [n:127.0.0.1:58565_solr c:tlog_replica_test_kill_tlog_replica s:shard1 r:core_node4 x:tlog_replica_test_kill_tlog_replica_shard1_replica_t2] o.a.s.u.UpdateLog Could not find max version in index or recent updates, using new clock 1617129135576973312
[junit4] 2> 2435584 INFO (qtp2080385080-14454) [n:127.0.0.1:58566_solr c:tlog_replica_test_kill_tlog_replica s:shard1 r:core_node3 x:tlog_replica_test_kill_tlog_replica_shard1_replica_t1] o.a.s.u.UpdateHandler Using UpdateLog implementation: org.apache.solr.update.UpdateLog
[junit4] 2> 2435584 INFO (qtp2080385080-14454) [n:127.0.0.1:58566_solr c:tlog_replica_test_kill_tlog_replica s:shard1 r:core_node3 x:tlog_replica_test_kill_tlog_replica_shard1_replica_t1] o.a.s.u.UpdateLog Initializing UpdateLog: dataDir=null defaultSyncLevel=FLUSH numRecordsToKeep=100 maxNumLogsToKeep=10 numVersionBuckets=65536
[junit4] 2> 2435584 INFO (searcherExecutor-5492-thread-1-processing-n:127.0.0.1:58565_solr x:tlog_replica_test_kill_tlog_replica_shard1_replica_t2 c:tlog_replica_test_kill_tlog_replica s:shard1 r:core_node4) [n:127.0.0.1:58565_solr c:tlog_replica_test_kill_tlog_replica s:shard1 r:core_node4 x:tlog_replica_test_kill_tlog_replica_shard1_replica_t2] o.a.s.c.SolrCore [tlog_replica_test_kill_tlog_replica_shard1_replica_t2] Registered new searcher Searcher@19ca3f83[tlog_replica_test_kill_tlog_replica_shard1_replica_t2] main{ExitableDirectoryReader(UninvertingDirectoryReader())}
[junit4] 2> 2435586 INFO (qtp2080385080-14454) [n:127.0.0.1:58566_solr c:tlog_replica_test_kill_tlog_replica s:shard1 r:core_node3 x:tlog_replica_test_kill_tlog_replica_shard1_replica_t1] o.a.s.u.CommitTracker Hard AutoCommit: disabled
[junit4] 2> 2435586 INFO (qtp2080385080-14454) [n:127.0.0.1:58566_solr c:tlog_replica_test_kill_tlog_replica s:shard1 r:core_node3 x:tlog_replica_test_kill_tlog_replica_shard1_replica_t1] o.a.s.u.CommitTracker Soft AutoCommit: disabled
[junit4] 2> 2435588 INFO (qtp2080385080-14454) [n:127.0.0.1:58566_solr c:tlog_replica_test_kill_tlog_replica s:shard1 r:core_node3 x:tlog_replica_test_kill_tlog_replica_shard1_replica_t1] o.a.s.s.SolrIndexSearcher Opening [Searcher@573f82e0[tlog_replica_test_kill_tlog_replica_shard1_replica_t1] main]
[junit4] 2> 2435590 INFO (qtp2080385080-14454) [n:127.0.0.1:58566_solr c:tlog_replica_test_kill_tlog_replica s:shard1 r:core_node3 x:tlog_replica_test_kill_tlog_replica_shard1_replica_t1] o.a.s.r.ManagedResourceStorage Configured ZooKeeperStorageIO with znodeBase: /configs/conf
[junit4] 2> 2435590 INFO (qtp2080385080-14454) [n:127.0.0.1:58566_solr c:tlog_replica_test_kill_tlog_replica s:shard1 r:core_node3 x:tlog_replica_test_kill_tlog_replica_shard1_replica_t1] o.a.s.r.ManagedResourceStorage Loaded null at path _rest_managed.json using ZooKeeperStorageIO:path=/configs/conf
[junit4] 2> 2435591 INFO (qtp2080385080-14454) [n:127.0.0.1:58566_solr c:tlog_replica_test_kill_tlog_replica s:shard1 r:core_node3 x:tlog_replica_test_kill_tlog_replica_shard1_replica_t1] o.a.s.h.ReplicationHandler Commits will be reserved for 10000ms.
[junit4] 2> 2435591 INFO (qtp2080385080-14454) [n:127.0.0.1:58566_solr c:tlog_replica_test_kill_tlog_replica s:shard1 r:core_node3 x:tlog_replica_test_kill_tlog_replica_shard1_replica_t1] o.a.s.u.UpdateLog Could not find max version in index or recent updates, using new clock 1617129135585361920
[junit4] 2> 2435592 INFO (searcherExecutor-5493-thread-1-processing-n:127.0.0.1:58566_solr x:tlog_replica_test_kill_tlog_replica_shard1_replica_t1 c:tlog_replica_test_kill_tlog_replica s:shard1 r:core_node3) [n:127.0.0.1:58566_solr c:tlog_replica_test_kill_tlog_replica s:shard1 r:core_node3 x:tlog_replica_test_kill_tlog_replica_shard1_replica_t1] o.a.s.c.SolrCore [tlog_replica_test_kill_tlog_replica_shard1_replica_t1] Registered new searcher Searcher@573f82e0[tlog_replica_test_kill_tlog_replica_shard1_replica_t1] main{ExitableDirectoryReader(UninvertingDirectoryReader())}
[junit4] 2> 2435594 INFO (qtp275683838-14448) [n:127.0.0.1:58565_solr c:tlog_replica_test_kill_tlog_replica s:shard1 r:core_node4 x:tlog_replica_test_kill_tlog_replica_shard1_replica_t2] o.a.s.c.ZkShardTerms Successful update of terms at /collections/tlog_replica_test_kill_tlog_replica/terms/shard1 to Terms{values={core_node4=0}, version=0}
[junit4] 2> 2435599 INFO (qtp2080385080-14454) [n:127.0.0.1:58566_solr c:tlog_replica_test_kill_tlog_replica s:shard1 r:core_node3 x:tlog_replica_test_kill_tlog_replica_shard1_replica_t1] o.a.s.c.ZkShardTerms Successful update of terms at /collections/tlog_replica_test_kill_tlog_replica/terms/shard1 to Terms{values={core_node3=0, core_node4=0}, version=1}
[junit4] 2> 2435604 INFO (qtp275683838-14448) [n:127.0.0.1:58565_solr c:tlog_replica_test_kill_tlog_replica s:shard1 r:core_node4 x:tlog_replica_test_kill_tlog_replica_shard1_replica_t2] o.a.s.c.ShardLeaderElectionContext Enough replicas found to continue.
[junit4] 2> 2435604 INFO (qtp275683838-14448) [n:127.0.0.1:58565_solr c:tlog_replica_test_kill_tlog_replica s:shard1 r:core_node4 x:tlog_replica_test_kill_tlog_replica_shard1_replica_t2] o.a.s.c.ShardLeaderElectionContext I may be the new leader - try and sync
[junit4] 2> 2435604 INFO (qtp275683838-14448) [n:127.0.0.1:58565_solr c:tlog_replica_test_kill_tlog_replica s:shard1 r:core_node4 x:tlog_replica_test_kill_tlog_replica_shard1_replica_t2] o.a.s.c.SyncStrategy Sync replicas to https://127.0.0.1:58565/solr/tlog_replica_test_kill_tlog_replica_shard1_replica_t2/
[junit4] 2> 2435604 DEBUG (OverseerStateUpdate-72110765190283268-127.0.0.1:58566_solr-n_0000000000) [n:127.0.0.1:58566_solr ] o.a.s.c.Overseer processMessage: queueSize: 1, message = {
[junit4] 2> "operation":"leader",
[junit4] 2> "shard":"shard1",
[junit4] 2> "collection":"tlog_replica_test_kill_tlog_replica"} current state version: 0
[junit4] 2> 2435605 INFO (qtp275683838-14448) [n:127.0.0.1:58565_solr c:tlog_replica_test_kill_tlog_replica s:shard1 r:core_node4 x:tlog_replica_test_kill_tlog_replica_shard1_replica_t2] o.a.s.u.PeerSync PeerSync: core=tlog_replica_test_kill_tlog_replica_shard1_replica_t2 url=https://127.0.0.1:58565/solr START replicas=[https://127.0.0.1:58566/solr/tlog_replica_test_kill_tlog_replica_shard1_replica_t1/] nUpdates=100
[junit4] 2> 2435606 INFO (qtp275683838-14448) [n:127.0.0.1:58565_solr c:tlog_replica_test_kill_tlog_replica s:shard1 r:core_node4 x:tlog_replica_test_kill_tlog_replica_shard1_replica_t2] o.a.s.u.PeerSync PeerSync: core=tlog_replica_test_kill_tlog_replica_shard1_replica_t2 url=https://127.0.0.1:58565/solr DONE. We have no versions. sync failed.
[junit4] 2> 2435611 INFO (qtp2080385080-14457) [n:127.0.0.1:58566_solr c:tlog_replica_test_kill_tlog_replica s:shard1 r:core_node3 x:tlog_replica_test_kill_tlog_replica_shard1_replica_t1] o.a.s.c.S.Request [tlog_replica_test_kill_tlog_replica_shard1_replica_t1] webapp=/solr path=/get params={distrib=false&qt=/get&fingerprint=false&getVersions=100&wt=javabin&version=2} status=0 QTime=0
[junit4] 2> 2435611 INFO (qtp275683838-14448) [n:127.0.0.1:58565_solr c:tlog_replica_test_kill_tlog_replica s:shard1 r:core_node4 x:tlog_replica_test_kill_tlog_replica_shard1_replica_t2] o.a.s.c.SyncStrategy Leader's attempt to sync with shard failed, moving to the next candidate
[junit4] 2> 2435611 INFO (qtp275683838-14448) [n:127.0.0.1:58565_solr c:tlog_replica_test_kill_tlog_replica s:shard1 r:core_node4 x:tlog_replica_test_kill_tlog_replica_shard1_replica_t2] o.a.s.c.ShardLeaderElectionContext We failed sync, but we have no versions - we can't sync in that case - we were active before, so become leader anyway
[junit4] 2> 2435611 INFO (qtp275683838-14448) [n:127.0.0.1:58565_solr c:tlog_replica_test_kill_tlog_replica s:shard1 r:core_node4 x:tlog_replica_test_kill_tlog_replica_shard1_replica_t2] o.a.s.c.ZkController tlog_replica_test_kill_tlog_replica_shard1_replica_t2 stopping background replication from leader
[junit4] 2> 2435619 INFO (qtp275683838-14448) [n:127.0.0.1:58565_solr c:tlog_replica_test_kill_tlog_replica s:shard1 r:core_node4 x:tlog_replica_test_kill_tlog_replica_shard1_replica_t2] o.a.s.c.ShardLeaderElectionContext I am the new leader: https://127.0.0.1:58565/solr/tlog_replica_test_kill_tlog_replica_shard1_replica_t2/ shard1
[junit4] 2> 2435621 DEBUG (OverseerStateUpdate-72110765190283268-127.0.0.1:58566_solr-n_0000000000) [n:127.0.0.1:58566_solr ] o.a.s.c.Overseer processMessage: queueSize: 2, message = {
[junit4] 2> "operation":"leader",
[junit4] 2> "shard":"shard1",
[junit4] 2> "collection":"tlog_replica_test_kill_tlog_replica",
[junit4] 2> "base_url":"https://127.0.0.1:58565/solr",
[junit4] 2> "core":"tlog_replica_test_kill_tlog_replica_shard1_replica_t2",
[junit4] 2> "state":"active"} current state version: 0
[junit4] 2> 2435786 INFO (qtp275683838-14448) [n:127.0.0.1:58565_solr c:tlog_replica_test_kill_tlog_replica s:shard1 r:core_node4 x:tlog_replica_test_kill_tlog_replica_shard1_replica_t2] o.a.s.c.ZkController I am the leader, no recovery necessary
[junit4] 2> 2435788 DEBUG (OverseerStateUpdate-72110765190283268-127.0.0.1:58566_solr-n_0000000000) [n:127.0.0.1:58566_solr ] o.a.s.c.Overseer processMessage: queueSize: 1, message = {
[junit4] 2> "core":"tlog_replica_test_kill_tlog_replica_shard1_replica_t2",
[junit4] 2> "core_node_name":"core_node4",
[junit4] 2> "roles":null,
[junit4] 2> "base_url":"https://127.0.0.1:58565/solr",
[junit4] 2> "node_name":"127.0.0.1:58565_solr",
[junit4] 2> "numShards":"1",
[junit4] 2> "state":"active",
[junit4] 2> "shard":"shard1",
[junit4] 2> "collection":"tlog_replica_test_kill_tlog_replica",
[junit4] 2> "type":"TLOG",
[junit4] 2> "force_set_state":"false",
[junit4] 2> "operation":"state"} current state version: 0
[junit4] 2> 2435790 INFO (qtp275683838-14448) [n:127.0.0.1:58565_solr c:tlog_replica_test_kill_tlog_replica s:shard1 r:core_node4 x:tlog_replica_test_kill_tlog_replica_shard1_replica_t2] o.a.s.s.HttpSolrCall [admin] webapp=null path=/admin/cores params={qt=/admin/cores&coreNodeName=core_node4&collection.configName=conf&newCollection=true&name=tlog_replica_test_kill_tlog_replica_shard1_replica_t2&action=CREATE&numShards=1&collection=tlog_replica_test_kill_tlog_replica&shard=shard1&wt=javabin&version=2&replicaType=TLOG} status=0 QTime=1336
[junit4] 2> 2435890 INFO (zkCallback-5332-thread-1) [ ] o.a.s.c.c.ZkStateReader A cluster state change: [WatchedEvent state:SyncConnected type:NodeDataChanged path:/collections/tlog_replica_test_kill_tlog_replica/state.json] for collection [tlog_replica_test_kill_tlog_replica] has occurred - updating... (live nodes size: [2])
[junit4] 2> 2436615 INFO (qtp2080385080-14454) [n:127.0.0.1:58566_solr c:tlog_replica_test_kill_tlog_replica s:shard1 r:core_node3 x:tlog_replica_test_kill_tlog_replica_shard1_replica_t1] o.a.s.c.ZkController tlog_replica_test_kill_tlog_replica_shard1_replica_t1 starting background replication from leader
[junit4] 2> 2436615 INFO (qtp2080385080-14454) [n:127.0.0.1:58566_solr c:tlog_replica_test_kill_tlog_replica s:shard1 r:core_node3 x:tlog_replica_test_kill_tlog_replica_shard1_replica_t1] o.a.s.c.ReplicateFromLeader Will start replication from leader with poll interval: 00:00:01
[junit4] 2> 2436616 INFO (qtp2080385080-14454) [n:127.0.0.1:58566_solr c:tlog_replica_test_kill_tlog_replica s:shard1 r:core_node3 x:tlog_replica_test_kill_tlog_replica_shard1_replica_t1] o.a.s.h.ReplicationHandler Poll scheduled at an interval of 1000ms
[junit4] 2> 2436616 INFO (qtp2080385080-14454) [n:127.0.0.1:58566_solr c:tlog_replica_test_kill_tlog_replica s:shard1 r:core_node3 x:tlog_replica_test_kill_tlog_replica_shard1_replica_t1] o.a.s.h.ReplicationHandler Commits will be reserved for 10000ms.
[junit4] 2> 2436619 DEBUG (OverseerStateUpdate-72110765190283268-127.0.0.1:58566_solr-n_0000000000) [n:127.0.0.1:58566_solr ] o.a.s.c.Overseer processMessage: queueSize: 1, message = {
[junit4] 2> "core":"tlog_replica_test_kill_tlog_replica_shard1_replica_t1",
[junit4] 2> "core_node_name":"core_node3",
[junit4] 2> "roles":null,
[junit4] 2> "base_url":"https://127.0.0.1:58566/solr",
[junit4] 2> "node_name":"127.0.0.1:58566_solr",
[junit4] 2> "numShards":"1",
[junit4] 2> "state":"active",
[junit4] 2> "shard":"shard1",
[junit4] 2> "collection":"tlog_replica_test_kill_tlog_replica",
[junit4] 2> "type":"TLOG",
[junit4] 2> "force_set_state":"false",
[junit4] 2> "operation":"state"} current state version: 0
[junit4] 2> 2436620 INFO (qtp2080385080-14454) [n:127.0.0.1:58566_solr c:tlog_replica_test_kill_tlog_replica s:shard1 r:core_node3 x:tlog_replica_test_kill_tlog_replica_shard1_replica_t1] o.a.s.s.HttpSolrCall [admin] webapp=null path=/admin/cores params={qt=/admin/cores&coreNodeName=core_node3&collection.configName=conf&newCollection=true&name=tlog_replica_test_kill_tlog_replica_shard1_replica_t1&action=CREATE&numShards=1&collection=tlog_replica_test_kill_tlog_replica&shard=shard1&wt=javabin&version=2&replicaType=TLOG} status=0 QTime=2156
[junit4] 2> 2436624 INFO (qtp275683838-14445) [n:127.0.0.1:58565_solr ] o.a.s.h.a.CollectionsHandler Wait for new collection to be active for at most 30 seconds. Check all shard replicas
[junit4] 2> 2436723 INFO (zkCallback-5332-thread-1) [ ] o.a.s.c.c.ZkStateReader A cluster state change: [WatchedEvent state:SyncConnected type:NodeDataChanged path:/collections/tlog_replica_test_kill_tlog_replica/state.json] for collection [tlog_replica_test_kill_tlog_replica] has occurred - updating... (live nodes size: [2])
[junit4] 2> 2436724 INFO (zkCallback-5318-thread-1) [ ] o.a.s.c.c.ZkStateReader A cluster state change: [WatchedEvent state:SyncConnected type:NodeDataChanged path:/collections/tlog_replica_test_kill_tlog_replica/state.json] for collection [tlog_replica_test_kill_tlog_replica] has occurred - updating... (live nodes size: [2])
[junit4] 2> 2437267 INFO (indexFetcher-5503-thread-1) [ ] o.a.s.h.IndexFetcher Updated masterUrl to https://127.0.0.1:58565/solr/tlog_replica_test_kill_tlog_replica_shard1_replica_t2/
[junit4] 2> 2437270 INFO (qtp275683838-14447) [n:127.0.0.1:58565_solr c:tlog_replica_test_kill_tlog_replica s:shard1 r:core_node4 x:tlog_replica_test_kill_tlog_replica_shard1_replica_t2] o.a.s.c.S.Request [tlog_replica_test_kill_tlog_replica_shard1_replica_t2] webapp=/solr path=/replication params={qt=/replication&wt=javabin&version=2&command=indexversion} status=0 QTime=0
[junit4] 2> 2437270 INFO (indexFetcher-5503-thread-1) [ ] o.a.s.h.IndexFetcher Master's generation: 1
[junit4] 2> 2437270 INFO (indexFetcher-5503-thread-1) [ ] o.a.s.h.IndexFetcher Master's version: 0
[junit4] 2> 2437270 INFO (indexFetcher-5503-thread-1) [ ] o.a.s.h.IndexFetcher Slave's generation: 1
[junit4] 2> 2437270 INFO (indexFetcher-5503-thread-1) [ ] o.a.s.h.IndexFetcher Slave's version: 0
[junit4] 2> 2437270 INFO (indexFetcher-5503-thread-1) [ ] o.a.s.h.IndexFetcher New index in Master. Deleting mine...
[junit4] 2> 2437271 INFO (indexFetcher-5503-thread-1) [ ] o.a.s.s.SolrIndexSearcher Opening [Searcher@28da6eb8[tlog_replica_test_kill_tlog_replica_shard1_replica_t1] main]
[junit4] 2> 2437272 INFO (searcherExecutor-5493-thread-1) [ ] o.a.s.c.SolrCore [tlog_replica_test_kill_tlog_replica_shard1_replica_t1] Registered new searcher Searcher@28da6eb8[tlog_replica_test_kill_tlog_replica_shard1_replica_t1] main{ExitableDirectoryReader(UninvertingDirectoryReader())}
[junit4] 2> 2437625 INFO (qtp275683838-14445) [n:127.0.0.1:58565_solr ] o.a.s.s.HttpSolrCall [admin] webapp=null path=/admin/collections params={pullReplicas=0&collection.configName=conf&maxShardsPerNode=100&name=tlog_replica_test_kill_tlog_replica&nrtReplicas=0&action=CREATE&numShards=1&tlogReplicas=2&wt=javabin&version=2} status=0 QTime=3593
[junit4] 2> 2437635 INFO (qtp2080385080-14454) [n:127.0.0.1:58566_solr c:tlog_replica_test_kill_tlog_replica s:shard1 r:core_node3 x:tlog_replica_test_kill_tlog_replica_shard1_replica_t1] o.a.s.c.S.Request [tlog_replica_test_kill_tlog_replica_shard1_replica_t1] webapp=/solr path=/select params={q=*:*&wt=javabin&version=2} hits=0 status=0 QTime=0
[junit4] 2> 2437641 INFO (qtp275683838-14445) [n:127.0.0.1:58565_solr c:tlog_replica_test_kill_tlog_replica s:shard1 r:core_node4 x:tlog_replica_test_kill_tlog_replica_shard1_replica_t2] o.a.s.c.S.Request [tlog_replica_test_kill_tlog_replica_shard1_replica_t2] webapp=/solr path=/select params={q=*:*&wt=javabin&version=2} hits=0 status=0 QTime=0
[junit4] 2> 2437653 INFO (qtp275683838-14448) [n:127.0.0.1:58565_solr c:tlog_replica_test_kill_tlog_replica s:shard1 r:core_node4 x:tlog_replica_test_kill_tlog_replica_shard1_replica_t2] o.a.s.c.ZkShardTerms Successful update of terms at /collections/tlog_replica_test_kill_tlog_replica/terms/shard1 to Terms{values={core_node3=1, core_node4=1}, version=2}
[junit4] 2> 2437658 INFO (qtp2080385080-14456) [n:127.0.0.1:58566_solr c:tlog_replica_test_kill_tlog_replica s:shard1 r:core_node3 x:tlog_replica_test_kill_tlog_replica_shard1_replica_t1] o.a.s.u.p.LogUpdateProcessorFactory [tlog_replica_test_kill_tlog_replica_shard1_replica_t1] webapp=/solr path=/update params={update.distrib=FROMLEADER&distrib.from=https://127.0.0.1:58565/solr/tlog_replica_test_kill_tlog_replica_shard1_replica_t2/&wt=javabin&version=2}{add=[1 (1617129137744379904)]} 0 1
[junit4] 2> 2437658 INFO (qtp275683838-14448) [n:127.0.0.1:58565_solr c:tlog_replica_test_kill_tlog_replica s:shard1 r:core_node4 x:tlog_replica_test_kill_tlog_replica_shard1_replica_t2] o.a.s.u.p.LogUpdateProcessorFactory [tlog_replica_test_kill_tlog_replica_shard1_replica_t2] webapp=/solr path=/update params={wt=javabin&version=2}{add=[1 (1617129137744379904)]} 0 9
[junit4] 2> 2437661 INFO (qtp2080385080-14454) [n:127.0.0.1:58566_solr c:tlog_replica_test_kill_tlog_replica s:shard1 r:core_node3 x:tlog_replica_test_kill_tlog_replica_shard1_replica_t1] o.a.s.u.p.LogUpdateProcessorFactory [tlog_replica_test_kill_tlog_replica_shard1_replica_t1] webapp=/solr path=/update params={update.distrib=FROMLEADER&waitSearcher=true&openSearcher=true&commit=true&softCommit=false&distrib.from=https://127.0.0.1:58565/solr/tlog_replica_test_kill_tlog_replica_shard1_replica_t2/&commit_end_point=true&wt=javabin&version=2&expungeDeletes=false}{commit=} 0 0
[junit4] 2> 2437665 INFO (qtp275683838-14447) [n:127.0.0.1:58565_solr c:tlog_replica_test_kill_tlog_replica s:shard1 r:core_node4 x:tlog_replica_test_kill_tlog_replica_shard1_replica_t2] o.a.s.u.DirectUpdateHandler2 start commit{_version_=1617129137760108544,optimize=false,openSearcher=true,waitSearcher=true,expungeDeletes=false,softCommit=false,prepareCommit=false}
[junit4] 2> 2437666 INFO (qtp275683838-14447) [n:127.0.0.1:58565_solr c:tlog_replica_test_kill_tlog_replica s:shard1 r:core_node4 x:tlog_replica_test_kill_tlog_replica_shard1_replica_t2] o.a.s.u.SolrIndexWriter Calling setCommitData with IW:org.apache.solr.update.SolrIndexWriter@a473229 commitCommandVersion:1617129137760108544
[junit4] 2> 2437674 INFO (qtp275683838-14447) [n:127.0.0.1:58565_solr c:tlog_replica_test_kill_tlog_replica s:shard1 r:core_node4 x:tlog_replica_test_kill_tlog_replica_shard1_replica_t2] o.a.s.s.SolrIndexSearcher Opening [Searcher@1999da96[tlog_replica_test_kill_tlog_replica_shard1_replica_t2] main]
[junit4] 2> 2437675 INFO (qtp275683838-14447) [n:127.0.0.1:58565_solr c:tlog_replica_test_kill_tlog_replica s:shard1 r:core_node4 x:tlog_replica_test_kill_tlog_replica_shard1_replica_t2] o.a.s.u.DirectUpdateHandler2 end_commit_flush
[junit4] 2> 2437677 INFO (searcherExecutor-5492-thread-1-processing-n:127.0.0.1:58565_solr x:tlog_replica_test_kill_tlog_replica_shard1_replica_t2 c:tlog_replica_test_kill_tlog_replica s:shard1 r:core_node4) [n:127.0.0.1:58565_solr c:tlog_replica_test_kill_tlog_replica s:shard1 r:core_node4 x:tlog_replica_test_kill_tlog_replica_shard1_replica_t2] o.a.s.c.SolrCore [tlog_replica_test_kill_tlog_replica_shard1_replica_t2] Registered new searcher Searcher@1999da96[tlog_replica_test_kill_tlog_replica_shard1_replica_t2] main{ExitableDirectoryReader(UninvertingDirectoryReader(Uninverting(_0(8.0.0):C1)))}
[junit4] 2> 2437677 INFO (qtp275683838-14447) [n:127.0.0.1:58565_solr c:tlog_replica_test_kill_tlog_replica s:shard1 r:core_node4 x:tlog_replica_test_kill_tlog_replica_shard1_replica_t2] o.a.s.u.p.LogUpdateProcessorFactory [tlog_replica_test_kill_tlog_replica_shard1_replica_t2] webapp=/solr path=/update params={update.distrib=FROMLEADER&waitSearcher=true&openSearcher=true&commit=true&softCommit=false&distrib.from=https://127.0.0.1:58565/solr/tlog_replica_test_kill_tlog_replica_shard1_replica_t2/&commit_end_point=true&wt=javabin&version=2&expungeDeletes=false}{commit=} 0 12
[junit4] 2> 2437678 INFO (qtp275683838-14445) [n:127.0.0.1:58565_solr c:tlog_replica_test_kill_tlog_replica s:shard1 r:core_node4 x:tlog_replica_test_kill_tlog_replica_shard1_replica_t2] o.a.s.u.p.LogUpdateProcessorFactory [tlog_replica_test_kill_tlog_replica_shard1_replica_t2] webapp=/solr path=/update params={_stateVer_=tlog_replica_test_kill_tlog_replica:5&waitSearcher=true&commit=true&softCommit=false&wt=javabin&version=2}{commit=} 0 17
[junit4] 2> 2437683 INFO (qtp2080385080-14456) [n:127.0.0.1:58566_solr c:tlog_replica_test_kill_tlog_replica s:shard1 r:core_node3 x:tlog_replica_test_kill_tlog_replica_shard1_replica_t1] o.a.s.c.S.Request [tlog_replica_test_kill_tlog_replica_shard1_replica_t1] webapp=/solr path=/select params={q=*:*&wt=javabin&version=2} hits=0 status=0 QTime=0
[junit4] 2> 2437789 INFO (qtp2080385080-14456) [n:127.0.0.1:58566_solr c:tlog_replica_test_kill_tlog_replica s:shard1 r:core_node3 x:tlog_replica_test_kill_tlog_replica_shard1_replica_t1] o.a.s.c.S.Request [tlog_replica_test_kill_tlog_replica_shard1_replica_t1] webapp=/solr path=/select params={q=*:*&wt=javabin&version=2} hits=0 status=0 QTime=0
[junit4] 2> 2437891 INFO (qtp2080385080-14454) [n:127.0.0.1:58566_solr c:tlog_replica_test_kill_tlog_replica s:shard1 r:core_node3 x:tlog_replica_test_kill_tlog_replica_shard1_replica_t1] o.a.s.c.S.Request [tlog_replica_test_kill_tlog_replica_shard1_replica_t1] webapp=/solr path=/select params={q=*:*&wt=javabin&version=2} hits=0 status=0 QTime=0
[junit4] 2> 2438003 INFO (qtp2080385080-14456) [n:127.0.0.1:58566_solr c:tlog_replica_test_kill_tlog_replica s:shard1 r:core_node3 x:tlog_replica_test_kill_tlog_replica_shard1_replica_t1] o.a.s.c.S.Request [tlog_replica_test_kill_tlog_replica_shard1_replica_t1] webapp=/solr path=/select params={q=*:*&wt=javabin&version=2} hits=0 status=0 QTime=0
[junit4] 2> 2438045 INFO (OverseerCollectionConfigSetProcessor-72110765190283268-127.0.0.1:58566_solr-n_0000000000) [n:127.0.0.1:58566_solr ] o.a.s.c.OverseerTaskQueue Response ZK path: /overseer/collection-queue-work/qnr-0000000000 doesn't exist. Requestor may have disconnected from ZooKeeper
[junit4] 2> 2438105 INFO (qtp2080385080-14454) [n:127.0.0.1:58566_solr c:tlog_replica_test_kill_tlog_replica s:shard1 r:core_node3 x:tlog_replica_test_kill_tlog_replica_shard1_replica_t1] o.a.s.c.S.Request [tlog_replica_test_kill_tlog_replica_shard1_replica_t1] webapp=/solr path=/select params={q=*:*&wt=javabin&version=2} hits=0 status=0 QTime=0
[junit4] 2> 2438209 INFO (qtp2080385080-14456) [n:127.0.0.1:58566_solr c:tlog_replica_test_kill_tlog_replica s:shard1 r:core_node3 x:tlog_replica_test_kill_tlog_replica_shard1_replica_t1] o.a.s.c.S.Request [tlog_replica_test_kill_tlog_replica_shard1_replica_t1] webapp=/solr path=/select params={q=*:*&wt=javabin&version=2} hits=0 status=0 QTime=0
[junit4] 2> 2438277 INFO (qtp275683838-14448) [n:127.0.0.1:58565_solr c:tlog_replica_test_kill_tlog_replica s:shard1 r:core_node4 x:tlog_replica_test_kill_tlog_replica_shard1_replica_t2] o.a.s.c.S.Request [tlog_replica_test_kill_tlog_replica_shard1_replica_t2] webapp=/solr path=/replication params={qt=/replication&wt=javabin&version=2&command=indexversion} status=0 QTime=0
[junit4] 2> 2438277 INFO (indexFetcher-5503-thread-1) [ ] o.a.s.h.IndexFetcher Master's generation: 2
[junit4] 2> 2438277 INFO (indexFetcher-5503-thread-1) [ ] o.a.s.h.IndexFetcher Master's version: 1542214524995
[junit4] 2> 2438277 INFO (indexFetcher-5503-thread-1) [ ] o.a.s.h.IndexFetcher Slave's generation: 1
[junit4] 2> 2438277 INFO (indexFetcher-5503-thread-1) [ ] o.a.s.h.IndexFetcher Slave's version: 0
[junit4] 2> 2438278 INFO (indexFetcher-5503-thread-1) [ ] o.a.s.h.IndexFetcher Starting replication process
[junit4] 2> 2438278 INFO (qtp275683838-14445) [n:127.0.0.1:58565_solr c:tlog_replica_test_kill_tlog_replica s:shard1 r:core_node4 x:tlog_replica_test_kill_tlog_replica_shard1_replica_t2] o.a.s.c.S.Request [tlog_replica_test_kill_tlog_replica_shard1_replica_t2] webapp=/solr path=/replication params={generation=2&qt=/replication&tlogFiles=false&wt=javabin&version=2&command=filelist} status=0 QTime=0
[junit4] 2> 2438279 INFO (indexFetcher-5503-thread-1) [ ] o.a.s.h.IndexFetcher Number of files in latest index in master: 19
[junit4] 2> 2438280 INFO (indexFetcher-5503-thread-1) [ ] o.a.s.h.IndexFetcher Starting download (fullCopy=false) to MockDirectoryWrapper(RAMDirectory@52ecd563 lockFactory=org.apache.lucene.store.SingleInstanceLockFactory@405d9399)
[junit4] 2> 2438280 INFO (qtp275683838-14448) [n:127.0.0.1:58565_solr c:tlog_replica_test_kill_tlog_replica s:shard1 r:core_node4 x:tlog_replica_test_kill_tlog_replica_shard1_replica_t2] o.a.s.c.S.Request [tlog_replica_test_kill_tlog_replica_shard1_replica_t2] webapp=/solr path=/replication params={generation=2&qt=/replication&file=_0_BlockTreeOrds_0.pos&checksum=true&wt=filestream&command=filecontent} status=0 QTime=0
[junit4] 2> 2438282 INFO (qtp275683838-14445) [n:127.0.0.1:58565_solr c:tlog_replica_test_kill_tlog_replica s:shard1 r:core_node4 x:tlog_replica_test_kill_tlog_replica_shard1_replica_t2] o.a.s.c.S.Request [tlog_replica_test_kill_tlog_replica_shard1_replica_t2] webapp=/solr path=/replication params={generation=2&qt=/replication&file=_0.si&checksum=true&wt=filestream&command=filecontent} status=0 QTime=0
[junit4] 2> 2438284 INFO (qtp275683838-14448) [n:127.0.0.1:58565_solr c:tlog_replica_test_kill_tlog_replica s:shard1 r:core_node4 x:tlog_replica_test_kill_tlog_replica_shard1_replica_t2] o.a.s.c.S.Request [tlog_replica_test_kill_tlog_replica_shard1_replica_t2] webapp=/solr path=/replication params={generation=2&qt=/replication&file=_0_LuceneVarGapDocFreqInterval_0.pos&checksum=true&wt=filestream&command=filecontent} status=0 QTime=0
[junit4] 2> 2438285 INFO (qtp275683838-14445) [n:127.0.0.1:58565_solr c:tlog_replica_test_kill_tlog_replica s:shard1 r:core_node4 x:tlog_replica_test_kill_tlog_replica_shard1_replica_t2] o.a.s.c.S.Request [tlog_replica_test_kill_tlog_replica_shard1_replica_t2] webapp=/solr path=/replication params={generation=2&qt=/replication&file=_0_Direct_0.dvdd&checksum=true&wt=filestream&command=filecontent} status=0 QTime=0
[junit4] 2> 2438286 INFO (qtp275683838-14448) [n:127.0.0.1:58565_solr c:tlog_replica_test_kill_tlog_replica s:shard1 r:core_node4 x:tlog_replica_test_kill_tlog_replica_shard1_replica_t2] o.a.s.c.S.Request [tlog_replica_test_kill_tlog_replica_shard1_replica_t2] webapp=/solr path=/replication params={generation=2&qt=/replication&file=_0.nvd&checksum=true&wt=filestream&command=filecontent} status=0 QTime=0
[junit4] 2> 2438287 INFO (qtp275683838-14445) [n:127.0.0.1:58565_solr c:tlog_replica_test_kill_tlog_replica s:shard1 r:core_node4 x:tlog_replica_test_kill_tlog_replica_shard1_replica_t2] o.a.s.c.S.Request [tlog_replica_test_kill_tlog_replica_shard1_replica_t2] webapp=/solr path=/replication params={generation=2&qt=/replication&file=_0_LuceneVarGapDocFreqInterval_0.tib&checksum=true&wt=filestream&command=filecontent} status=0 QTime=0
[junit4] 2> 2438289 INFO (qtp275683838-14448) [n:127.0.0.1:58565_solr c:tlog_replica_test_kill_tlog_replica s:shard1 r:core_node4 x:tlog_replica_test_kill_tlog_replica_shard1_replica_t2] o.a.s.c.S.Request [tlog_replica_test_kill_tlog_replica_shard1_replica_t2] webapp=/solr path=/replication params={generation=2&qt=/replication&file=_0.fdx&checksum=true&wt=filestream&command=filecontent} status=0 QTime=0
[junit4] 2> 2438290 INFO (qtp275683838-14445) [n:127.0.0.1:58565_solr c:tlog_replica_test_kill_tlog_replica s:shard1 r:core_node4 x:tlog_replica_test_kill_tlog_replica_shard1_replica_t2] o.a.s.c.S.Request [tlog_replica_test_kill_tlog_replica_shard1_replica_t2] webapp=/solr path=/replication params={generation=2&qt=/replication&file=_0_BlockTreeOrds_0.tio&checksum=true&wt=filestream&command=filecontent} status=0 QTime=0
[junit4] 2> 2438296 INFO (qtp275683838-14448) [n:127.0.0.1:58565_solr c:tlog_replica_test_kill_tlog_replica s:shard1 r:core_node4 x:tlog_replica_test_kill_tlog_replica_shard1_replica_t2] o.a.s.c.S.Request [tlog_replica_test_kill_tlog_replica_shard1_replica_t2] webapp=/solr path=/replication params={generation=2&qt=/replication&file=_0_BlockTreeOrds_0.doc&checksum=true&wt=filestream&command=filecontent} status=0 QTime=0
[junit4] 2> 2438301 INFO (qtp275683838-14445) [n:127.0.0.1:58565_solr c:tlog_replica_test_kill_tlog_replica s:shard1 r:core_node4 x:tlog_replica_test_kill_tlog_replica_shard1_replica_t2] o.a.s.c.S.Request [tlog_replica_test_kill_tlog_replica_shard1_replica_t2] webapp=/solr path=/replication params={generation=2&qt=/replication&file=_0.fdt&checksum=true&wt=filestream&command=filecontent} status=0 QTime=0
[junit4] 2> 2438304 INFO (qtp275683838-14448) [n:127.0.0.1:58565_solr c:tlog_replica_test_kill_tlog_replica s:shard1 r:core_node4 x:tlog_replica_test_kill_tlog_replica_shard1_replica_t2] o.a.s.c.S.Request [tlog_replica_test_kill_tlog_replica_shard1_replica_t2] webapp=/solr path=/replication params={generation=2&qt=/replication&file=_0_BlockTreeOrds_0.tipo&checksum=true&wt=filestream&command=filecontent} status=0 QTime=0
[junit4] 2> 2438314 INFO (qtp275683838-14445) [n:127.0.0.1:58565_solr c:tlog_replica_test_kill_tlog_replica s:shard1 r:core_node4 x:tlog_replica_test_kill_tlog_replica_shard1_replica_t2] o.a.s.c.S.Request [tlog_replica_test_kill_tlog_replica_shard1_replica_t2] webapp=/solr path=/replication params={generation=2&qt=/replication&file=_0_Asserting_0.dvd&checksum=true&wt=filestream&command=filecontent} status=0 QTime=0
[junit4] 2> 2438314 INFO (qtp2080385080-14454) [n:127.0.0.1:58566_solr c:tlog_replica_test_kill_tlog_replica s:shard1 r:core_node3 x:tlog_replica_test_kill_tlog_replica_shard1_replica_t1] o.a.s.c.S.Request [tlog_replica_test_kill_tlog_replica_shard1_replica_t1] webapp=/solr path=/select params={q=*:*&wt=javabin&version=2} hits=0 status=0 QTime=0
[junit4] 2> 2438316 INFO (qtp275683838-14448) [n:127.0.0.1:58565_solr c:tlog_replica_test_kill_tlog_replica s:shard1 r:core_node4 x:tlog_replica_test_kill_tlog_replica_shard1_replica_t2] o.a.s.c.S.Request [tlog_replica_test_kill_tlog_replica_shard1_replica_t2] webapp=/solr path=/replication params={generation=2&qt=/replication&file=_0_LuceneVarGapDocFreqInterval_0.tiv&checksum=true&wt=filestream&command=filecontent} status=0 QTime=0
[junit4] 2> 2438317 INFO (qtp275683838-14445) [n:127.0.0.1:58565_solr c:tlog_replica_test_kill_tlog_replica s:shard1 r:core_node4 x:tlog_replica_test_kill_tlog_replica_shard1_replica_t2] o.a.s.c.S.Request [tlog_replica_test_kill_tlog_replica_shard1_replica_t2] webapp=/solr path=/replication params={generation=2&qt=/replication&file=_0_Asserting_0.dvm&checksum=true&wt=filestream&command=filecontent} status=0 QTime=0
[junit4] 2> 2438317 INFO (qtp275683838-14448) [n:127.0.0.1:58565_solr c:tlog_replica_test_kill_tlog_replica s:shard1 r:core_node4 x:tlog_replica_test_kill_tlog_replica_shard1_replica_t2] o.a.s.c.S.Request [tlog_replica_test_kill_tlog_replica_shard1_replica_t2] webapp=/solr path=/replication params={generation=2&qt=/replication&file=_0.nvm&checksum=true&wt=filestream&command=filecontent} status=0 QTime=0
[junit4] 2> 2438319 INFO (qtp275683838-14445) [n:127.0.0.1:58565_solr c:tlog_replica_test_kill_tlog_replica s:shard1 r:core_node4 x:tlog_replica_test_kill_tlog_replica_shard1_replica_t2] o.a.s.c.S.Request [tlog_replica_test_kill_tlog_replica_shard1_replica_t2] webapp=/solr path=/replication params={generation=2&qt=/replication&file=_0_Direct_0.dvdm&checksum=true&wt=filestream&command=filecontent} status=0 QTime=0
[junit4] 2> 2438320 INFO (qtp275683838-14448) [n:127.0.0.1:58565_solr c:tlog_replica_test_kill_tlog_replica s:shard1 r:core_node4 x:tlog_replica_test_kill_tlog_replica_shard1_replica_t2] o.a.s.c.S.Request [tlog_replica_test_kill_tlog_replica_shard1_replica_t2] webapp=/solr path=/replication params={generation=2&qt=/replication&file=_0_LuceneVarGapDocFreqInterval_0.doc&checksum=true&wt=filestream&command=filecontent} status=0 QTime=0
[junit4] 2> 2438321 INFO (qtp275683838-14445) [n:127.0.0.1:58565_solr c:tlog_replica_test_kill_tlog_replica s:shard1 r:core_node4 x:tlog_replica_test_kill_tlog_replica_shard1_replica_t2] o.a.s.c.S.Request [tlog_replica_test_kill_tlog_replica_shard1_replica_t2] webapp=/solr path=/replication params={generation=2&qt=/replication&file=_0.fnm&checksum=true&wt=filestream&command=filecontent} status=0 QTime=0
[junit4] 2> 2438323 INFO (qtp275683838-14448) [n:127.0.0.1:58565_solr c:tlog_replica_test_kill_tlog_replica s:shard1 r:core_node4 x:tlog_replica_test_kill_tlog_replica_shard1_replica_t2] o.a.s.c.S.Request [tlog_replica_test_kill_tlog_replica_shard1_replica_t2] webapp=/solr path=/replication params={generation=2&qt=/replication&file=segments_2&checksum=true&wt=filestream&command=filecontent} status=0 QTime=0
[junit4] 2> 2438324 INFO (indexFetcher-5503-thread-1) [ ] o.a.s.h.IndexFetcher Bytes downloaded: 3163, Bytes skipped downloading: 0
[junit4] 2> 2438324 INFO (indexFetcher-5503-thread-1) [ ] o.a.s.h.IndexFetcher Total time taken for download (fullCopy=false,bytesDownloaded=3163) : 0 secs (null bytes/sec) to MockDirectoryWrapper(RAMDirectory@52ecd563 lockFactory=org.apache.lucene.store.SingleInstanceLockFactory@405d9399)
[junit4] 2> 2438328 INFO (indexFetcher-5503-thread-1) [ ] o.a.s.u.DefaultSolrCoreState New IndexWriter is ready to be used.
[junit4] 2> 2438328 INFO (indexFetcher-5503-thread-1) [ ] o.a.s.s.SolrIndexSearcher Opening [Searcher@226434ce[tlog_replica_test_kill_tlog_replica_shard1_replica_t1] main]
[junit4] 2> 2438330 INFO (searcherExecutor-5493-thread-1) [ ] o.a.s.c.SolrCore [tlog_replica_test_kill_tlog_replica_shard1_replica_t1] Registered new searcher Searcher@226434ce[tlog_replica_test_kill_tlog_replica_shard1_replica_t1] main{ExitableDirectoryReader(UninvertingDirectoryReader(Uninverting(_0(8.0.0):C1)))}
[junit4] 2> 2438424 INFO (qtp2080385080-14456) [n:127.0.0.1:58566_solr c:tlog_replica_test_kill_tlog_replica s:shard1 r:core_node3 x:tlog_replica_test_kill_tlog_replica_shard1_replica_t1] o.a.s.c.S.Request [tlog_replica_test_kill_tlog_replica_shard1_replica_t1] webapp=/solr path=/select params={q=*:*&wt=javabin&version=2} hits=1 status=0 QTime=0
[junit4] 2> 2438430 INFO (qtp275683838-14448) [n:127.0.0.1:58565_solr c:tlog_replica_test_kill_tlog_replica s:shard1 r:core_node4 x:tlog_replica_test_kill_tlog_replica_shard1_replica_t2] o.a.s.c.S.Request [tlog_replica_test_kill_tlog_replica_shard1_replica_t2] webapp=/solr path=/select params={q=*:*&wt=javabin&version=2} hits=1 status=0 QTime=0
[junit4] 2> 2438431 INFO (TEST-TestTlogReplica.testKillTlogReplica-seed#[EEDE29EE60EA9EE6]) [ ] o.a.s.c.ChaosMonkey monkey: kill jetty! 58566
[junit4] 2> 2438432 INFO (TEST-TestTlogReplica.testKillTlogReplica-seed#[EEDE29EE60EA9EE6]) [ ] o.e.j.s.AbstractConnector Stopped ServerConnector@6a53c018{SSL,[ssl, http/1.1]}{127.0.0.1:0}
[junit4] 2> 2438432 INFO (TEST-TestTlogReplica.testKillTlogReplica-seed#[EEDE29EE60EA9EE6]) [ ] o.a.s.c.CoreContainer Shutting down CoreContainer instance=937088860
[junit4] 2> 2438432 INFO (TEST-TestTlogReplica.testKillTlogReplica-seed#[EEDE29EE60EA9EE6]) [ ] o.a.s.m.SolrMetricManager Closing metric reporters for registry=solr.node, tag=null
[junit4] 2> 2438432 INFO (TEST-TestTlogReplica.testKillTlogReplica-seed#[EEDE29EE60EA9EE6]) [ ] o.a.s.m.r.SolrJmxReporter Closing reporter [org.apache.solr.metrics.reporters.SolrJmxReporter@1c52a165: rootName = solr_58566, domain = solr.node, service url = null, agent id = null] for registry solr.node / com.codahale.metrics.MetricRegistry@2b60a422
[junit4] 2> 2438445 INFO (TEST-TestTlogReplica.testKillTlogReplica-seed#[EEDE29EE60EA9EE6]) [ ] o.a.s.m.SolrMetricManager Closing metric reporters for registry=solr.jvm, tag=null
[junit4] 2> 2438445 INFO (TEST-TestTlogReplica.testKillTlogReplica-seed#[EEDE29EE60EA9EE6]) [ ] o.a.s.m.r.SolrJmxReporter Closing reporter [org.apache.solr.metrics.reporters.SolrJmxReporter@5664c7e5: rootName = solr_58566, domain = solr.jvm, service url = null, agent id = null] for registry solr.jvm / com.codahale.metrics.MetricRegistry@12770a06
[junit4] 2> 2438450 INFO (TEST-TestTlogReplica.testKillTlogReplica-seed#[EEDE29EE60EA9EE6]) [ ] o.a.s.m.SolrMetricManager Closing metric reporters for registry=solr.jetty, tag=null
[junit4] 2> 2438450 INFO (TEST-TestTlogReplica.testKillTlogReplica-seed#[EEDE29EE60EA9EE6]) [ ] o.a.s.m.r.SolrJmxReporter Closing reporter [org.apache.solr.metrics.reporters.SolrJmxReporter@5ad7f751: rootName = solr_58566, domain = solr.jetty, service url = null, agent id = null] for registry solr.jetty / com.codahale.metrics.MetricRegistry@2ef872c3
[junit4] 2> 2438452 INFO (TEST-TestTlogReplica.testKillTlogReplica-seed#[EEDE29EE60EA9EE6]) [ ] o.a.s.c.ZkController Remove node as live in ZooKeeper:/live_nodes/127.0.0.1:58566_solr
[junit4] 2> 2438453 DEBUG (OverseerStateUpdate-72110765190283268-127.0.0.1:58566_solr-n_0000000000) [n:127.0.0.1:58566_solr ] o.a.s.c.Overseer processMessage: queueSize: 1, message = {
[junit4] 2> "operation":"downnode",
[junit4] 2> "node_name":"127.0.0.1:58566_solr"} current state version: 0
[junit4] 2> 2438454 INFO (TEST-TestTlogReplica.testKillTlogReplica-seed#[EEDE29EE60EA9EE6]) [ ] o.a.s.m.SolrMetricManager Closing metric reporters for registry=solr.cluster, tag=null
[junit4] 2> 2438455 INFO (zkCallback-5325-thread-1) [ ] o.a.s.c.c.ZkStateReader Updated live nodes from ZooKeeper... (2) -> (1)
[junit4] 2> 2438455 INFO (zkCallback-5332-thread-1) [ ] o.a.s.c.c.ZkStateReader Updated live nodes from ZooKeeper... (2) -> (1)
[junit4] 2> 2438455 INFO (zkCallback-5347-thread-1) [ ] o.a.s.c.c.Zk
[...truncated too long message...]
live in ZooKeeper:/live_nodes/127.0.0.1:52260_solr
[junit4] 2> 305156 INFO (jetty-closer-266-thread-1) [ ] o.a.s.c.ZkController Remove node as live in ZooKeeper:/live_nodes/127.0.0.1:52259_solr
[junit4] 2> 305157 INFO (jetty-closer-266-thread-2) [ ] o.a.s.m.SolrMetricManager Closing metric reporters for registry=solr.cluster, tag=null
[junit4] 2> 305158 INFO (jetty-closer-266-thread-1) [ ] o.a.s.m.SolrMetricManager Closing metric reporters for registry=solr.cluster, tag=null
[junit4] 2> 305158 INFO (zkCallback-349-thread-3) [ ] o.a.s.c.c.ZkStateReader Updated live nodes from ZooKeeper... (2) -> (0)
[junit4] 2> 305158 INFO (zkCallback-356-thread-1) [ ] o.a.s.c.c.ZkStateReader Updated live nodes from ZooKeeper... (2) -> (0)
[junit4] 2> 305158 INFO (zkCallback-386-thread-2) [ ] o.a.s.c.c.ZkStateReader Updated live nodes from ZooKeeper... (2) -> (0)
[junit4] 2> 305158 INFO (zkCallback-393-thread-1) [ ] o.a.s.c.c.ZkStateReader Updated live nodes from ZooKeeper... (2) -> (0)
[junit4] 2> 305160 INFO (jetty-closer-266-thread-2) [ ] o.a.s.c.Overseer Overseer (id=72110952123465749-127.0.0.1:52260_solr-n_0000000004) closing
[junit4] 2> 305162 INFO (OverseerStateUpdate-72110952123465749-127.0.0.1:52260_solr-n_0000000004) [n:127.0.0.1:52260_solr ] o.a.s.c.Overseer Overseer Loop exiting : 127.0.0.1:52260_solr
[junit4] 2> 305162 WARN (OverseerAutoScalingTriggerThread-72110952123465749-127.0.0.1:52260_solr-n_0000000004) [ ] o.a.s.c.a.OverseerTriggerThread OverseerTriggerThread woken up but we are closed, exiting.
[junit4] 2> 305167 INFO (jetty-closer-266-thread-1) [ ] o.e.j.s.h.ContextHandler Stopped o.e.j.s.ServletContextHandler@44177d19{/solr,null,UNAVAILABLE}
[junit4] 2> 305167 INFO (jetty-closer-266-thread-1) [ ] o.e.j.s.session node0 Stopped scavenging
[junit4] 2> 305169 INFO (jetty-closer-266-thread-2) [ ] o.e.j.s.h.ContextHandler Stopped o.e.j.s.ServletContextHandler@44ae3252{/solr,null,UNAVAILABLE}
[junit4] 2> 305169 INFO (jetty-closer-266-thread-2) [ ] o.e.j.s.session node0 Stopped scavenging
[junit4] 2> 305170 ERROR (SUITE-TestTlogReplica-seed#[EEDE29EE60EA9EE6]-worker) [ ] o.a.z.s.ZooKeeperServer ZKShutdownHandler is not registered, so ZooKeeper server won't take any action on ERROR or SHUTDOWN server state changes
[junit4] 2> 305170 INFO (SUITE-TestTlogReplica-seed#[EEDE29EE60EA9EE6]-worker) [ ] o.a.s.c.ZkTestServer connecting to 127.0.0.1:52257 52257
[junit4] 2> 305206 INFO (Thread-155) [ ] o.a.s.c.ZkTestServer connecting to 127.0.0.1:52257 52257
[junit4] 2> 305335 WARN (Thread-155) [ ] o.a.s.c.ZkTestServer Watch limit violations:
[junit4] 2> Maximum concurrent create/delete watches above limit:
[junit4] 2>
[junit4] 2> 30 /solr/configs/conf
[junit4] 2> 28 /solr/collections/tlog_replica_test_create_delete/terms/shard1
[junit4] 2> 27 /solr/collections/tlog_replica_test_create_delete/terms/shard2
[junit4] 2> 19 /solr/collections/tlog_replica_test_remove_leader/terms/shard1
[junit4] 2> 18 /solr/collections/tlog_replica_test_recovery/terms/shard1
[junit4] 2> 16 /solr/collections/tlog_replica_test_kill_leader/terms/shard1
[junit4] 2> 16 /solr/collections/tlog_replica_test_kill_tlog_replica/terms/shard1
[junit4] 2> 15 /solr/aliases.json
[junit4] 2> 15 /solr/collections/tlog_replica_test_basic_leader_election/terms/shard1
[junit4] 2> 10 /solr/collections/tlog_replica_test_out_of_order_db_qwith_in_place_updates/terms/shard1
[junit4] 2> 10 /solr/collections/tlog_replica_test_delete_by_id/terms/shard1
[junit4] 2> 10 /solr/collections/tlog_replica_test_only_leader_indexes/terms/shard1
[junit4] 2> 7 /solr/security.json
[junit4] 2> 6 /solr/collections/tlog_replica_test_add_remove_tlog_replica/terms/shard2
[junit4] 2> 5 /solr/collections/tlog_replica_test_add_remove_tlog_replica/terms/shard1
[junit4] 2> 4 /solr/collections/tlog_replica_test_add_docs/terms/shard1
[junit4] 2> 3 /solr/collections/tlog_replica_test_real_time_get/terms/shard1
[junit4] 2>
[junit4] 2> Maximum concurrent data watches above limit:
[junit4] 2>
[junit4] 2> 21 /solr/collections/tlog_replica_test_create_delete/state.json
[junit4] 2> 15 /solr/clusterprops.json
[junit4] 2> 15 /solr/clusterstate.json
[junit4] 2> 13 /solr/collections/tlog_replica_test_out_of_order_db_qwith_in_place_updates/state.json
[junit4] 2> 10 /solr/collections/tlog_replica_test_remove_leader/state.json
[junit4] 2> 8 /solr/collections/tlog_replica_test_kill_leader/state.json
[junit4] 2> 8 /solr/collections/tlog_replica_test_recovery/state.json
[junit4] 2> 8 /solr/collections/tlog_replica_test_basic_leader_election/state.json
[junit4] 2> 8 /solr/collections/tlog_replica_test_kill_tlog_replica/state.json
[junit4] 2> 3 /solr/autoscaling.json
[junit4] 2> 3 /solr/collections/tlog_replica_test_create_delete/leader_elect/shard2/election/72110952123465734-core_node13-n_0000000001
[junit4] 2> 3 /solr/overseer_elect/election/72110952123465734-127.0.0.1:52260_solr-n_0000000000
[junit4] 2> 3 /solr/collections/tlog_replica_test_add_remove_tlog_replica/state.json
[junit4] 2> 3 /solr/collections/tlog_replica_test_only_leader_indexes/state.json
[junit4] 2> 3 /solr/collections/tlog_replica_test_delete_by_id/state.json
[junit4] 2> 2 /solr/collections/tlog_replica_test_kill_tlog_replica/leader_elect/shard1/election/72110952123465734-core_node4-n_0000000000
[junit4] 2> 2 /solr/collections/tlog_replica_test_add_docs/state.json
[junit4] 2> 2 /solr/collections/tlog_replica_test_create_delete/leader_elect/shard2/election/72110952123465734-core_node15-n_0000000000
[junit4] 2> 2 /solr/collections/tlog_replica_test_recovery/leader_elect/shard1/election/72110952123465749-core_node4-n_0000000000
[junit4] 2> 2 /solr/overseer_elect/election/72110952123465749-127.0.0.1:52260_solr-n_0000000004
[junit4] 2> 2 /solr/collections/tlog_replica_test_create_delete/leader_elect/shard1/election/72110952123465741-core_node9-n_0000000001
[junit4] 2> 2 /solr/collections/tlog_replica_test_real_time_get/state.json
[junit4] 2>
[junit4] 2> Maximum concurrent children watches above limit:
[junit4] 2>
[junit4] 2> 15 /solr/live_nodes
[junit4] 2> 15 /solr/collections
[junit4] 2> 3 /solr/overseer/queue
[junit4] 2> 3 /solr/autoscaling/events/.scheduled_maintenance
[junit4] 2> 3 /solr/autoscaling/events/.auto_add_replicas
[junit4] 2> 3 /solr/overseer/collection-queue-work
[junit4] 2> 3 /solr/overseer/queue-work
[junit4] 2>
[junit4] 2> NOTE: leaving temporary files on disk at: /Users/jenkins/workspace/Lucene-Solr-master-MacOSX/solr/build/solr-core/test/J0/temp/solr.cloud.TestTlogReplica_EEDE29EE60EA9EE6-003
[junit4] 2> Nov 14, 2018 5:44:25 PM com.carrotsearch.randomizedtesting.ThreadLeakControl checkThreadLeaks
[junit4] 2> WARNING: Will linger awaiting termination of 1 leaked thread(s).
[junit4] 2> NOTE: test params are: codec=Asserting(Lucene80): {foo=PostingsFormat(name=LuceneVarGapDocFreqInterval), title_s=Lucene50(blocksize=128), id=BlockTreeOrds(blocksize=128), foo_s=PostingsFormat(name=LuceneVarGapDocFreqInterval)}, docValues:{_version_=DocValuesFormat(name=Asserting), id=DocValuesFormat(name=Direct), inplace_updatable_int=DocValuesFormat(name=Lucene70)}, maxPointsInLeafNode=1750, maxMBSortInHeap=5.684528722669064, sim=Asserting(org.apache.lucene.search.similarities.AssertingSimilarity@7f5199ae), locale=fr-DJ, timezone=America/Denver
[junit4] 2> NOTE: Mac OS X 10.11.6 x86_64/Oracle Corporation 9 (64-bit)/cpus=3,threads=1,free=45714168,total=242020352
[junit4] 2> NOTE: All tests run in this JVM: [TestTlogReplica, TestTlogReplica, TestTlogReplica]
[junit4] Completed [5/5 (5!)] on J0 in 93.40s, 13 tests, 1 failure <<< FAILURES!
[...truncated 14 lines...]
BUILD FAILED
/Users/jenkins/workspace/Lucene-Solr-master-MacOSX/lucene/common-build.xml:1567: The following error occurred while executing this line:
/Users/jenkins/workspace/Lucene-Solr-master-MacOSX/lucene/common-build.xml:1092: There were test failures: 5 suites, 65 tests, 5 failures [seed: EEDE29EE60EA9EE6]
Total time: 5 minutes 9 seconds
[repro] Setting last failure code to 256
[repro] Failures:
[repro] 5/5 failed: org.apache.solr.cloud.TestTlogReplica
[repro] Exiting with code 256
+ mv lucene/build lucene/build.repro
+ mv solr/build solr/build.repro
+ mv lucene/build.orig lucene/build
+ mv solr/build.orig solr/build
Archiving artifacts
Setting ANT_1_8_2_HOME=/Users/jenkins/tools/hudson.tasks.Ant_AntInstallation/ANT_1.8.2
[WARNINGS] Parsing warnings in console log with parser Java Compiler (javac)
Setting ANT_1_8_2_HOME=/Users/jenkins/tools/hudson.tasks.Ant_AntInstallation/ANT_1.8.2
Setting ANT_1_8_2_HOME=/Users/jenkins/tools/hudson.tasks.Ant_AntInstallation/ANT_1.8.2
<Git Blamer> Using GitBlamer to create author and commit information for all warnings.
<Git Blamer> GIT_COMMIT=95d01c6583b825b6b87591e4f27002c285ea25fb, workspace=/Users/jenkins/workspace/Lucene-Solr-master-MacOSX
[WARNINGS] Computing warning deltas based on reference build #4924
Recording test results
Setting ANT_1_8_2_HOME=/Users/jenkins/tools/hudson.tasks.Ant_AntInstallation/ANT_1.8.2
Build step 'Publish JUnit test result report' changed build result to UNSTABLE
Email was triggered for: Unstable (Test Failures)
Sending email for trigger: Unstable (Test Failures)
Setting ANT_1_8_2_HOME=/Users/jenkins/tools/hudson.tasks.Ant_AntInstallation/ANT_1.8.2
Setting ANT_1_8_2_HOME=/Users/jenkins/tools/hudson.tasks.Ant_AntInstallation/ANT_1.8.2
Setting ANT_1_8_2_HOME=/Users/jenkins/tools/hudson.tasks.Ant_AntInstallation/ANT_1.8.2
Setting ANT_1_8_2_HOME=/Users/jenkins/tools/hudson.tasks.Ant_AntInstallation/ANT_1.8.2