You are viewing a plain text version of this content. The canonical link for it is here.
Posted to notifications@qpid.apache.org by Apache Jenkins Server <je...@builds.apache.org> on 2018/04/13 05:14:20 UTC
Build failed in Jenkins: Qpid-Broker-J-TestMatrix » ubuntu,JDK 1.8 (latest),java-bdb.0-10 #4194
See <https://builds.apache.org/job/Qpid-Broker-J-TestMatrix/Ubuntu%20Slaves=ubuntu,jdk=JDK%201.8%20(latest),profile=java-bdb.0-10/4194/display/redirect?page=changes>
Changes:
[orudyy] QPID-8158: [Broker-J] [System Tests] Skip running non-protocol
[orudyy] QPID-8158: [Broker-J] [System Tests] Initialize group members before
[orudyy] QPID-8158: [Broker-J] [System Tests] Run protocol tests as part of unit
------------------------------------------
[...truncated 407.65 KB...]
[INFO] Copying 3 resources
[INFO]
[INFO] --- maven-compiler-plugin:3.5.1:compile (default-compile) @ qpid-tck ---
[INFO] Compiling 1 source file to <https://builds.apache.org/job/Qpid-Broker-J-TestMatrix/Ubuntu%20Slaves=ubuntu,jdk=JDK%201.8%20(latest),profile=java-bdb.0-10/ws/tck/target/classes>
[INFO] <https://builds.apache.org/job/Qpid-Broker-J-TestMatrix/Ubuntu%20Slaves=ubuntu,jdk=JDK%201.8%20(latest),profile=java-bdb.0-10/ws/tck/src/main/java/org/apache/qpid/tck/ManageQpidJMSResources.java>: <https://builds.apache.org/job/Qpid-Broker-J-TestMatrix/Ubuntu%20Slaves=ubuntu,jdk=JDK%201.8%20(latest),profile=java-bdb.0-10/ws/tck/src/main/java/org/apache/qpid/tck/ManageQpidJMSResources.java> uses unchecked or unsafe operations.
[INFO] <https://builds.apache.org/job/Qpid-Broker-J-TestMatrix/Ubuntu%20Slaves=ubuntu,jdk=JDK%201.8%20(latest),profile=java-bdb.0-10/ws/tck/src/main/java/org/apache/qpid/tck/ManageQpidJMSResources.java>: Recompile with -Xlint:unchecked for details.
[INFO]
[INFO] --- maven-resources-plugin:2.7:testResources (default-testResources) @ qpid-tck ---
[INFO] Using 'UTF-8' encoding to copy filtered resources.
[INFO] Copying 5 resources
[INFO] Copying 3 resources
[INFO]
[INFO] --- maven-compiler-plugin:3.5.1:testCompile (default-testCompile) @ qpid-tck ---
[INFO] No sources to compile
[INFO]
[INFO] --- maven-surefire-plugin:2.19.1:test (default-test) @ qpid-tck ---
[INFO] Tests are skipped.
[INFO]
[INFO] --- maven-jar-plugin:3.0.0:jar (default-jar) @ qpid-tck ---
[INFO] Building jar: <https://builds.apache.org/job/Qpid-Broker-J-TestMatrix/Ubuntu%20Slaves=ubuntu,jdk=JDK%201.8%20(latest),profile=java-bdb.0-10/ws/tck/target/qpid-tck-7.1.0-SNAPSHOT.jar>
[INFO]
[INFO] --- maven-site-plugin:3.5.1:attach-descriptor (attach-descriptor) @ qpid-tck ---
[INFO]
[INFO] ------------------------------------------------------------------------
[INFO] Building Apache Qpid Broker-J Docbook 7.1.0-SNAPSHOT
[INFO] ------------------------------------------------------------------------
[INFO]
[INFO] --- maven-clean-plugin:3.0.0:clean (default-clean) @ qpid-java-doc ---
[INFO]
[INFO] --- maven-antrun-plugin:1.8:run (output-test-properties) @ qpid-java-doc ---
[INFO] Executing tasks
main:
[echo] Qpid Test Profile Properties
[echo] [profile] java-bdb.0-10
[echo] [profile.broker.version] 0-10
[echo] [profile.virtualhostnode.type] BDB
[echo] [profile.virtualhostnode.context.blueprint] {"type":"ProvidedStore","globalAddressDomains":"${qpid.globalAddressDomains}"}
[echo] [profile.test_receive_timeout] 3000
[INFO] Executed tasks
[INFO]
[INFO] --- maven-enforcer-plugin:1.4.1:enforce (enforce-minimum-versions) @ qpid-java-doc ---
[INFO]
[INFO] --- maven-enforcer-plugin:1.4.1:enforce (enforce-versions-standard-properties) @ qpid-java-doc ---
[INFO]
[INFO] --- maven-enforcer-plugin:1.4.1:enforce (enforce-enableAmqp0x) @ qpid-java-doc ---
[INFO]
[INFO] --- jacoco-maven-plugin:0.7.5.201505241946:prepare-agent (default-prepare-agent) @ qpid-java-doc ---
[INFO] argLine set to "-javaagent:/home/jenkins/.m2/repository/org/jacoco/org.jacoco.agent/0.7.5.201505241946/org.jacoco.agent-0.7.5.201505241946-runtime.jar=destfile=<https://builds.apache.org/job/Qpid-Broker-J-TestMatrix/Ubuntu%20Slaves=ubuntu,jdk=JDK%201.8%20(latest),profile=java-bdb.0-10/ws/doc/target/jacoco.exec"> -Xmx512m
[INFO]
[INFO] --- maven-remote-resources-plugin:1.5:process (process-resource-bundles) @ qpid-java-doc ---
[INFO]
[INFO] --- maven-site-plugin:3.5.1:attach-descriptor (attach-descriptor) @ qpid-java-doc ---
[INFO]
[INFO] --- maven-assembly-plugin:2.6:single (default) @ qpid-java-doc ---
[INFO] Assemblies have been skipped per configuration of the skipAssembly parameter.
[INFO]
[INFO] ------------------------------------------------------------------------
[INFO] Building Apache Qpid Broker-J Docbook 7.1.0-SNAPSHOT
[INFO] ------------------------------------------------------------------------
[INFO]
[INFO] --- maven-clean-plugin:3.0.0:clean (default-clean) @ qpid-java-doc-broker ---
[INFO]
[INFO] --- maven-antrun-plugin:1.8:run (output-test-properties) @ qpid-java-doc-broker ---
[INFO] Executing tasks
main:
[echo] Qpid Test Profile Properties
[echo] [profile] java-bdb.0-10
[echo] [profile.broker.version] 0-10
[echo] [profile.virtualhostnode.type] BDB
[echo] [profile.virtualhostnode.context.blueprint] {"type":"ProvidedStore","globalAddressDomains":"${qpid.globalAddressDomains}"}
[echo] [profile.test_receive_timeout] 3000
[INFO] Executed tasks
[INFO]
[INFO] --- maven-enforcer-plugin:1.4.1:enforce (enforce-minimum-versions) @ qpid-java-doc-broker ---
[INFO]
[INFO] --- maven-enforcer-plugin:1.4.1:enforce (enforce-versions-standard-properties) @ qpid-java-doc-broker ---
[INFO]
[INFO] --- maven-enforcer-plugin:1.4.1:enforce (enforce-enableAmqp0x) @ qpid-java-doc-broker ---
[INFO]
[INFO] --- jacoco-maven-plugin:0.7.5.201505241946:prepare-agent (default-prepare-agent) @ qpid-java-doc-broker ---
[INFO] argLine set to "-javaagent:/home/jenkins/.m2/repository/org/jacoco/org.jacoco.agent/0.7.5.201505241946/org.jacoco.agent-0.7.5.201505241946-runtime.jar=destfile=<https://builds.apache.org/job/Qpid-Broker-J-TestMatrix/Ubuntu%20Slaves=ubuntu,jdk=JDK%201.8%20(latest),profile=java-bdb.0-10/ws/doc/java-broker/target/jacoco.exec"> -Xmx512m
[INFO]
[INFO] --- maven-resources-plugin:2.7:copy-resources (filter-docbook-sources) @ qpid-java-doc-broker ---
[INFO] Using 'UTF-8' encoding to copy filtered resources.
[INFO] Copying 76 resources
[INFO]
[INFO] --- maven-remote-resources-plugin:1.5:process (process-resource-bundles) @ qpid-java-doc-broker ---
[INFO]
[INFO] --- maven-resources-plugin:2.7:resources (default-resources) @ qpid-java-doc-broker ---
[INFO] Using 'UTF-8' encoding to copy filtered resources.
[INFO] Copying 76 resources
[INFO]
[INFO] --- maven-compiler-plugin:3.5.1:compile (default-compile) @ qpid-java-doc-broker ---
[INFO] No sources to compile
[INFO]
[INFO] --- maven-resources-plugin:2.7:testResources (default-testResources) @ qpid-java-doc-broker ---
[INFO] Using 'UTF-8' encoding to copy filtered resources.
[INFO] Copying 76 resources
[INFO]
[INFO] --- maven-compiler-plugin:3.5.1:testCompile (default-testCompile) @ qpid-java-doc-broker ---
[INFO] No sources to compile
[INFO]
[INFO] --- maven-surefire-plugin:2.19.1:test (default-test) @ qpid-java-doc-broker ---
[INFO] Tests are skipped.
[INFO]
[INFO] --- maven-jar-plugin:3.0.0:jar (default-jar) @ qpid-java-doc-broker ---
[WARNING] JAR will be empty - no content was marked for inclusion!
[INFO] Building jar: <https://builds.apache.org/job/Qpid-Broker-J-TestMatrix/Ubuntu%20Slaves=ubuntu,jdk=JDK%201.8%20(latest),profile=java-bdb.0-10/ws/doc/java-broker/target/qpid-java-doc-broker-7.1.0-SNAPSHOT.jar>
[INFO]
[INFO] --- maven-site-plugin:3.5.1:attach-descriptor (attach-descriptor) @ qpid-java-doc-broker ---
[INFO]
[INFO] --- maven-assembly-plugin:2.6:single (default) @ qpid-java-doc-broker ---
[INFO] Assemblies have been skipped per configuration of the skipAssembly parameter.
[INFO]
[INFO] ------------------------------------------------------------------------
[INFO] Building Apache Qpid Broker-J Performance Test Docbook 7.1.0-SNAPSHOT
[INFO] ------------------------------------------------------------------------
[INFO]
[INFO] --- maven-clean-plugin:3.0.0:clean (default-clean) @ qpid-java-doc-perftests ---
[INFO]
[INFO] --- maven-antrun-plugin:1.8:run (output-test-properties) @ qpid-java-doc-perftests ---
[INFO] Executing tasks
main:
[echo] Qpid Test Profile Properties
[echo] [profile] java-bdb.0-10
[echo] [profile.broker.version] 0-10
[echo] [profile.virtualhostnode.type] BDB
[echo] [profile.virtualhostnode.context.blueprint] {"type":"ProvidedStore","globalAddressDomains":"${qpid.globalAddressDomains}"}
[echo] [profile.test_receive_timeout] 3000
[INFO] Executed tasks
[INFO]
[INFO] --- maven-enforcer-plugin:1.4.1:enforce (enforce-minimum-versions) @ qpid-java-doc-perftests ---
[INFO]
[INFO] --- maven-enforcer-plugin:1.4.1:enforce (enforce-versions-standard-properties) @ qpid-java-doc-perftests ---
[INFO]
[INFO] --- maven-enforcer-plugin:1.4.1:enforce (enforce-enableAmqp0x) @ qpid-java-doc-perftests ---
[INFO]
[INFO] --- jacoco-maven-plugin:0.7.5.201505241946:prepare-agent (default-prepare-agent) @ qpid-java-doc-perftests ---
[INFO] argLine set to "-javaagent:/home/jenkins/.m2/repository/org/jacoco/org.jacoco.agent/0.7.5.201505241946/org.jacoco.agent-0.7.5.201505241946-runtime.jar=destfile=<https://builds.apache.org/job/Qpid-Broker-J-TestMatrix/Ubuntu%20Slaves=ubuntu,jdk=JDK%201.8%20(latest),profile=java-bdb.0-10/ws/doc/java-perftests/target/jacoco.exec"> -Xmx512m
[INFO]
[INFO] --- maven-resources-plugin:2.7:copy-resources (filter-docbook-sources) @ qpid-java-doc-perftests ---
[INFO] Using 'UTF-8' encoding to copy filtered resources.
[INFO] Copying 1 resource
[INFO]
[INFO] --- maven-remote-resources-plugin:1.5:process (process-resource-bundles) @ qpid-java-doc-perftests ---
[INFO]
[INFO] --- maven-resources-plugin:2.7:resources (default-resources) @ qpid-java-doc-perftests ---
[INFO] Using 'UTF-8' encoding to copy filtered resources.
[INFO] Copying 1 resource
[INFO]
[INFO] --- maven-compiler-plugin:3.5.1:compile (default-compile) @ qpid-java-doc-perftests ---
[INFO] No sources to compile
[INFO]
[INFO] --- maven-resources-plugin:2.7:testResources (default-testResources) @ qpid-java-doc-perftests ---
[INFO] Using 'UTF-8' encoding to copy filtered resources.
[INFO] Copying 1 resource
[INFO]
[INFO] --- maven-compiler-plugin:3.5.1:testCompile (default-testCompile) @ qpid-java-doc-perftests ---
[INFO] No sources to compile
[INFO]
[INFO] --- maven-surefire-plugin:2.19.1:test (default-test) @ qpid-java-doc-perftests ---
[INFO] Tests are skipped.
[INFO]
[INFO] --- maven-jar-plugin:3.0.0:jar (default-jar) @ qpid-java-doc-perftests ---
[WARNING] JAR will be empty - no content was marked for inclusion!
[INFO] Building jar: <https://builds.apache.org/job/Qpid-Broker-J-TestMatrix/Ubuntu%20Slaves=ubuntu,jdk=JDK%201.8%20(latest),profile=java-bdb.0-10/ws/doc/java-perftests/target/qpid-java-doc-perftests-7.1.0-SNAPSHOT.jar>
[INFO]
[INFO] --- maven-site-plugin:3.5.1:attach-descriptor (attach-descriptor) @ qpid-java-doc-perftests ---
[INFO]
[INFO] --- maven-assembly-plugin:2.6:single (default) @ qpid-java-doc-perftests ---
[INFO] Assemblies have been skipped per configuration of the skipAssembly parameter.
[INFO] ------------------------------------------------------------------------
[INFO] Reactor Summary:
[INFO]
[INFO] Apache Qpid Broker-J Parent ........................ SUCCESS [ 2.061 s]
[INFO] Apache Qpid Broker-J Code Generation ............... SUCCESS [ 1.815 s]
[INFO] Apache Qpid Broker-J Test Utilities ................ SUCCESS [ 0.567 s]
[INFO] Apache Qpid Broker-J Core .......................... SUCCESS [ 13.041 s]
[INFO] Apache Qpid Broker-J LogBack Logging Plug-in ....... SUCCESS [ 1.238 s]
[INFO] Apache Qpid Broker-J Access Control Plug-in ........ SUCCESS [ 0.720 s]
[INFO] Apache Qpid Broker-J AMQP 0-10 Protocol Plug-in .... SUCCESS [ 1.382 s]
[INFO] Apache Qpid Broker-J AMQP 0-8 Protocol Plug-in ..... SUCCESS [ 1.124 s]
[INFO] Apache Qpid Broker-J AMQP 1-0 Protocol Plug-in ..... SUCCESS [ 2.144 s]
[INFO] Apache Qpid Broker-J AMQP 0-8 to 0-10 Message Conversion Plug-in SUCCESS [ 0.301 s]
[INFO] Apache Qpid Broker-J AMQP 0-8 to 1-0 Message Conversion Plug-in SUCCESS [ 0.538 s]
[INFO] Apache Qpid Broker-J AMQP 0-10 to 1-0 Message Conversion Plug-in SUCCESS [ 0.389 s]
[INFO] Apache Qpid Broker-J JDBC Message Store Plug-in .... SUCCESS [ 0.751 s]
[INFO] Apache Qpid Broker-J Derby Message Store Plug-in ... SUCCESS [ 0.595 s]
[INFO] Apache Qpid Broker-J JDBC Message Store Connection Pooling Plug-in SUCCESS [ 0.330 s]
[INFO] Apache Qpid AMQP 1.0 JDBC Link Store Plug-in ....... SUCCESS [ 0.402 s]
[INFO] Apache Qpid Broker-J HTTP Management Plug-in ....... SUCCESS [ 1.517 s]
[INFO] Apache Qpid Broker-J AMQP Management Protocol Plug-in SUCCESS [ 0.330 s]
[INFO] Apache Qpid Broker-J Memory Message Store Plug-in .. SUCCESS [ 0.330 s]
[INFO] Apache Qpid Broker-J WebSocket Plug-in ............. SUCCESS [ 0.415 s]
[INFO] Apache Qpid Broker-J BDB Message Store Plug-in ..... SUCCESS [ 1.533 s]
[INFO] Apache Qpid AMQP 1.0 BDB Link Store Plug-in ........ SUCCESS [ 0.364 s]
[INFO] Apache Qpid Broker-J ............................... SUCCESS [ 0.868 s]
[INFO] Apache Qpid Broker-J Bundles ....................... SUCCESS [ 4.703 s]
[INFO] Apache Qpid Broker-J Tools ......................... SUCCESS [ 0.249 s]
[INFO] Apache Qpid Broker-J System Test Parent ............ SUCCESS [ 0.061 s]
[INFO] Apache Qpid Broker-J System Test Utils ............. SUCCESS [ 0.382 s]
[INFO] Apache Qpid Broker-J JMS System Tests Core ......... SUCCESS [ 0.585 s]
[INFO] Apache Qpid Broker-J JMS 1.1 System Tests .......... SUCCESS [ 1.470 s]
[INFO] Apache Qpid Broker-J JMS 2.0 System Tests .......... SUCCESS [ 0.981 s]
[INFO] Apache Qpid Broker-J HTTP system tests ............. SUCCESS [ 1.129 s]
[INFO] Apache Qpid Broker-J Protocol Tests Core ........... SUCCESS [ 0.291 s]
[INFO] Apache Qpid Protocol Tests for AMQP 0-8,0-9,0-9-1 .. SUCCESS [ 1.016 s]
[INFO] Apache Qpid Protocol Tests for AMQP 0-10 ........... SUCCESS [ 0.736 s]
[INFO] Apache Qpid Protocol Tests for AMQP 1.0 ............ SUCCESS [ 1.796 s]
[INFO] Apache Qpid Broker-J System Tests Spawn Broker Admin SUCCESS [ 1.036 s]
[INFO] Apache Qpid Broker-J End to End Conversion Tests ... SUCCESS [ 1.433 s]
[INFO] Apache Qpid Broker-J Performance Tests ............. SUCCESS [ 1.358 s]
[INFO] Apache Qpid Broker-J Performance Test System Tests . SUCCESS [ 0.329 s]
[INFO] Apache Qpid Broker-J Performance Tests Visualisation JFC SUCCESS [ 1.227 s]
[INFO] Apache Qpid Broker-J BDB Store System Tests ........ SUCCESS [ 0.490 s]
[INFO] Apache Qpid Joram JMS Tests ........................ SUCCESS [ 0.203 s]
[INFO] Apache Qpid Broker-J JMS TCK Configuration ......... SUCCESS [ 0.170 s]
[INFO] Apache Qpid Broker-J Docbook ....................... SUCCESS [ 0.047 s]
[INFO] Apache Qpid Broker-J Docbook ....................... SUCCESS [ 0.368 s]
[INFO] Apache Qpid Broker-J Performance Test Docbook ...... SUCCESS [ 0.058 s]
[INFO] ------------------------------------------------------------------------
[INFO] BUILD SUCCESS
[INFO] ------------------------------------------------------------------------
[INFO] Total time: 53.623 s
[INFO] Finished at: 2018-04-13T05:14:16Z
[INFO] Final Memory: 164M/4832M
[INFO] ------------------------------------------------------------------------
Archiving artifacts
ERROR: No artifacts found that match the file pattern "**/target/surefire-reports/**". Configuration error?
ERROR: java.lang.InterruptedException: no matches found within 10000
Build step 'Archive the artifacts' changed build result to FAILURE
Performing Post build task...
Match found for : : True
Logical operation result is TRUE
Running script : echo Finishing build
date
[java-bdb.0-10] $ /bin/bash -xe /tmp/jenkins1900276228514677617.sh
+ echo Finishing build
Finishing build
+ date
Fri Apr 13 05:14:18 UTC 2018
POST BUILD TASK : SUCCESS
END OF POST BUILD TASK : 0
Recording test results
ERROR: Step ?Publish JUnit test result report? failed: No test report files were found. Configuration error?
Jenkins build is back to normal : Qpid-Broker-J-TestMatrix » ubuntu,JDK 1.8 (latest),java-bdb.0-10 #4196
Posted by Apache Jenkins Server <je...@builds.apache.org>.
See <https://builds.apache.org/job/Qpid-Broker-J-TestMatrix/Ubuntu%20Slaves=ubuntu,jdk=JDK%201.8%20(latest),profile=java-bdb.0-10/4196/display/redirect?page=changes>
Build failed in Jenkins: Qpid-Broker-J-TestMatrix » ubuntu,JDK 1.8 (latest),java-bdb.0-10 #4195
Posted by Apache Jenkins Server <je...@builds.apache.org>.
See <https://builds.apache.org/job/Qpid-Broker-J-TestMatrix/Ubuntu%20Slaves=ubuntu,jdk=JDK%201.8%20(latest),profile=java-bdb.0-10/4195/display/redirect?page=changes>
Changes:
[kwall] QPID-8163: [Access Control Plugin] Support OWNER psuedo principal in ACL
------------------------------------------
[...truncated 406.96 KB...]
[INFO] Copying 3 resources
[INFO]
[INFO] --- maven-compiler-plugin:3.5.1:compile (default-compile) @ qpid-tck ---
[INFO] Compiling 1 source file to <https://builds.apache.org/job/Qpid-Broker-J-TestMatrix/Ubuntu%20Slaves=ubuntu,jdk=JDK%201.8%20(latest),profile=java-bdb.0-10/ws/tck/target/classes>
[INFO] <https://builds.apache.org/job/Qpid-Broker-J-TestMatrix/Ubuntu%20Slaves=ubuntu,jdk=JDK%201.8%20(latest),profile=java-bdb.0-10/ws/tck/src/main/java/org/apache/qpid/tck/ManageQpidJMSResources.java>: <https://builds.apache.org/job/Qpid-Broker-J-TestMatrix/Ubuntu%20Slaves=ubuntu,jdk=JDK%201.8%20(latest),profile=java-bdb.0-10/ws/tck/src/main/java/org/apache/qpid/tck/ManageQpidJMSResources.java> uses unchecked or unsafe operations.
[INFO] <https://builds.apache.org/job/Qpid-Broker-J-TestMatrix/Ubuntu%20Slaves=ubuntu,jdk=JDK%201.8%20(latest),profile=java-bdb.0-10/ws/tck/src/main/java/org/apache/qpid/tck/ManageQpidJMSResources.java>: Recompile with -Xlint:unchecked for details.
[INFO]
[INFO] --- maven-resources-plugin:2.7:testResources (default-testResources) @ qpid-tck ---
[INFO] Using 'UTF-8' encoding to copy filtered resources.
[INFO] Copying 5 resources
[INFO] Copying 3 resources
[INFO]
[INFO] --- maven-compiler-plugin:3.5.1:testCompile (default-testCompile) @ qpid-tck ---
[INFO] No sources to compile
[INFO]
[INFO] --- maven-surefire-plugin:2.19.1:test (default-test) @ qpid-tck ---
[INFO] Tests are skipped.
[INFO]
[INFO] --- maven-jar-plugin:3.0.0:jar (default-jar) @ qpid-tck ---
[INFO] Building jar: <https://builds.apache.org/job/Qpid-Broker-J-TestMatrix/Ubuntu%20Slaves=ubuntu,jdk=JDK%201.8%20(latest),profile=java-bdb.0-10/ws/tck/target/qpid-tck-7.1.0-SNAPSHOT.jar>
[INFO]
[INFO] --- maven-site-plugin:3.5.1:attach-descriptor (attach-descriptor) @ qpid-tck ---
[INFO]
[INFO] ------------------------------------------------------------------------
[INFO] Building Apache Qpid Broker-J Docbook 7.1.0-SNAPSHOT
[INFO] ------------------------------------------------------------------------
[INFO]
[INFO] --- maven-clean-plugin:3.0.0:clean (default-clean) @ qpid-java-doc ---
[INFO]
[INFO] --- maven-antrun-plugin:1.8:run (output-test-properties) @ qpid-java-doc ---
[INFO] Executing tasks
main:
[echo] Qpid Test Profile Properties
[echo] [profile] java-bdb.0-10
[echo] [profile.broker.version] 0-10
[echo] [profile.virtualhostnode.type] BDB
[echo] [profile.virtualhostnode.context.blueprint] {"type":"ProvidedStore","globalAddressDomains":"${qpid.globalAddressDomains}"}
[echo] [profile.test_receive_timeout] 3000
[INFO] Executed tasks
[INFO]
[INFO] --- maven-enforcer-plugin:1.4.1:enforce (enforce-minimum-versions) @ qpid-java-doc ---
[INFO]
[INFO] --- maven-enforcer-plugin:1.4.1:enforce (enforce-versions-standard-properties) @ qpid-java-doc ---
[INFO]
[INFO] --- maven-enforcer-plugin:1.4.1:enforce (enforce-enableAmqp0x) @ qpid-java-doc ---
[INFO]
[INFO] --- jacoco-maven-plugin:0.7.5.201505241946:prepare-agent (default-prepare-agent) @ qpid-java-doc ---
[INFO] argLine set to "-javaagent:/home/jenkins/.m2/repository/org/jacoco/org.jacoco.agent/0.7.5.201505241946/org.jacoco.agent-0.7.5.201505241946-runtime.jar=destfile=<https://builds.apache.org/job/Qpid-Broker-J-TestMatrix/Ubuntu%20Slaves=ubuntu,jdk=JDK%201.8%20(latest),profile=java-bdb.0-10/ws/doc/target/jacoco.exec"> -Xmx512m
[INFO]
[INFO] --- maven-remote-resources-plugin:1.5:process (process-resource-bundles) @ qpid-java-doc ---
[INFO]
[INFO] --- maven-site-plugin:3.5.1:attach-descriptor (attach-descriptor) @ qpid-java-doc ---
[INFO]
[INFO] --- maven-assembly-plugin:2.6:single (default) @ qpid-java-doc ---
[INFO] Assemblies have been skipped per configuration of the skipAssembly parameter.
[INFO]
[INFO] ------------------------------------------------------------------------
[INFO] Building Apache Qpid Broker-J Docbook 7.1.0-SNAPSHOT
[INFO] ------------------------------------------------------------------------
[INFO]
[INFO] --- maven-clean-plugin:3.0.0:clean (default-clean) @ qpid-java-doc-broker ---
[INFO]
[INFO] --- maven-antrun-plugin:1.8:run (output-test-properties) @ qpid-java-doc-broker ---
[INFO] Executing tasks
main:
[echo] Qpid Test Profile Properties
[echo] [profile] java-bdb.0-10
[echo] [profile.broker.version] 0-10
[echo] [profile.virtualhostnode.type] BDB
[echo] [profile.virtualhostnode.context.blueprint] {"type":"ProvidedStore","globalAddressDomains":"${qpid.globalAddressDomains}"}
[echo] [profile.test_receive_timeout] 3000
[INFO] Executed tasks
[INFO]
[INFO] --- maven-enforcer-plugin:1.4.1:enforce (enforce-minimum-versions) @ qpid-java-doc-broker ---
[INFO]
[INFO] --- maven-enforcer-plugin:1.4.1:enforce (enforce-versions-standard-properties) @ qpid-java-doc-broker ---
[INFO]
[INFO] --- maven-enforcer-plugin:1.4.1:enforce (enforce-enableAmqp0x) @ qpid-java-doc-broker ---
[INFO]
[INFO] --- jacoco-maven-plugin:0.7.5.201505241946:prepare-agent (default-prepare-agent) @ qpid-java-doc-broker ---
[INFO] argLine set to "-javaagent:/home/jenkins/.m2/repository/org/jacoco/org.jacoco.agent/0.7.5.201505241946/org.jacoco.agent-0.7.5.201505241946-runtime.jar=destfile=<https://builds.apache.org/job/Qpid-Broker-J-TestMatrix/Ubuntu%20Slaves=ubuntu,jdk=JDK%201.8%20(latest),profile=java-bdb.0-10/ws/doc/java-broker/target/jacoco.exec"> -Xmx512m
[INFO]
[INFO] --- maven-resources-plugin:2.7:copy-resources (filter-docbook-sources) @ qpid-java-doc-broker ---
[INFO] Using 'UTF-8' encoding to copy filtered resources.
[INFO] Copying 76 resources
[INFO]
[INFO] --- maven-remote-resources-plugin:1.5:process (process-resource-bundles) @ qpid-java-doc-broker ---
[INFO]
[INFO] --- maven-resources-plugin:2.7:resources (default-resources) @ qpid-java-doc-broker ---
[INFO] Using 'UTF-8' encoding to copy filtered resources.
[INFO] Copying 76 resources
[INFO]
[INFO] --- maven-compiler-plugin:3.5.1:compile (default-compile) @ qpid-java-doc-broker ---
[INFO] No sources to compile
[INFO]
[INFO] --- maven-resources-plugin:2.7:testResources (default-testResources) @ qpid-java-doc-broker ---
[INFO] Using 'UTF-8' encoding to copy filtered resources.
[INFO] Copying 76 resources
[INFO]
[INFO] --- maven-compiler-plugin:3.5.1:testCompile (default-testCompile) @ qpid-java-doc-broker ---
[INFO] No sources to compile
[INFO]
[INFO] --- maven-surefire-plugin:2.19.1:test (default-test) @ qpid-java-doc-broker ---
[INFO] Tests are skipped.
[INFO]
[INFO] --- maven-jar-plugin:3.0.0:jar (default-jar) @ qpid-java-doc-broker ---
[WARNING] JAR will be empty - no content was marked for inclusion!
[INFO] Building jar: <https://builds.apache.org/job/Qpid-Broker-J-TestMatrix/Ubuntu%20Slaves=ubuntu,jdk=JDK%201.8%20(latest),profile=java-bdb.0-10/ws/doc/java-broker/target/qpid-java-doc-broker-7.1.0-SNAPSHOT.jar>
[INFO]
[INFO] --- maven-site-plugin:3.5.1:attach-descriptor (attach-descriptor) @ qpid-java-doc-broker ---
[INFO]
[INFO] --- maven-assembly-plugin:2.6:single (default) @ qpid-java-doc-broker ---
[INFO] Assemblies have been skipped per configuration of the skipAssembly parameter.
[INFO]
[INFO] ------------------------------------------------------------------------
[INFO] Building Apache Qpid Broker-J Performance Test Docbook 7.1.0-SNAPSHOT
[INFO] ------------------------------------------------------------------------
[INFO]
[INFO] --- maven-clean-plugin:3.0.0:clean (default-clean) @ qpid-java-doc-perftests ---
[INFO]
[INFO] --- maven-antrun-plugin:1.8:run (output-test-properties) @ qpid-java-doc-perftests ---
[INFO] Executing tasks
main:
[echo] Qpid Test Profile Properties
[echo] [profile] java-bdb.0-10
[echo] [profile.broker.version] 0-10
[echo] [profile.virtualhostnode.type] BDB
[echo] [profile.virtualhostnode.context.blueprint] {"type":"ProvidedStore","globalAddressDomains":"${qpid.globalAddressDomains}"}
[echo] [profile.test_receive_timeout] 3000
[INFO] Executed tasks
[INFO]
[INFO] --- maven-enforcer-plugin:1.4.1:enforce (enforce-minimum-versions) @ qpid-java-doc-perftests ---
[INFO]
[INFO] --- maven-enforcer-plugin:1.4.1:enforce (enforce-versions-standard-properties) @ qpid-java-doc-perftests ---
[INFO]
[INFO] --- maven-enforcer-plugin:1.4.1:enforce (enforce-enableAmqp0x) @ qpid-java-doc-perftests ---
[INFO]
[INFO] --- jacoco-maven-plugin:0.7.5.201505241946:prepare-agent (default-prepare-agent) @ qpid-java-doc-perftests ---
[INFO] argLine set to "-javaagent:/home/jenkins/.m2/repository/org/jacoco/org.jacoco.agent/0.7.5.201505241946/org.jacoco.agent-0.7.5.201505241946-runtime.jar=destfile=<https://builds.apache.org/job/Qpid-Broker-J-TestMatrix/Ubuntu%20Slaves=ubuntu,jdk=JDK%201.8%20(latest),profile=java-bdb.0-10/ws/doc/java-perftests/target/jacoco.exec"> -Xmx512m
[INFO]
[INFO] --- maven-resources-plugin:2.7:copy-resources (filter-docbook-sources) @ qpid-java-doc-perftests ---
[INFO] Using 'UTF-8' encoding to copy filtered resources.
[INFO] Copying 1 resource
[INFO]
[INFO] --- maven-remote-resources-plugin:1.5:process (process-resource-bundles) @ qpid-java-doc-perftests ---
[INFO]
[INFO] --- maven-resources-plugin:2.7:resources (default-resources) @ qpid-java-doc-perftests ---
[INFO] Using 'UTF-8' encoding to copy filtered resources.
[INFO] Copying 1 resource
[INFO]
[INFO] --- maven-compiler-plugin:3.5.1:compile (default-compile) @ qpid-java-doc-perftests ---
[INFO] No sources to compile
[INFO]
[INFO] --- maven-resources-plugin:2.7:testResources (default-testResources) @ qpid-java-doc-perftests ---
[INFO] Using 'UTF-8' encoding to copy filtered resources.
[INFO] Copying 1 resource
[INFO]
[INFO] --- maven-compiler-plugin:3.5.1:testCompile (default-testCompile) @ qpid-java-doc-perftests ---
[INFO] No sources to compile
[INFO]
[INFO] --- maven-surefire-plugin:2.19.1:test (default-test) @ qpid-java-doc-perftests ---
[INFO] Tests are skipped.
[INFO]
[INFO] --- maven-jar-plugin:3.0.0:jar (default-jar) @ qpid-java-doc-perftests ---
[WARNING] JAR will be empty - no content was marked for inclusion!
[INFO] Building jar: <https://builds.apache.org/job/Qpid-Broker-J-TestMatrix/Ubuntu%20Slaves=ubuntu,jdk=JDK%201.8%20(latest),profile=java-bdb.0-10/ws/doc/java-perftests/target/qpid-java-doc-perftests-7.1.0-SNAPSHOT.jar>
[INFO]
[INFO] --- maven-site-plugin:3.5.1:attach-descriptor (attach-descriptor) @ qpid-java-doc-perftests ---
[INFO]
[INFO] --- maven-assembly-plugin:2.6:single (default) @ qpid-java-doc-perftests ---
[INFO] Assemblies have been skipped per configuration of the skipAssembly parameter.
[INFO] ------------------------------------------------------------------------
[INFO] Reactor Summary:
[INFO]
[INFO] Apache Qpid Broker-J Parent ........................ SUCCESS [ 2.228 s]
[INFO] Apache Qpid Broker-J Code Generation ............... SUCCESS [ 1.827 s]
[INFO] Apache Qpid Broker-J Test Utilities ................ SUCCESS [ 0.590 s]
[INFO] Apache Qpid Broker-J Core .......................... SUCCESS [ 12.847 s]
[INFO] Apache Qpid Broker-J LogBack Logging Plug-in ....... SUCCESS [ 1.282 s]
[INFO] Apache Qpid Broker-J Access Control Plug-in ........ SUCCESS [ 0.766 s]
[INFO] Apache Qpid Broker-J AMQP 0-10 Protocol Plug-in .... SUCCESS [ 1.357 s]
[INFO] Apache Qpid Broker-J AMQP 0-8 Protocol Plug-in ..... SUCCESS [ 1.141 s]
[INFO] Apache Qpid Broker-J AMQP 1-0 Protocol Plug-in ..... SUCCESS [ 2.418 s]
[INFO] Apache Qpid Broker-J AMQP 0-8 to 0-10 Message Conversion Plug-in SUCCESS [ 0.306 s]
[INFO] Apache Qpid Broker-J AMQP 0-8 to 1-0 Message Conversion Plug-in SUCCESS [ 0.396 s]
[INFO] Apache Qpid Broker-J AMQP 0-10 to 1-0 Message Conversion Plug-in SUCCESS [ 0.380 s]
[INFO] Apache Qpid Broker-J JDBC Message Store Plug-in .... SUCCESS [ 0.728 s]
[INFO] Apache Qpid Broker-J Derby Message Store Plug-in ... SUCCESS [ 0.982 s]
[INFO] Apache Qpid Broker-J JDBC Message Store Connection Pooling Plug-in SUCCESS [ 0.263 s]
[INFO] Apache Qpid AMQP 1.0 JDBC Link Store Plug-in ....... SUCCESS [ 0.279 s]
[INFO] Apache Qpid Broker-J HTTP Management Plug-in ....... SUCCESS [ 1.655 s]
[INFO] Apache Qpid Broker-J AMQP Management Protocol Plug-in SUCCESS [ 0.511 s]
[INFO] Apache Qpid Broker-J Memory Message Store Plug-in .. SUCCESS [ 0.365 s]
[INFO] Apache Qpid Broker-J WebSocket Plug-in ............. SUCCESS [ 0.465 s]
[INFO] Apache Qpid Broker-J BDB Message Store Plug-in ..... SUCCESS [ 1.823 s]
[INFO] Apache Qpid AMQP 1.0 BDB Link Store Plug-in ........ SUCCESS [ 0.900 s]
[INFO] Apache Qpid Broker-J ............................... SUCCESS [ 1.295 s]
[INFO] Apache Qpid Broker-J Bundles ....................... SUCCESS [ 4.642 s]
[INFO] Apache Qpid Broker-J Tools ......................... SUCCESS [ 0.255 s]
[INFO] Apache Qpid Broker-J System Test Parent ............ SUCCESS [ 0.056 s]
[INFO] Apache Qpid Broker-J System Test Utils ............. SUCCESS [ 0.437 s]
[INFO] Apache Qpid Broker-J JMS System Tests Core ......... SUCCESS [ 0.695 s]
[INFO] Apache Qpid Broker-J JMS 1.1 System Tests .......... SUCCESS [ 1.843 s]
[INFO] Apache Qpid Broker-J JMS 2.0 System Tests .......... SUCCESS [ 0.863 s]
[INFO] Apache Qpid Broker-J HTTP system tests ............. SUCCESS [ 1.112 s]
[INFO] Apache Qpid Broker-J Protocol Tests Core ........... SUCCESS [ 0.335 s]
[INFO] Apache Qpid Protocol Tests for AMQP 0-8,0-9,0-9-1 .. SUCCESS [ 1.367 s]
[INFO] Apache Qpid Protocol Tests for AMQP 0-10 ........... SUCCESS [ 1.158 s]
[INFO] Apache Qpid Protocol Tests for AMQP 1.0 ............ SUCCESS [ 1.759 s]
[INFO] Apache Qpid Broker-J System Tests Spawn Broker Admin SUCCESS [ 0.970 s]
[INFO] Apache Qpid Broker-J End to End Conversion Tests ... SUCCESS [ 1.597 s]
[INFO] Apache Qpid Broker-J Performance Tests ............. SUCCESS [ 1.667 s]
[INFO] Apache Qpid Broker-J Performance Test System Tests . SUCCESS [ 0.329 s]
[INFO] Apache Qpid Broker-J Performance Tests Visualisation JFC SUCCESS [ 1.406 s]
[INFO] Apache Qpid Broker-J BDB Store System Tests ........ SUCCESS [ 0.525 s]
[INFO] Apache Qpid Joram JMS Tests ........................ SUCCESS [ 0.213 s]
[INFO] Apache Qpid Broker-J JMS TCK Configuration ......... SUCCESS [ 0.181 s]
[INFO] Apache Qpid Broker-J Docbook ....................... SUCCESS [ 0.039 s]
[INFO] Apache Qpid Broker-J Docbook ....................... SUCCESS [ 0.560 s]
[INFO] Apache Qpid Broker-J Performance Test Docbook ...... SUCCESS [ 0.080 s]
[INFO] ------------------------------------------------------------------------
[INFO] BUILD SUCCESS
[INFO] ------------------------------------------------------------------------
[INFO] Total time: 57.697 s
[INFO] Finished at: 2018-04-13T17:33:38Z
[INFO] Final Memory: 171M/5418M
[INFO] ------------------------------------------------------------------------
Archiving artifacts
ERROR: No artifacts found that match the file pattern "**/target/surefire-reports/**". Configuration error?
ERROR: java.lang.InterruptedException: no matches found within 10000
Build step 'Archive the artifacts' changed build result to FAILURE
Performing Post build task...
Match found for : : True
Logical operation result is TRUE
Running script : echo Finishing build
date
[java-bdb.0-10] $ /bin/bash -xe /tmp/jenkins8805705164368999376.sh
+ echo Finishing build
Finishing build
+ date
Fri Apr 13 17:33:41 UTC 2018
POST BUILD TASK : SUCCESS
END OF POST BUILD TASK : 0
Recording test results
ERROR: Step ?Publish JUnit test result report? failed: No test report files were found. Configuration error?