You are viewing a plain text version of this content. The canonical link for it is here.
Posted to builds@solr.apache.org by Apache Jenkins Server <je...@builds.apache.org> on 2025/10/19 22:01:38 UTC
[JENKINS] Solr » Solr-Lint-10.x - Build # 3 - Still Failing!
Build: https://ci-builds.apache.org/job/Solr/job/Solr-Lint-10.x/3/
No tests ran.
Build Log:
[...truncated 1149 lines...]
BUILD FAILED in 10m 9s
618 actionable tasks: 618 executed
Publishing build scan...
https://develocity.apache.org/s/gi6b2itdpteko
Build step 'Invoke Gradle script' changed build result to FAILURE
Build step 'Invoke Gradle script' marked build as failure
Email was triggered for: Failure - Any
Sending email for trigger: Failure - Any
[JENKINS] Solr » Solr-Lint-10.x - Build # 15 - Still Failing!
Posted by Apache Jenkins Server <je...@builds.apache.org>.
Build: https://ci-builds.apache.org/job/Solr/job/Solr-Lint-10.x/15/
No tests ran.
Build Log:
[...truncated 1149 lines...]
BUILD FAILED in 9m 58s
618 actionable tasks: 618 executed
Publishing build scan...
https://develocity.apache.org/s/5mvlwoz2j7umm
Build step 'Invoke Gradle script' changed build result to FAILURE
Build step 'Invoke Gradle script' marked build as failure
Email was triggered for: Failure - Any
Sending email for trigger: Failure - Any
[JENKINS] Solr » Solr-Lint-10.x - Build # 14 - Still Failing!
Posted by Apache Jenkins Server <je...@builds.apache.org>.
Build: https://ci-builds.apache.org/job/Solr/job/Solr-Lint-10.x/14/
No tests ran.
Build Log:
[...truncated 1149 lines...]
BUILD FAILED in 10m 17s
618 actionable tasks: 618 executed
Publishing build scan...
https://develocity.apache.org/s/axlffy4exja4k
Build step 'Invoke Gradle script' changed build result to FAILURE
Build step 'Invoke Gradle script' marked build as failure
Email was triggered for: Failure - Any
Sending email for trigger: Failure - Any
[JENKINS] Solr » Solr-Lint-10.x - Build # 13 - Still Failing!
Posted by Apache Jenkins Server <je...@builds.apache.org>.
Build: https://ci-builds.apache.org/job/Solr/job/Solr-Lint-10.x/13/
No tests ran.
Build Log:
[...truncated 1149 lines...]
BUILD FAILED in 9m 58s
618 actionable tasks: 618 executed
Publishing build scan...
https://develocity.apache.org/s/b5s24vn6r5a3i
Build step 'Invoke Gradle script' changed build result to FAILURE
Build step 'Invoke Gradle script' marked build as failure
Email was triggered for: Failure - Any
Sending email for trigger: Failure - Any
[JENKINS] Solr » Solr-Lint-10.x - Build # 12 - Still Failing!
Posted by Apache Jenkins Server <je...@builds.apache.org>.
Build: https://ci-builds.apache.org/job/Solr/job/Solr-Lint-10.x/12/
No tests ran.
Build Log:
[...truncated 1149 lines...]
BUILD FAILED in 9m 57s
618 actionable tasks: 618 executed
Publishing build scan...
https://develocity.apache.org/s/7ltdeeodbsshk
Build step 'Invoke Gradle script' changed build result to FAILURE
Build step 'Invoke Gradle script' marked build as failure
Email was triggered for: Failure - Any
Sending email for trigger: Failure - Any
[JENKINS] Solr » Solr-Lint-10.x - Build # 11 - Still Failing!
Posted by Apache Jenkins Server <je...@builds.apache.org>.
Build: https://ci-builds.apache.org/job/Solr/job/Solr-Lint-10.x/11/
No tests ran.
Build Log:
[...truncated 1149 lines...]
BUILD FAILED in 10m 27s
618 actionable tasks: 618 executed
Publishing build scan...
https://develocity.apache.org/s/njb4oecmie5xq
Build step 'Invoke Gradle script' changed build result to FAILURE
Build step 'Invoke Gradle script' marked build as failure
Email was triggered for: Failure - Any
Sending email for trigger: Failure - Any
[JENKINS] Solr » Solr-Lint-10.x - Build # 10 - Still Failing!
Posted by Apache Jenkins Server <je...@builds.apache.org>.
Build: https://ci-builds.apache.org/job/Solr/job/Solr-Lint-10.x/10/
No tests ran.
Build Log:
[...truncated 1149 lines...]
BUILD FAILED in 9m 43s
618 actionable tasks: 618 executed
Publishing build scan...
https://develocity.apache.org/s/lh37teh2msqwq
Build step 'Invoke Gradle script' changed build result to FAILURE
Build step 'Invoke Gradle script' marked build as failure
Email was triggered for: Failure - Any
Sending email for trigger: Failure - Any
[JENKINS] Solr » Solr-Lint-10.x - Build # 9 - Still Failing!
Posted by Apache Jenkins Server <je...@builds.apache.org>.
Build: https://ci-builds.apache.org/job/Solr/job/Solr-Lint-10.x/9/
No tests ran.
Build Log:
[...truncated 1149 lines...]
BUILD FAILED in 9m 30s
618 actionable tasks: 618 executed
Publishing build scan...
https://develocity.apache.org/s/scqlebiiv2kbq
Build step 'Invoke Gradle script' changed build result to FAILURE
Build step 'Invoke Gradle script' marked build as failure
Email was triggered for: Failure - Any
Sending email for trigger: Failure - Any
[JENKINS] Solr » Solr-Lint-10.x - Build # 8 - Still Failing!
Posted by Apache Jenkins Server <je...@builds.apache.org>.
Build: https://ci-builds.apache.org/job/Solr/job/Solr-Lint-10.x/8/
No tests ran.
Build Log:
[...truncated 1149 lines...]
BUILD FAILED in 9m 37s
618 actionable tasks: 618 executed
Publishing build scan...
https://develocity.apache.org/s/kaynmwv7jbi6m
Build step 'Invoke Gradle script' changed build result to FAILURE
Build step 'Invoke Gradle script' marked build as failure
Email was triggered for: Failure - Any
Sending email for trigger: Failure - Any
[JENKINS] Solr » Solr-Lint-10.x - Build # 7 - Still Failing!
Posted by Apache Jenkins Server <je...@builds.apache.org>.
Build: https://ci-builds.apache.org/job/Solr/job/Solr-Lint-10.x/7/
No tests ran.
Build Log:
[...truncated 1149 lines...]
BUILD FAILED in 10m 5s
618 actionable tasks: 618 executed
Publishing build scan...
https://develocity.apache.org/s/hwavunxnp7zvi
Build step 'Invoke Gradle script' changed build result to FAILURE
Build step 'Invoke Gradle script' marked build as failure
Email was triggered for: Failure - Any
Sending email for trigger: Failure - Any
[JENKINS] Solr » Solr-Lint-10.x - Build # 6 - Still Failing!
Posted by Apache Jenkins Server <je...@builds.apache.org>.
Build: https://ci-builds.apache.org/job/Solr/job/Solr-Lint-10.x/6/
No tests ran.
Build Log:
[...truncated 1149 lines...]
BUILD FAILED in 10m 30s
618 actionable tasks: 618 executed
Publishing build scan...
https://develocity.apache.org/s/kna2tijemmqn4
Build step 'Invoke Gradle script' changed build result to FAILURE
Build step 'Invoke Gradle script' marked build as failure
Email was triggered for: Failure - Any
Sending email for trigger: Failure - Any
[JENKINS] Solr » Solr-Lint-10.x - Build # 5 - Still Failing!
Posted by Apache Jenkins Server <je...@builds.apache.org>.
Build: https://ci-builds.apache.org/job/Solr/job/Solr-Lint-10.x/5/
No tests ran.
Build Log:
[...truncated 1149 lines...]
BUILD FAILED in 10m 46s
618 actionable tasks: 618 executed
Publishing build scan...
https://develocity.apache.org/s/oolewy5mqpldm
Build step 'Invoke Gradle script' changed build result to FAILURE
Build step 'Invoke Gradle script' marked build as failure
Email was triggered for: Failure - Any
Sending email for trigger: Failure - Any
[JENKINS] Solr » Solr-Lint-10.x - Build # 4 - Still Failing!
Posted by Apache Jenkins Server <je...@builds.apache.org>.
Build: https://ci-builds.apache.org/job/Solr/job/Solr-Lint-10.x/4/
No tests ran.
Build Log:
[...truncated 1149 lines...]
BUILD FAILED in 9m 46s
618 actionable tasks: 618 executed
Publishing build scan...
https://develocity.apache.org/s/v6mfoq3nfw2nu
Build step 'Invoke Gradle script' changed build result to FAILURE
Build step 'Invoke Gradle script' marked build as failure
Email was triggered for: Failure - Any
Sending email for trigger: Failure - Any