You are viewing a plain text version of this content. The canonical link for it is here.
Posted to issues@tez.apache.org by Apache Jenkins Server <je...@builds.apache.org> on 2015/01/22 11:30:23 UTC
Failed: TEZ-391 PreCommit Build #71
Jira: https://issues.apache.org/jira/browse/TEZ-391
Build: https://builds.apache.org/job/PreCommit-TEZ-Build/71/
###################################################################################
########################## LAST 60 LINES OF THE CONSOLE ###########################
[...truncated 22 lines...]
======================================================================
======================================================================
Testing patch for TEZ-391.
======================================================================
======================================================================
HEAD is now at 3f4e8a7 TEZ-1803. Support > 2gb sort buffer in pipelinedsorter (rbalamohan)
Previous HEAD position was 3f4e8a7... TEZ-1803. Support > 2gb sort buffer in pipelinedsorter (rbalamohan)
Switched to branch 'master'
Your branch is behind 'origin/master' by 6 commits, and can be fast-forwarded.
(use "git pull" to update your local branch)
First, rewinding head to replay your work on top of it...
Fast-forwarded master to 3f4e8a7bf2e8615d38770e6b0a2c648a8d078634.
TEZ-391 patch is being downloaded at Thu Jan 22 10:30:19 UTC 2015 from
http://issues.apache.org/jira/secure/attachment/12693848/TEZ-391-WIP-2.patch
The patch does not appear to apply with p0 to p2
PATCH APPLICATION FAILED
{color:red}-1 overall{color}. Here are the results of testing the latest attachment
http://issues.apache.org/jira/secure/attachment/12693848/TEZ-391-WIP-2.patch
against master revision 3f4e8a7.
{color:red}-1 patch{color}. The patch command could not apply the patch.
Console output: https://builds.apache.org/job/PreCommit-TEZ-Build/71//console
This message is automatically generated.
======================================================================
======================================================================
Adding comment to Jira.
======================================================================
======================================================================
Comment added.
e29b29eadace363ba6dc466b049bf4c5133b3671 logged out
======================================================================
======================================================================
Finished build.
======================================================================
======================================================================
Build step 'Execute shell' marked build as failure
Archiving artifacts
[description-setter] Could not determine description.
Recording test results
Email was triggered for: Failure
Sending email for trigger: Failure
###################################################################################
############################## FAILED TESTS (if any) ##############################
No tests ran.
Success: TEZ-1993 PreCommit Build #73
Posted by Apache Jenkins Server <je...@builds.apache.org>.
Jira: https://issues.apache.org/jira/browse/TEZ-1993
Build: https://builds.apache.org/job/PreCommit-TEZ-Build/73/
###################################################################################
########################## LAST 60 LINES OF THE CONSOLE ###########################
[...truncated 2600 lines...]
[INFO] Final Memory: 71M/886M
[INFO] ------------------------------------------------------------------------
{color:green}+1 overall{color}. Here are the results of testing the latest attachment
http://issues.apache.org/jira/secure/attachment/12694325/TEZ-1993.1.patch
against master revision 3f4e8a7.
{color:green}+1 @author{color}. The patch does not contain any @author tags.
{color:green}+1 tests included{color}. The patch appears to include 1 new or modified test files.
{color:green}+1 javac{color}. The applied patch does not increase the total number of javac compiler warnings.
{color:green}+1 javadoc{color}. There were no new javadoc warning messages.
{color:green}+1 findbugs{color}. The patch does not introduce any new Findbugs (version 2.0.3) warnings.
{color:green}+1 release audit{color}. The applied patch does not increase the total number of release audit warnings.
{color:green}+1 core tests{color}. The patch passed unit tests in .
Test results: https://builds.apache.org/job/PreCommit-TEZ-Build/73//testReport/
Console output: https://builds.apache.org/job/PreCommit-TEZ-Build/73//console
This message is automatically generated.
======================================================================
======================================================================
Adding comment to Jira.
======================================================================
======================================================================
Comment added.
6186578da9ab316458a5f4a1a23e93ae25b65b1b logged out
======================================================================
======================================================================
Finished build.
======================================================================
======================================================================
Archiving artifacts
Sending artifact delta relative to PreCommit-TEZ-Build #70
Archived 41 artifacts
Archive block size is 32768
Received 6 blocks and 2460385 bytes
Compression is 7.4%
Took 0.83 sec
Description set: TEZ-1993
Recording test results
Email was triggered for: Success
Sending email for trigger: Success
###################################################################################
############################## FAILED TESTS (if any) ##############################
All tests passed
Failed: TEZ-1973 PreCommit Build #72
Posted by Apache Jenkins Server <je...@builds.apache.org>.
Jira: https://issues.apache.org/jira/browse/TEZ-1973
Build: https://builds.apache.org/job/PreCommit-TEZ-Build/72/
###################################################################################
########################## LAST 60 LINES OF THE CONSOLE ###########################
[...truncated 2635 lines...]
{color:red}-1 overall{color}. Here are the results of testing the latest attachment
http://issues.apache.org/jira/secure/attachment/12694149/TEZ-1973.5.patch
against master revision 3f4e8a7.
{color:green}+1 @author{color}. The patch does not contain any @author tags.
{color:red}-1 tests included{color}. The patch doesn't appear to include any new or modified tests.
Please justify why no new tests are needed for this patch.
Also please list what manual steps were performed to verify this patch.
{color:green}+1 javac{color}. The applied patch does not increase the total number of javac compiler warnings.
{color:green}+1 javadoc{color}. There were no new javadoc warning messages.
{color:green}+1 findbugs{color}. The patch does not introduce any new Findbugs (version 2.0.3) warnings.
{color:green}+1 release audit{color}. The applied patch does not increase the total number of release audit warnings.
{color:green}+1 core tests{color}. The patch passed unit tests in .
Test results: https://builds.apache.org/job/PreCommit-TEZ-Build/72//testReport/
Console output: https://builds.apache.org/job/PreCommit-TEZ-Build/72//console
This message is automatically generated.
======================================================================
======================================================================
Adding comment to Jira.
======================================================================
======================================================================
Comment added.
ab772b5588497d5258ca15c2d9a55faf0e105c4f logged out
======================================================================
======================================================================
Finished build.
======================================================================
======================================================================
Build step 'Execute shell' marked build as failure
Archiving artifacts
Sending artifact delta relative to PreCommit-TEZ-Build #70
Archived 41 artifacts
Archive block size is 32768
Received 6 blocks and 2435587 bytes
Compression is 7.5%
Took 0.9 sec
[description-setter] Could not determine description.
Recording test results
Email was triggered for: Failure
Sending email for trigger: Failure
###################################################################################
############################## FAILED TESTS (if any) ##############################
All tests passed