You are viewing a plain text version of this content. The canonical link for it is here.
Posted to dev@zookeeper.apache.org by Apache Jenkins Server <je...@builds.apache.org> on 2016/05/30 08:38:13 UTC

ZooKeeper_branch35_jdk7 - Build # 534 - Still Failing

See https://builds.apache.org/job/ZooKeeper_branch35_jdk7/534/

###################################################################################
########################## LAST 60 LINES OF THE CONSOLE ###########################
Started by timer
[EnvInject] - Loading node environment variables.
Building remotely on ubuntu-6 (docker Ubuntu ubuntu yahoo-not-h2) in workspace /home/jenkins/jenkins-slave/workspace/ZooKeeper_branch35_jdk7
Updating http://svn.apache.org/repos/asf/zookeeper/branches/branch-3.5 at revision '2016-05-30T08:38:09.190 +0000'
At revision 1746093

No changes for http://svn.apache.org/repos/asf/zookeeper/branches/branch-3.5 since the previous build
No emails were triggered.
FATAL: Cannot find executable from the chosen Ant installation "Ant (latest)"
Build step 'Invoke Ant' marked build as failure
Archiving artifacts
Recording test results
ERROR: Step ?Publish JUnit test result report? failed: No test report files were found. Configuration error?
Email was triggered for: Failure - Any
Sending email for trigger: Failure - Any



###################################################################################
############################## FAILED TESTS (if any) ##############################
No tests ran.

ZooKeeper_branch35_jdk7 - Build # 536 - Still Failing

Posted by Apache Jenkins Server <je...@builds.apache.org>.
See https://builds.apache.org/job/ZooKeeper_branch35_jdk7/536/

###################################################################################
########################## LAST 60 LINES OF THE CONSOLE ###########################
[...truncated 380200 lines...]
     [exec] Log Message Received: [2016-06-01 08:52:01,729:30823(0x2ae2d20f4540):ZOO_INFO@testLogCallbackInit@993: testLogCallbackInit #8]
     [exec] Log Message Received: [2016-06-01 08:52:01,729:30823(0x2ae2d20f4540):ZOO_INFO@testLogCallbackInit@993: testLogCallbackInit #9]
     [exec] Log Message Received: [2016-06-01 08:52:01,729:30823(0x2ae2d20f4540):ZOO_INFO@zookeeper_close@3257: Closing zookeeper sessionId=0x100107580c0000e to [127.0.0.1:22181]
     [exec] ]
     [exec]  : elapsed 1001 : OK
     [exec] Zookeeper_simpleSystem::testLogCallbackClearLog Message Received: [2016-06-01 08:52:01,730:30823(0x2ae2d20f4540):ZOO_INFO@log_env@1027: Client environment:zookeeper.version=zookeeper C client 3.5.1]
     [exec] Log Message Received: [2016-06-01 08:52:01,730:30823(0x2ae2d20f4540):ZOO_INFO@log_env@1031: Client environment:host.name=priapus.apache.org]
     [exec] Log Message Received: [2016-06-01 08:52:01,730:30823(0x2ae2d20f4540):ZOO_INFO@log_env@1038: Client environment:os.name=Linux]
     [exec] Log Message Received: [2016-06-01 08:52:01,730:30823(0x2ae2d20f4540):ZOO_INFO@log_env@1039: Client environment:os.arch=3.13.0-86-generic]
     [exec] Log Message Received: [2016-06-01 08:52:01,730:30823(0x2ae2d20f4540):ZOO_INFO@log_env@1040: Client environment:os.version=#131-Ubuntu SMP Thu May 12 23:33:13 UTC 2016]
     [exec] Log Message Received: [2016-06-01 08:52:01,730:30823(0x2ae2d20f4540):ZOO_INFO@log_env@1048: Client environment:user.name=jenkins]
     [exec] Log Message Received: [2016-06-01 08:52:01,730:30823(0x2ae2d20f4540):ZOO_INFO@log_env@1056: Client environment:user.home=/home/jenkins]
     [exec] Log Message Received: [2016-06-01 08:52:01,730:30823(0x2ae2d20f4540):ZOO_INFO@log_env@1068: Client environment:user.dir=/home/jenkins/jenkins-slave/workspace/ZooKeeper_branch35_jdk7/branch-3.5/build/test/test-cppunit]
     [exec] Log Message Received: [2016-06-01 08:52:01,730:30823(0x2ae2d20f4540):ZOO_INFO@zookeeper_init_internal@1111: Initiating client connection, host=127.0.0.1:22181 sessionTimeout=10000 watcher=0x45d2a0 sessionId=0 sessionPasswd=<null> context=0x7ffe02a58210 flags=0]
     [exec] Log Message Received: [2016-06-01 08:52:01,730:30823(0x2ae2dc200700):ZOO_INFO@check_events@2357: initiated connection to server [127.0.0.1:22181]]
     [exec] Log Message Received: [2016-06-01 08:52:01,748:30823(0x2ae2dc200700):ZOO_INFO@check_events@2409: session establishment complete on server [127.0.0.1:22181], sessionId=0x100107580c0000f, negotiated timeout=10000 ]
     [exec]  : elapsed 1001 : OK
     [exec] Zookeeper_simpleSystem::testAsyncWatcherAutoReset ZooKeeper server started : elapsed 10222 : OK
     [exec] Zookeeper_simpleSystem::testDeserializeString : elapsed 0 : OK
     [exec] Zookeeper_simpleSystem::testFirstServerDown : elapsed 1001 : OK
     [exec] Zookeeper_simpleSystem::testNullData : elapsed 1048 : OK
     [exec] Zookeeper_simpleSystem::testIPV6 : elapsed 1015 : OK
     [exec] Zookeeper_simpleSystem::testCreate : elapsed 1016 : OK
     [exec] Zookeeper_simpleSystem::testPath : elapsed 1058 : OK
     [exec] Zookeeper_simpleSystem::testPathValidation : elapsed 1142 : OK
     [exec] Zookeeper_simpleSystem::testPing : elapsed 17642 : OK
     [exec] Zookeeper_simpleSystem::testAcl : elapsed 1031 : OK
     [exec] Zookeeper_simpleSystem::testChroot : elapsed 3108 : OK
     [exec] Zookeeper_simpleSystem::testAuth ZooKeeper server started ZooKeeper server started : elapsed 30586 : OK
     [exec] Zookeeper_simpleSystem::testHangingClient : elapsed 1043 : OK
     [exec] Zookeeper_simpleSystem::testWatcherAutoResetWithGlobal ZooKeeper server started ZooKeeper server started ZooKeeper server started : elapsed 14807 : OK
     [exec] Zookeeper_simpleSystem::testWatcherAutoResetWithLocal ZooKeeper server started ZooKeeper server started ZooKeeper server started : elapsed 14860 : OK
     [exec] Zookeeper_simpleSystem::testGetChildren2 : elapsed 1067 : OK
     [exec] Zookeeper_simpleSystem::testLastZxid : elapsed 4532 : OK
     [exec] Zookeeper_simpleSystem::testRemoveWatchers ZooKeeper server started : elapsed 4280 : OK
     [exec] Zookeeper_readOnly::testReadOnly : elapsed 4086 : OK
     [exec] /home/jenkins/jenkins-slave/workspace/ZooKeeper_branch35_jdk7/branch-3.5/src/c/tests/TestReconfig.cc:183: Assertion: equality assertion failed [Expected: 1, Actual  : 0]
     [exec] Failures !!!
     [exec] Run: 72   Failure total: 1   Failures: 1   Errors: 0
     [exec] FAIL: zktest-mt
     [exec] ==========================================
     [exec] 1 of 2 tests failed
     [exec] Please report to user@zookeeper.apache.org
     [exec] ==========================================
     [exec] make[1]: Leaving directory `/home/jenkins/jenkins-slave/workspace/ZooKeeper_branch35_jdk7/branch-3.5/build/test/test-cppunit'
     [exec] make[1]: *** [check-TESTS] Error 1
     [exec] make: *** [check-am] Error 2

BUILD FAILED
/home/jenkins/jenkins-slave/workspace/ZooKeeper_branch35_jdk7/branch-3.5/build.xml:1322: The following error occurred while executing this line:
/home/jenkins/jenkins-slave/workspace/ZooKeeper_branch35_jdk7/branch-3.5/build.xml:1282: The following error occurred while executing this line:
/home/jenkins/jenkins-slave/workspace/ZooKeeper_branch35_jdk7/branch-3.5/build.xml:1292: exec returned: 2

Total time: 15 minutes 41 seconds
Build step 'Invoke Ant' marked build as failure
Archiving artifacts
Recording test results
Email was triggered for: Failure - Any
Sending email for trigger: Failure - Any



###################################################################################
############################## FAILED TESTS (if any) ##############################
All tests passed

ZooKeeper_branch35_jdk7 - Build # 535 - Still Failing

Posted by Apache Jenkins Server <je...@builds.apache.org>.
See https://builds.apache.org/job/ZooKeeper_branch35_jdk7/535/

###################################################################################
########################## LAST 60 LINES OF THE CONSOLE ###########################
Started by timer
[EnvInject] - Loading node environment variables.
Building remotely on ubuntu-6 (docker Ubuntu ubuntu yahoo-not-h2) in workspace /home/jenkins/jenkins-slave/workspace/ZooKeeper_branch35_jdk7
Updating http://svn.apache.org/repos/asf/zookeeper/branches/branch-3.5 at revision '2016-05-31T08:38:11.077 +0000'
At revision 1746253

No changes for http://svn.apache.org/repos/asf/zookeeper/branches/branch-3.5 since the previous build
No emails were triggered.
FATAL: Cannot find executable from the chosen Ant installation "Ant (latest)"
Build step 'Invoke Ant' marked build as failure
Archiving artifacts
Recording test results
ERROR: Step ?Publish JUnit test result report? failed: No test report files were found. Configuration error?
Email was triggered for: Failure - Any
Sending email for trigger: Failure - Any



###################################################################################
############################## FAILED TESTS (if any) ##############################
No tests ran.