You are viewing a plain text version of this content. The canonical link for it is here.
Posted to builds@cassandra.apache.org by Apache Jenkins Server <je...@builds.apache.org> on 2022/05/14 04:48:00 UTC

Build complete: Cassandra-3.11 #357 [FAILURE] 9810922cf1e1a4f63a4f7e0617a9fefefcb08fbe

-------------------------------------------------------------------------------
Build Cassandra-3.11 #357 Failure
URL: https://ci-cassandra.apache.org/job/Cassandra-3.11/357/
-------------------------------------------------------------------------------
Changes:
[Michael Semb Wever] Prepare debian changelog for 3.0.27, bump version to 3.0.28

[Michael Semb Wever] Prepare debian changelog for 3.11.13, bump version to 3.11.14


-------------------------------------------------------------------------------
Failed Tests:
38 tests failed.
FAILED:  dtest-large.snitch_test.TestDynamicEndpointSnitch.test_multidatacenter_local_quorum
FAILED:  dtest-offheap.materialized_views_test.TestMaterializedViews.test_complex_mv_select_statements
FAILED:  dtest-offheap.secondary_indexes_test.TestSecondaryIndexes.test_6924_dropping_cf
FAILED:  dtest-offheap.thrift_hsha_test.TestThriftHSHA.test_6285
FAILED:  dtest-upgrade.upgrade_tests.upgrade_through_versions_test.TestProtoV3Upgrade_AllVersions_RandomPartitioner_EndsAt_3_11_X_HEAD.test_rolling_upgrade
FAILED:  dtest-upgrade.upgrade_tests.upgrade_through_versions_test.TestUpgrade_current_2_1_x_To_indev_3_11_x.test_parallel_upgrade
FAILED:  dtest-upgrade.upgrade_tests.upgrade_through_versions_test.TestUpgrade_current_2_1_x_To_indev_3_11_x.test_bootstrap
FAILED:  dtest-upgrade.upgrade_tests.upgrade_through_versions_test.TestUpgrade_current_2_1_x_To_indev_3_11_x.test_parallel_upgrade_with_internode_ssl
FAILED:  dtest-novnode.materialized_views_test.TestMaterializedViewsConsistency.test_multi_partition_consistent_reads_after_write
FAILED:  dtest-novnode.paxos_test.TestPaxos.test_contention_many_threads
FAILED:  dtest-novnode.repair_tests.repair_test.TestRepair.test_dead_sync_initiator
FAILED:  dtest-novnode.repair_tests.repair_test.TestRepair.test_failure_during_validation
FAILED:  dtest-novnode.repair_tests.deprecated_repair_test.TestDeprecatedRepairAPI.test_force_repair_range_async_1
FAILED:  dtest-novnode.repair_tests.deprecated_repair_test.TestDeprecatedRepairAPI.test_force_repair_range_async_3
FAILED:  dtest-offheap.repair_tests.deprecated_repair_test.TestDeprecatedRepairAPI.test_force_repair_range_async_1
FAILED:  dtest-offheap.paxos_test.TestPaxos.test_contention_many_threads
FAILED:  dtest-offheap.repair_tests.repair_test.TestRepair.test_dead_sync_initiator
FAILED:  dtest-offheap.repair_tests.deprecated_repair_test.TestDeprecatedRepairAPI.test_force_repair_range_async_3
FAILED:  dtest-offheap.repair_tests.repair_test.TestRepair.test_failure_during_validation
FAILED:  dtest-offheap.materialized_views_test.TestMaterializedViewsConsistency.test_multi_partition_consistent_reads_after_write
FAILED:  dtest.materialized_views_test.TestMaterializedViewsConsistency.test_multi_partition_consistent_reads_after_write
FAILED:  dtest.paxos_test.TestPaxos.test_contention_many_threads
FAILED:  dtest.repair_tests.deprecated_repair_test.TestDeprecatedRepairAPI.test_force_repair_range_async_1
FAILED:  dtest.repair_tests.repair_test.TestRepair.test_dead_sync_initiator
FAILED:  dtest.repair_tests.repair_test.TestRepair.test_failure_during_validation
FAILED:  dtest.repair_tests.deprecated_repair_test.TestDeprecatedRepairAPI.test_force_repair_range_async_3
FAILED:  dtest-upgrade.upgrade_tests.upgrade_through_versions_test.TestUpgrade_current_2_1_x_To_indev_3_11_x.test_rolling_upgrade
FAILED:  dtest-upgrade.upgrade_tests.upgrade_through_versions_test.TestUpgrade_current_2_1_x_To_indev_3_11_x.test_rolling_upgrade
FAILED:  org.apache.cassandra.distributed.upgrade.CompactStorage2to3UpgradeTest.singleColumn
FAILED:  org.apache.cassandra.distributed.upgrade.CompactStorage2to3UpgradeTest.singleColumn
FAILED:  org.apache.cassandra.distributed.upgrade.CompactStorage2to3UpgradeTest.singleColumn
FAILED:  org.apache.cassandra.distributed.upgrade.CompactStorage2to3UpgradeTest.singleColumn
FAILED:  dtest-upgrade.upgrade_internal_auth_test.TestAuthUpgrade.test_upgrade_legacy_table
FAILED:  org.apache.cassandra.distributed.upgrade.CompactStorage2to3UpgradeTest.testDropCompactWithClusteringAndValueColumnWithDeletesAndWrites
FAILED:  org.apache.cassandra.distributed.upgrade.CompactStorage2to3UpgradeTest.testDropCompactWithClusteringAndValueColumnWithDeletesAndWrites
FAILED:  org.apache.cassandra.distributed.upgrade.CompactStorage2to3UpgradeTest.testDropCompactWithClusteringAndValueColumnWithDeletesAndWrites
FAILED:  org.apache.cassandra.distributed.upgrade.CompactStorage2to3UpgradeTest.testDropCompactWithClusteringAndValueColumnWithDeletesAndWrites
FAILED:  org.apache.cassandra.utils.memory.LongBufferPoolTest.testAllocate

-------------------------------------------------------------------------------
For complete test report and logs see https://nightlies.apache.org/cassandra/Cassandra-3.11/357/