You are viewing a plain text version of this content. The canonical link for it is here.
Posted to builds@solr.apache.org by Apache Jenkins Server <je...@builds.apache.org> on 2026/06/30 11:35:05 UTC
[JENKINS] Solr » Solr-Artifacts-main - Build # 2034 - Failure!
Build: https://ci-builds.apache.org/job/Solr/job/Solr-Artifacts-main/2034/
No tests ran.
Build Log:
[...truncated 560 lines...]
BUILD FAILED in 6m 42s
181 actionable tasks: 181 executed
Build step 'Invoke Gradle script' changed build result to FAILURE
Build step 'Invoke Gradle script' marked build as failure
Archiving artifacts
Publishing Javadoc
Email was triggered for: Failure - Any
Sending email for trigger: Failure - Any
[JENKINS] Solr » Solr-Artifacts-main - Build # 2035 - Still Failing!
Posted by Apache Jenkins Server <je...@builds.apache.org>.
Build: https://ci-builds.apache.org/job/Solr/job/Solr-Artifacts-main/2035/
No tests ran.
Build Log:
[...truncated 561 lines...]
BUILD FAILED in 6m 31s
181 actionable tasks: 181 executed
Build step 'Invoke Gradle script' changed build result to FAILURE
Build step 'Invoke Gradle script' marked build as failure
Archiving artifacts
Publishing Javadoc
Email was triggered for: Failure - Any
Sending email for trigger: Failure - Any