You are viewing a plain text version of this content. The canonical link for it is here.
Posted to builds@beam.apache.org by Apache Jenkins Server <je...@builds.apache.org> on 2022/02/25 12:04:49 UTC

Build failed in Jenkins: beam_PostCommit_XVR_Direct #2336

See <https://ci-beam.apache.org/job/beam_PostCommit_XVR_Direct/2336/display/redirect?page=changes>

Changes:

[noreply] Merge pull request #16846 from [BEAM-12164]: Add sad path tests for


------------------------------------------
Started by timer
Running as SYSTEM
[EnvInject] - Loading node environment variables.
Building remotely on apache-beam-jenkins-4 (beam) in workspace <https://ci-beam.apache.org/job/beam_PostCommit_XVR_Direct/ws/>
The recommended git tool is: NONE
No credentials specified
Wiping out workspace first.
Cloning the remote Git repository
Cloning repository https://github.com/apache/beam.git
 > git init <https://ci-beam.apache.org/job/beam_PostCommit_XVR_Direct/ws/src> # timeout=10
Fetching upstream changes from https://github.com/apache/beam.git
 > git --version # timeout=10
 > git --version # 'git version 2.25.1'
 > git fetch --tags --force --progress -- https://github.com/apache/beam.git +refs/heads/*:refs/remotes/origin/* # timeout=10
 > git config remote.origin.url https://github.com/apache/beam.git # timeout=10
 > git config --add remote.origin.fetch +refs/heads/*:refs/remotes/origin/* # timeout=10
 > git config remote.origin.url https://github.com/apache/beam.git # timeout=10
Fetching upstream changes from https://github.com/apache/beam.git
 > git fetch --tags --force --progress -- https://github.com/apache/beam.git +refs/heads/*:refs/remotes/origin/* +refs/pull/${ghprbPullId}/*:refs/remotes/origin/pr/${ghprbPullId}/* # timeout=10
 > git rev-parse origin/master^{commit} # timeout=10
Checking out Revision 47ab260aaad6b1014d86dd6cf9274f1045690631 (origin/master)
 > git config core.sparsecheckout # timeout=10
 > git checkout -f 47ab260aaad6b1014d86dd6cf9274f1045690631 # timeout=10
Commit message: "Merge pull request #16846 from [BEAM-12164]: Add sad path tests for Cloud Spanner's ReadChangeStream"
 > git rev-list --no-walk 8fcb103a7fc246f24e1e4574e59ce4d5dd184d1d # timeout=10
No emails were triggered.
[EnvInject] - Executing scripts and injecting environment variables after the SCM step.
[EnvInject] - Injecting as environment variables the properties content 
SPARK_LOCAL_IP=127.0.0.1
SETUPTOOLS_USE_DISTUTILS=stdlib

[EnvInject] - Variables injected successfully.
[beam_PostCommit_XVR_Direct] $ /bin/bash -xe /tmp/jenkins2001277998705521950.sh
+ echo '*** RUN CROSS-LANGUAGE DIRECT USING PYTHON 3.6 ***'
*** RUN CROSS-LANGUAGE DIRECT USING PYTHON 3.6 ***
[Gradle] - Launching build.
[src] $ <https://ci-beam.apache.org/job/beam_PostCommit_XVR_Direct/ws/src/gradlew> --continue --max-workers=12 -Dorg.gradle.jvmargs=-Xms2g -Dorg.gradle.jvmargs=-Xmx4g -Dorg.gradle.vfs.watch=false -Pdocker-pull-licenses -PpythonVersion=3.6 :sdks:python:test-suites:direct:xlang:validatesCrossLanguageRunner

FAILURE: Build failed with an exception.

* What went wrong:
Timeout waiting to lock daemon addresses registry. It is currently in use by another Gradle instance.
Owner PID: unknown
Our PID: 2114417
Owner Operation: unknown
Our operation: 
Lock file: /home/jenkins/.gradle/daemon/7.3.2/registry.bin.lock

* Try:
> Run with --stacktrace option to get the stack trace.
> Run with --info or --debug option to get more log output.
> Run with --scan to get full insights.

* Get more help at https://help.gradle.org
Build step 'Invoke Gradle script' changed build result to FAILURE
Build step 'Invoke Gradle script' marked build as failure

---------------------------------------------------------------------
To unsubscribe, e-mail: builds-unsubscribe@beam.apache.org
For additional commands, e-mail: builds-help@beam.apache.org


Jenkins build is back to normal : beam_PostCommit_XVR_Direct #2340

Posted by Apache Jenkins Server <je...@builds.apache.org>.
See <https://ci-beam.apache.org/job/beam_PostCommit_XVR_Direct/2340/display/redirect>


---------------------------------------------------------------------
To unsubscribe, e-mail: builds-unsubscribe@beam.apache.org
For additional commands, e-mail: builds-help@beam.apache.org


Build failed in Jenkins: beam_PostCommit_XVR_Direct #2339

Posted by Apache Jenkins Server <je...@builds.apache.org>.
See <https://ci-beam.apache.org/job/beam_PostCommit_XVR_Direct/2339/display/redirect?page=changes>

Changes:

[noreply] [BEAM-13015] Use a DirectExecutor for state since we are just completing


------------------------------------------
Started by timer
Running as SYSTEM
[EnvInject] - Loading node environment variables.
Building remotely on apache-beam-jenkins-2 (beam) in workspace <https://ci-beam.apache.org/job/beam_PostCommit_XVR_Direct/ws/>
The recommended git tool is: NONE
No credentials specified
Wiping out workspace first.
Cloning the remote Git repository
Cloning repository https://github.com/apache/beam.git
 > git init <https://ci-beam.apache.org/job/beam_PostCommit_XVR_Direct/ws/src> # timeout=10
Fetching upstream changes from https://github.com/apache/beam.git
 > git --version # timeout=10
 > git --version # 'git version 2.25.1'
 > git fetch --tags --force --progress -- https://github.com/apache/beam.git +refs/heads/*:refs/remotes/origin/* # timeout=10
 > git config remote.origin.url https://github.com/apache/beam.git # timeout=10
 > git config --add remote.origin.fetch +refs/heads/*:refs/remotes/origin/* # timeout=10
 > git config remote.origin.url https://github.com/apache/beam.git # timeout=10
Fetching upstream changes from https://github.com/apache/beam.git
 > git fetch --tags --force --progress -- https://github.com/apache/beam.git +refs/heads/*:refs/remotes/origin/* +refs/pull/${ghprbPullId}/*:refs/remotes/origin/pr/${ghprbPullId}/* # timeout=10
 > git rev-parse origin/master^{commit} # timeout=10
Checking out Revision 939af65e68b07889ec7225d379f55f2a0f5f137a (origin/master)
 > git config core.sparsecheckout # timeout=10
 > git checkout -f 939af65e68b07889ec7225d379f55f2a0f5f137a # timeout=10
Commit message: "[BEAM-13015] Use a DirectExecutor for state since we are just completing futures on the callback. (#16745)"
 > git rev-list --no-walk 9ef324791667a6343ce194be9ae553d8ebafd84c # timeout=10
No emails were triggered.
[EnvInject] - Executing scripts and injecting environment variables after the SCM step.
[EnvInject] - Injecting as environment variables the properties content 
SPARK_LOCAL_IP=127.0.0.1
SETUPTOOLS_USE_DISTUTILS=stdlib

[EnvInject] - Variables injected successfully.
[beam_PostCommit_XVR_Direct] $ /bin/bash -xe /tmp/jenkins2022472344196212068.sh
+ echo '*** RUN CROSS-LANGUAGE DIRECT USING PYTHON 3.6 ***'
*** RUN CROSS-LANGUAGE DIRECT USING PYTHON 3.6 ***
[Gradle] - Launching build.
[src] $ <https://ci-beam.apache.org/job/beam_PostCommit_XVR_Direct/ws/src/gradlew> --continue --max-workers=12 -Dorg.gradle.jvmargs=-Xms2g -Dorg.gradle.jvmargs=-Xmx4g -Dorg.gradle.vfs.watch=false -Pdocker-pull-licenses -PpythonVersion=3.6 :sdks:python:test-suites:direct:xlang:validatesCrossLanguageRunner
Configuration on demand is an incubating feature.
The message received from the daemon indicates that the daemon has disappeared.
Build request sent: Build{id=546aa88e-d831-4e1e-a0b5-2fdce724c021, currentDir=<https://ci-beam.apache.org/job/beam_PostCommit_XVR_Direct/ws/src}>
Attempting to read last messages from the daemon log...
Daemon pid: 1220040
  log file: /home/jenkins/.gradle/daemon/7.3.2/daemon-1220040.out.log
----- Last  20 lines from daemon log file - daemon-1220040.out.log -----
2022-02-26T06:08:28.570+0000 [INFO] [org.gradle.launcher.daemon.server.DefaultIncomingConnectionHandler] Received command: Build{id=546aa88e-d831-4e1e-a0b5-2fdce724c021, currentDir=<https://ci-beam.apache.org/job/beam_PostCommit_XVR_Direct/ws/src}.>
2022-02-26T06:08:28.570+0000 [DEBUG] [org.gradle.launcher.daemon.server.DefaultIncomingConnectionHandler] Starting executing command: Build{id=546aa88e-d831-4e1e-a0b5-2fdce724c021, currentDir=<https://ci-beam.apache.org/job/beam_PostCommit_XVR_Direct/ws/src}> with connection: socket connection from /127.0.0.1:33449 to /127.0.0.1:54216.
2022-02-26T06:08:28.571+0000 [DEBUG] [org.gradle.launcher.daemon.server.DaemonStateCoordinator] Command execution: started DaemonCommandExecution[command = Build{id=546aa88e-d831-4e1e-a0b5-2fdce724c021, currentDir=<https://ci-beam.apache.org/job/beam_PostCommit_XVR_Direct/ws/src},> connection = DefaultDaemonConnection: socket connection from /127.0.0.1:33449 to /127.0.0.1:54216] after 0.0 minutes of idle
2022-02-26T06:08:28.571+0000 [INFO] [org.gradle.launcher.daemon.server.DaemonRegistryUpdater] Marking the daemon as busy, address: [483e1621-bf69-45ad-92f8-1a2fb79979f2 port:33449, addresses:[localhost/127.0.0.1]]
2022-02-26T06:08:28.571+0000 [DEBUG] [org.gradle.launcher.daemon.registry.PersistentDaemonRegistry] Marking busy by address: [483e1621-bf69-45ad-92f8-1a2fb79979f2 port:33449, addresses:[localhost/127.0.0.1]]
2022-02-26T06:08:28.571+0000 [DEBUG] [org.gradle.cache.internal.DefaultFileLockManager] Waiting to acquire exclusive lock on daemon addresses registry.
2022-02-26T06:08:28.571+0000 [DEBUG] [org.gradle.cache.internal.DefaultFileLockManager] Lock acquired on daemon addresses registry.
2022-02-26T06:08:28.572+0000 [DEBUG] [org.gradle.cache.internal.DefaultFileLockManager] Releasing lock on daemon addresses registry.
2022-02-26T06:08:28.572+0000 [DEBUG] [org.gradle.launcher.daemon.server.DaemonStateCoordinator] resetting idle timer
2022-02-26T06:08:28.572+0000 [DEBUG] [org.gradle.launcher.daemon.server.DaemonStateCoordinator] daemon is running. Sleeping until state changes.
2022-02-26T06:08:28.572+0000 [INFO] [org.gradle.launcher.daemon.server.exec.StartBuildOrRespondWithBusy] Daemon is about to start building Build{id=546aa88e-d831-4e1e-a0b5-2fdce724c021, currentDir=<https://ci-beam.apache.org/job/beam_PostCommit_XVR_Direct/ws/src}.> Dispatching build started information...
2022-02-26T06:08:28.572+0000 [DEBUG] [org.gradle.launcher.daemon.server.SynchronizedDispatchConnection] thread 27: dispatching org.gradle.launcher.daemon.protocol.BuildStarted@291a00c1
2022-02-26T06:08:28.573+0000 [DEBUG] [org.gradle.launcher.daemon.server.exec.EstablishBuildEnvironment] Configuring env variables: [PATH, RUN_DISPLAY_URL, HUDSON_HOME, RUN_CHANGES_DISPLAY_URL, JOB_URL, HUDSON_COOKIE, MOTD_SHOWN, DBUS_SESSION_BUS_ADDRESS, JENKINS_SERVER_COOKIE, LOGNAME, PWD, RUN_TESTS_DISPLAY_URL, JENKINS_URL, SHELL, BUILD_TAG, ROOT_BUILD_CAUSE, BUILD_CAUSE_TIMERTRIGGER, OLDPWD, GIT_CHECKOUT_DIR, JENKINS_HOME, sha1, CODECOV_TOKEN, NODE_NAME, BUILD_DISPLAY_NAME, JOB_DISPLAY_URL, GIT_BRANCH, SETUPTOOLS_USE_DISTUTILS, SHLVL, WORKSPACE_TMP, GIT_PREVIOUS_COMMIT, JAVA_HOME, BUILD_ID, LANG, XDG_SESSION_ID, XDG_SESSION_TYPE, JOB_NAME, SPARK_LOCAL_IP, BUILD_CAUSE, GIT_PREVIOUS_SUCCESSFUL_COMMIT, NODE_LABELS, HUDSON_URL, WORKSPACE, ROOT_BUILD_CAUSE_TIMERTRIGGER, XDG_SESSION_CLASS, _, GIT_COMMIT, COVERALLS_REPO_TOKEN, CI, EXECUTOR_NUMBER, HUDSON_SERVER_COOKIE, SSH_CLIENT, JOB_BASE_NAME, USER, SSH_CONNECTION, BUILD_NUMBER, BUILD_URL, RUN_ARTIFACTS_DISPLAY_URL, GIT_URL, XDG_RUNTIME_DIR, HOME]
2022-02-26T06:08:28.574+0000 [DEBUG] [org.gradle.launcher.daemon.server.exec.LogToClient] About to start relaying all logs to the client via the connection.
2022-02-26T06:08:28.574+0000 [INFO] [org.gradle.launcher.daemon.server.exec.LogToClient] The client will now receive all logging from the daemon (pid: 1220040). The daemon log file: /home/jenkins/.gradle/daemon/7.3.2/daemon-1220040.out.log
2022-02-26T06:08:28.576+0000 [INFO] [org.gradle.launcher.daemon.server.exec.LogAndCheckHealth] Starting 2nd build in daemon [uptime: 7 mins 54.544 secs, performance: 100%, GC rate: 0.01/s, heap usage: 1% of 2.6 GiB]
2022-02-26T06:08:28.577+0000 [DEBUG] [org.gradle.launcher.daemon.server.exec.ExecuteBuild] The daemon has started executing the build.
2022-02-26T06:08:28.577+0000 [DEBUG] [org.gradle.launcher.daemon.server.exec.ExecuteBuild] Executing build with daemon context: DefaultDaemonContext[uid=c1cf5a65-1095-4a9d-9d9c-9d9e2184e905,javaHome=/usr/lib/jvm/java-8-openjdk-amd64,daemonRegistryDir=/home/jenkins/.gradle/daemon,pid=1220040,idleTimeout=10800000,priority=NORMAL,daemonOpts=-Xmx4g,-Dfile.encoding=UTF-8,-Duser.country=US,-Duser.language=en,-Duser.variant]
Configuration on demand is an incubating feature.
Daemon vm is shutting down... The daemon has exited normally or was terminated in response to a user interrupt.
----- End of the daemon log -----


FAILURE: Build failed with an exception.

* What went wrong:
Gradle build daemon disappeared unexpectedly (it may have been killed or may have crashed)

* Try:
> Run with --stacktrace option to get the stack trace.
> Run with --info or --debug option to get more log output.
> Run with --scan to get full insights.

* Get more help at https://help.gradle.org
Build step 'Invoke Gradle script' changed build result to FAILURE
Build step 'Invoke Gradle script' marked build as failure

---------------------------------------------------------------------
To unsubscribe, e-mail: builds-unsubscribe@beam.apache.org
For additional commands, e-mail: builds-help@beam.apache.org


Build failed in Jenkins: beam_PostCommit_XVR_Direct #2338

Posted by Apache Jenkins Server <je...@builds.apache.org>.
See <https://ci-beam.apache.org/job/beam_PostCommit_XVR_Direct/2338/display/redirect?page=changes>

Changes:

[Ankur Goenka] [BEAM-13952] Sickbaying

[noreply] [BEAM-13912] Add more coverage for dataflow.go (#16903)

[noreply] [BEAM-12563] swaplevel general function for dataframe and series

[noreply] [BEAM-14001] Update coder.go unit tests (#16952)

[noreply] [BEAM-13910] Improve coverage of gcsx package (#16942)


------------------------------------------
[...truncated 528.20 KB...]
      >
      dependencies: <
        type_urn: "beam:artifact:type:file:v1"
        type_payload: "\nF/tmp/artifacts/jaccess-ULFTCPsb6cLYZ0f1BG1FQfczmHNaZCx8plXuRDKpBqE.jar\022@50b15308fb1be9c2d86747f5046d4541f73398735a642c7ca655ee4432a906a1"
        role_urn: "beam:artifact:role:staging_to:v1"
        role_payload: "\n7jaccess-ULFTCPsb6cLYZ0f1BG1FQfczmHNaZCx8plXuRDKpBqE.jar"
      >
      dependencies: <
        type_urn: "beam:artifact:type:file:v1"
        type_payload: "\nI/tmp/artifacts/localedata-dUHqyGxaTVCjfTI8MckPYarZ3_mwf62udkxaHi1aKns.jar\022@7541eac86c5a4d50a37d323c31c90f61aad9dff9b07fadae764c5a1e2d5a2a7b"
        role_urn: "beam:artifact:role:staging_to:v1"
        role_payload: "\n:localedata-dUHqyGxaTVCjfTI8MckPYarZ3_mwf62udkxaHi1aKns.jar"
      >
      dependencies: <
        type_urn: "beam:artifact:type:file:v1"
        type_payload: "\nF/tmp/artifacts/nashorn-XdUndQGroXOP9NCsfITpBERYcbbGXVHLjbvNWXCh-3A.jar\022@5dd5277501aba1738ff4d0ac7c84e904445871b6c65d51cb8dbbcd5970a1fb70"
        role_urn: "beam:artifact:role:staging_to:v1"
        role_payload: "\n7nashorn-XdUndQGroXOP9NCsfITpBERYcbbGXVHLjbvNWXCh-3A.jar"
      >
      dependencies: <
        type_urn: "beam:artifact:type:file:v1"
        type_payload: "\nG/tmp/artifacts/cldrdata-YqzuKX1QnLCOo0cwjKRdBhGrip_ltIJZg-APT60tUPA.jar\022@62acee297d509cb08ea347308ca45d0611ab8a9fe5b4825983e00f4fad2d50f0"
        role_urn: "beam:artifact:role:staging_to:v1"
        role_payload: "\n8cldrdata-YqzuKX1QnLCOo0cwjKRdBhGrip_ltIJZg-APT60tUPA.jar"
      >
      dependencies: <
        type_urn: "beam:artifact:type:file:v1"
        type_payload: "\nD/tmp/artifacts/dnsns-dhEp186udEF6X6chZus-RJzWRmzlccxx1_btlXWayVI.jar\022@761129d7ceae74417a5fa72166eb3e449cd6466ce571cc71d7f6ed95759ac952"
        role_urn: "beam:artifact:role:staging_to:v1"
        role_payload: "\n5dnsns-dhEp186udEF6X6chZus-RJzWRmzlccxx1_btlXWayVI.jar"
      >
      dependencies: <
        type_urn: "beam:artifact:type:file:v1"
        type_payload: "\n{/tmp/artifacts/beam-sdks-java-io-debezium-expansion-service-2.38.0-SNAPSHOT-eGrA82EJkeNlEPGcJqTCwDtUXecXJP0BXB5e1olqoB4.jar\022@786ac0f3610991e36510f19c26a4c2c03b545de71724fd015c1e5ed6896aa01e"
        role_urn: "beam:artifact:role:staging_to:v1"
        role_payload: "\nlbeam-sdks-java-io-debezium-expansion-service-2.38.0-SNAPSHOT-eGrA82EJkeNlEPGcJqTCwDtUXecXJP0BXB5e1olqoB4.jar"
      >
    >
  >
  environments: <
    key: "go"
    value: <
      urn: "beam:env:docker:v1"
      payload: "\n\026apache/beam_go_sdk:dev"
      capabilities: "beam:protocol:progress_reporting:v0"
      capabilities: "beam:protocol:multi_core_bundle_processing:v1"
      capabilities: "beam:version:sdk_base:go"
      capabilities: "beam:coder:bytes:v1"
      capabilities: "beam:coder:bool:v1"
      capabilities: "beam:coder:varint:v1"
      capabilities: "beam:coder:double:v1"
      capabilities: "beam:coder:string_utf8:v1"
      capabilities: "beam:coder:length_prefix:v1"
      capabilities: "beam:coder:kv:v1"
      capabilities: "beam:coder:iterable:v1"
      capabilities: "beam:coder:state_backed_iterable:v1"
      capabilities: "beam:coder:windowed_value:v1"
      capabilities: "beam:coder:global_window:v1"
      capabilities: "beam:coder:interval_window:v1"
      capabilities: "beam:coder:row:v1"
      dependencies: <
        type_urn: "beam:artifact:type:file:v1"
        role_urn: "beam:artifact:role:go_worker_binary:v1"
      >
    >
  >
>
root_transform_ids: "e2"
root_transform_ids: "e3"
root_transform_ids: "s1"
root_transform_ids: "s2"
requirements: "beam:requirement:pardo:splittable_dofn:v1"
2022/02/26 00:24:32 Cross-compiling <https://ci-beam.apache.org/job/beam_PostCommit_XVR_Direct/ws/src/sdks/go/test/integration/io/xlang/debezium/debezium_test.go> as /tmp/worker-1-1645835072628110732
2022/02/26 00:24:34 Prepared job with id: go-testdebeziumio_basicread-a9fc6a33-0c70-4ee4-9a6c-b3df52a24b49 and staging token: go-testdebeziumio_basicread-a9fc6a33-0c70-4ee4-9a6c-b3df52a24b49
2022/02/26 00:24:34 Staged binary artifact with token: 
2022/02/26 00:24:34 Submitted job: go-testdebeziumio_basicread-a9fc6a33-0c70-4ee4-9a6c-b3df52a24b49
2022/02/26 00:24:34 2022-02-26 00:24:34. (1): Make sure that locally built Python SDK docker image has Python 3.6 interpreter.
2022/02/26 00:24:34 2022-02-26 00:24:34. (7): ==================== <function expand_sdf at 0x7f5a699bcf28> ====================
2022/02/26 00:24:34 2022-02-26 00:24:34. (8): ==================== <function expand_gbk at 0x7f5a699bd048> ====================
2022/02/26 00:24:34 2022-02-26 00:24:34. (9): ==================== <function sink_flattens at 0x7f5a699bd158> ====================
2022/02/26 00:24:34 2022-02-26 00:24:34. (10): ==================== <function greedily_fuse at 0x7f5a699bd1e0> ====================
2022/02/26 00:24:34 2022-02-26 00:24:34. (11): ==================== <function read_to_impulse at 0x7f5a699bd268> ====================
2022/02/26 00:24:34 2022-02-26 00:24:34. (12): ==================== <function impulse_to_input at 0x7f5a699bd2f0> ====================
2022/02/26 00:24:34 2022-02-26 00:24:34. (13): ==================== <function sort_stages at 0x7f5a699bd510> ====================
2022/02/26 00:24:34 2022-02-26 00:24:34. (14): ==================== <function setup_timer_mapping at 0x7f5a699bd488> ====================
2022/02/26 00:24:34 2022-02-26 00:24:34. (15): ==================== <function populate_data_channel_coders at 0x7f5a699bd598> ====================
2022/02/26 00:24:34 Job state: STOPPED
2022/02/26 00:24:34 Job state: STARTING
2022/02/26 00:24:34 Job state: RUNNING
2022/02/26 00:24:34 2022-02-26 00:24:34. (16): starting control server on port 45937
2022/02/26 00:24:34 2022-02-26 00:24:34. (17): starting data server on port 38993
2022/02/26 00:24:34 2022-02-26 00:24:34. (18): starting state server on port 42947
2022/02/26 00:24:34 2022-02-26 00:24:34. (19): starting logging server on port 41591
2022/02/26 00:24:34 2022-02-26 00:24:34. (20): Created Worker handler <apache_beam.runners.portability.fn_api_runner.worker_handlers.DockerSdkWorkerHandler object at 0x7f5a50fc35c0> for environment BwDKyIhIANbeam:env:docker:v1 (beam:env:docker:v1, b'\n apache/beam_java8_sdk:2.38.0.dev')
2022/02/26 00:24:38 2022-02-26 00:24:38. (21): Attempting to pull image apache/beam_java8_sdk:2.38.0.dev
2022/02/26 00:24:38 2022-02-26 00:24:38. (22): Unable to pull image apache/beam_java8_sdk:2.38.0.dev, defaulting to local image if it exists
2022/02/26 00:24:39 2022-02-26 00:24:39. (23): Waiting for docker to start up. Current status is running
2022/02/26 00:24:39 2022-02-26 00:24:39. (24): Docker container is running. container_id = b'7245bbcdecb0e4216bda50cd65c80eff5b8cfdf9d92ba539f963c0679be3e394', worker_id = worker_3
2022/02/26 00:24:40 2022-02-26 00:24:40. (25): Running ((((BwDKyIhIANExternal-Create-Values-Read-CreateSource--Impulse)+(BwDKyIhIANExternal-Create-Values-Read-CreateSource--ParDo-OutputSingleSource--ParMultiDo-OutputSingleSource-))+(External/Create.Values/Read(CreateSource)/ParDo(BoundedSourceAsSDFWrapper)/ParMultiDo(BoundedSourceAsSDFWrapper)/PairWithRestriction))+(External/Create.Values/Read(CreateSource)/ParDo(BoundedSourceAsSDFWrapper)/ParMultiDo(BoundedSourceAsSDFWrapper)/SplitAndSizeRestriction))+(BwDKyIhIANExternal/Create.Values/Read(CreateSource)/ParDo(OutputSingleSource)/ParMultiDo(OutputSingleSource).output_split/Write)
2022/02/26 00:24:44 2022-02-26 00:24:44. (26): Running ((((BwDKyIhIANExternal/Create.Values/Read(CreateSource)/ParDo(OutputSingleSource)/ParMultiDo(OutputSingleSource).output_split/Read)+(External/Create.Values/Read(CreateSource)/ParDo(BoundedSourceAsSDFWrapper)/ParMultiDo(BoundedSourceAsSDFWrapper)/Process))+(External/ParDo(KafkaSourceConsumer)/ParMultiDo(KafkaSourceConsumer)/PairWithRestriction))+(External/ParDo(KafkaSourceConsumer)/ParMultiDo(KafkaSourceConsumer)/SplitAndSizeRestriction))+(BwDKyIhIANExternal/Create.Values/Read(CreateSource)/ParDo(BoundedSourceAsSDFWrapper)/ParMultiDo(BoundedSourceAsSDFWrapper).output_split/Write)
2022/02/26 00:24:44 2022-02-26 00:24:44. (27): Running ((BwDKyIhIANExternal/Create.Values/Read(CreateSource)/ParDo(BoundedSourceAsSDFWrapper)/ParMultiDo(BoundedSourceAsSDFWrapper).output_split/Read)+(External/ParDo(KafkaSourceConsumer)/ParMultiDo(KafkaSourceConsumer)/Process))+(BwDKyIhIANExternal/ParDo(KafkaSourceConsumer)/ParMultiDo(KafkaSourceConsumer).output/Write)
2022/02/26 00:26:19 2022-02-26 00:26:19. (28): Created Worker handler <apache_beam.runners.portability.fn_api_runner.worker_handlers.DockerSdkWorkerHandler object at 0x7f5a68051748> for environment go (beam:env:docker:v1, b'\n\x16apache/beam_go_sdk:dev')
2022/02/26 00:26:19 2022-02-26 00:26:19. (29): Attempting to pull image apache/beam_go_sdk:dev
2022/02/26 00:26:19 2022-02-26 00:26:19. (30): Unable to pull image apache/beam_go_sdk:dev, defaulting to local image if it exists
2022/02/26 00:26:31 2022-02-26 00:26:31. (31): Waiting for docker to start up. Current status is running
2022/02/26 00:26:31 2022-02-26 00:26:31. (32): Docker container is running. container_id = b'd89e836b79907985f26a724d6785f620726d7c60517842925e5ec134a86f4d01', worker_id = worker_8
2022/02/26 00:26:32 2022-02-26 00:26:32. (33): Running ((e2)+(e3))+(n3/Write)
2022/02/26 00:26:32 2022-02-26 00:26:32. (34): Running ((((e4)+(e5))+(n7/Write))+(n5/Write))+(n6/Write)
2022/02/26 00:26:32 2022-02-26 00:26:32. (35): Running (e6)+(e7)
2022/02/26 00:26:36 2022-02-26 00:26:36. (36): Successfully completed job in 121.52002024650574 seconds.
2022/02/26 00:26:36 Job state: DONE
--- PASS: TestDebeziumIO_BasicRead (154.35s)
PASS
ok  	github.com/apache/beam/sdks/v2/go/test/integration/io/xlang/debezium	154.388s
=== RUN   TestJDBCIO_BasicReadWrite
2022/02/26 00:24:02 Starting container id: 00334baa35d1 image: testcontainers/ryuk:0.3.3
2022/02/26 00:24:03 Waiting for container id 00334baa35d1 image: testcontainers/ryuk:0.3.3
2022/02/26 00:24:03 Container is ready id: 00334baa35d1 image: testcontainers/ryuk:0.3.3
2022/02/26 00:24:20 Starting container id: 5cecc8460f25 image: postgres
2022/02/26 00:24:20 Waiting for container id 5cecc8460f25 image: postgres
    jdbc_test.go:99: failed to start container: failed to start container: context deadline exceeded
--- FAIL: TestJDBCIO_BasicReadWrite (23.22s)
FAIL
FAIL	github.com/apache/beam/sdks/v2/go/test/integration/io/xlang/jdbc	23.257s
=== RUN   TestKafkaIO_BasicReadWrite
    integration.go:203: Test TestKafkaIO_BasicReadWrite is currently filtered for runner portable
--- SKIP: TestKafkaIO_BasicReadWrite (0.00s)
PASS
ok  	github.com/apache/beam/sdks/v2/go/test/integration/io/xlang/kafka	3.067s
FAIL
$ TEST_EXIT_CODE=0
$ cd ../..
$ exit 1
$ exit 1

> Task :sdks:python:test-suites:direct:xlang:validatesCrossLanguageRunnerGoUsingJava FAILED

> Task :sdks:python:test-suites:direct:xlang:validatesCrossLanguageRunnerPythonUsingJava
>>> RUNNING integration tests with pipeline options: --runner=PortableRunner --job_endpoint=localhost:38345 --environment_cache_millis=10000 --experiments=beam_fn_api
>>>   pytest options: 
>>>   collect markers: -m=xlang_transforms
============================= test session starts ==============================
platform linux -- Python 3.6.15, pytest-4.6.11, py-1.11.0, pluggy-0.13.1
rootdir: <https://ci-beam.apache.org/job/beam_PostCommit_XVR_Direct/ws/src/sdks/python,> inifile: pytest.ini
plugins: xdist-1.34.0, timeout-1.4.2, forked-1.4.0, requests-mock-1.9.3
timeout: 600.0s
timeout method: signal
timeout func_only: False
collected 5235 items / 5225 deselected / 10 selected

apache_beam/io/external/generate_sequence_test.py 
> Task :sdks:python:test-suites:direct:xlang:validatesCrossLanguageRunnerJavaUsingJava
> Task :sdks:python:test-suites:direct:xlang:validatesCrossLanguageRunnerJavaUsingPython
> Task :sdks:python:test-suites:direct:xlang:validatesCrossLanguageRunnerJavaUsingPythonOnly

> Task :sdks:python:test-suites:direct:xlang:validatesCrossLanguageRunnerPythonUsingJava
...                    [ 30%]
apache_beam/transforms/validate_runner_xlang_test.py .......             [100%]

=============================== warnings summary ===============================
apache_beam/io/filesystems_test.py:54
  <https://ci-beam.apache.org/job/beam_PostCommit_XVR_Direct/ws/src/sdks/python/apache_beam/io/filesystems_test.py>:54: DeprecationWarning: invalid escape sequence \c
    self.assertIsNone(FileSystems.get_scheme('c:\\abc\cdf'))  # pylint: disable=anomalous-backslash-in-string

apache_beam/io/filesystems_test.py:62
  <https://ci-beam.apache.org/job/beam_PostCommit_XVR_Direct/ws/src/sdks/python/apache_beam/io/filesystems_test.py>:62: DeprecationWarning: invalid escape sequence \d
    self.assertTrue(isinstance(FileSystems.get_filesystem('c:\\abc\def'),  # pylint: disable=anomalous-backslash-in-string

-- Docs: https://docs.pytest.org/en/latest/warnings.html
- generated xml file: <https://ci-beam.apache.org/job/beam_PostCommit_XVR_Direct/ws/src/sdks/python/pytest_xlangValidateRunner.xml> -
=========== 10 passed, 5225 deselected, 2 warnings in 178.11 seconds ===========

> Task :sdks:python:test-suites:direct:xlang:validatesCrossLanguageRunnerPythonUsingPython
>>> RUNNING integration tests with pipeline options: --runner=PortableRunner --job_endpoint=localhost:38345 --environment_cache_millis=10000 --experiments=beam_fn_api
>>>   pytest options: 
>>>   collect markers: -m=xlang_transforms
============================= test session starts ==============================
platform linux -- Python 3.6.15, pytest-4.6.11, py-1.11.0, pluggy-0.13.1
rootdir: <https://ci-beam.apache.org/job/beam_PostCommit_XVR_Direct/ws/src/sdks/python,> inifile: pytest.ini
plugins: xdist-1.34.0, timeout-1.4.2, forked-1.4.0, requests-mock-1.9.3
timeout: 600.0s
timeout method: signal
timeout func_only: False
collected 5235 items / 5225 deselected / 10 selected

apache_beam/io/external/generate_sequence_test.py .ss                    [ 30%]
apache_beam/transforms/validate_runner_xlang_test.py .......             [100%]

- generated xml file: <https://ci-beam.apache.org/job/beam_PostCommit_XVR_Direct/ws/src/sdks/python/pytest_xlangValidateRunner.xml> -
============ 8 passed, 2 skipped, 5225 deselected in 103.08 seconds ============

> Task :sdks:python:test-suites:direct:xlang:validatesCrossLanguageRunnerPythonUsingSql
>>> RUNNING integration tests with pipeline options: --runner=PortableRunner --job_endpoint=localhost:38345 --environment_cache_millis=10000 --experiments=beam_fn_api
>>>   pytest options: 
>>>   collect markers: -m=xlang_sql_expansion_service
============================= test session starts ==============================
platform linux -- Python 3.6.15, pytest-4.6.11, py-1.11.0, pluggy-0.13.1
rootdir: <https://ci-beam.apache.org/job/beam_PostCommit_XVR_Direct/ws/src/sdks/python,> inifile: pytest.ini
plugins: xdist-1.34.0, timeout-1.4.2, forked-1.4.0, requests-mock-1.9.3
timeout: 600.0s
timeout method: signal
timeout func_only: False
collected 5235 items / 5226 deselected / 9 selected

apache_beam/transforms/sql_test.py .........                             [100%]

- generated xml file: <https://ci-beam.apache.org/job/beam_PostCommit_XVR_Direct/ws/src/sdks/python/pytest_xlangSqlValidateRunner.xml> -
================= 9 passed, 5226 deselected in 267.99 seconds ==================

> Task :sdks:python:test-suites:direct:xlang:validatesCrossLanguageRunnerCleanup
Stopping expansion service pid: 243653.
Stopping expansion service pid: 243654.

> Task :sdks:python:test-suites:direct:xlang:fnApiJobServerCleanup
Killing process at 179255

FAILURE: Build failed with an exception.

* Where:
Build file '<https://ci-beam.apache.org/job/beam_PostCommit_XVR_Direct/ws/src/sdks/go/test/build.gradle'> line: 176

* What went wrong:
Execution failed for task ':sdks:python:test-suites:direct:xlang:validatesCrossLanguageRunnerGoUsingJava'.
> Process 'command 'sh'' finished with non-zero exit value 1

* Try:
> Run with --stacktrace option to get the stack trace.
> Run with --info or --debug option to get more log output.
> Run with --scan to get full insights.

* Get more help at https://help.gradle.org

Deprecated Gradle features were used in this build, making it incompatible with Gradle 8.0.

You can use '--warning-mode all' to show the individual deprecation warnings and determine if they come from your own scripts or plugins.

See https://docs.gradle.org/7.3.2/userguide/command_line_interface.html#sec:command_line_warnings

Execution optimizations have been disabled for 1 invalid unit(s) of work during this build to ensure correctness.
Please consult deprecation warnings for more details.

BUILD FAILED in 39m 36s
233 actionable tasks: 174 executed, 50 from cache, 9 up-to-date

Publishing build scan...
https://gradle.com/s/yyof7thulmd4w

Build step 'Invoke Gradle script' changed build result to FAILURE
Build step 'Invoke Gradle script' marked build as failure

---------------------------------------------------------------------
To unsubscribe, e-mail: builds-unsubscribe@beam.apache.org
For additional commands, e-mail: builds-help@beam.apache.org


Build failed in Jenkins: beam_PostCommit_XVR_Direct #2337

Posted by Apache Jenkins Server <je...@builds.apache.org>.
See <https://ci-beam.apache.org/job/beam_PostCommit_XVR_Direct/2337/display/redirect?page=changes>

Changes:

[noreply] Memoize some objects for timer processing to reduce overhead. (#16207)

[noreply] [BEAM-13965] Use TypeDeserializer if type information is available to


------------------------------------------
Started by timer
Running as SYSTEM
[EnvInject] - Loading node environment variables.
Building remotely on apache-beam-jenkins-4 (beam) in workspace <https://ci-beam.apache.org/job/beam_PostCommit_XVR_Direct/ws/>
The recommended git tool is: NONE
No credentials specified
Wiping out workspace first.
Cloning the remote Git repository
Cloning repository https://github.com/apache/beam.git
 > git init <https://ci-beam.apache.org/job/beam_PostCommit_XVR_Direct/ws/src> # timeout=10
Fetching upstream changes from https://github.com/apache/beam.git
 > git --version # timeout=10
 > git --version # 'git version 2.25.1'
 > git fetch --tags --force --progress -- https://github.com/apache/beam.git +refs/heads/*:refs/remotes/origin/* # timeout=10
 > git config remote.origin.url https://github.com/apache/beam.git # timeout=10
 > git config --add remote.origin.fetch +refs/heads/*:refs/remotes/origin/* # timeout=10
 > git config remote.origin.url https://github.com/apache/beam.git # timeout=10
Fetching upstream changes from https://github.com/apache/beam.git
 > git fetch --tags --force --progress -- https://github.com/apache/beam.git +refs/heads/*:refs/remotes/origin/* +refs/pull/${ghprbPullId}/*:refs/remotes/origin/pr/${ghprbPullId}/* # timeout=10
 > git rev-parse origin/master^{commit} # timeout=10
Checking out Revision daabeba1e9958dea7a132c96f54754b2706e4601 (origin/master)
 > git config core.sparsecheckout # timeout=10
 > git checkout -f daabeba1e9958dea7a132c96f54754b2706e4601 # timeout=10
Commit message: "[BEAM-13965] Use TypeDeserializer if type information is available to support polymorphic types. (#16913)"
 > git rev-list --no-walk 47ab260aaad6b1014d86dd6cf9274f1045690631 # timeout=10
No emails were triggered.
[EnvInject] - Executing scripts and injecting environment variables after the SCM step.
[EnvInject] - Injecting as environment variables the properties content 
SPARK_LOCAL_IP=127.0.0.1
SETUPTOOLS_USE_DISTUTILS=stdlib

[EnvInject] - Variables injected successfully.
[beam_PostCommit_XVR_Direct] $ /bin/bash -xe /tmp/jenkins5325099962208987684.sh
+ echo '*** RUN CROSS-LANGUAGE DIRECT USING PYTHON 3.6 ***'
*** RUN CROSS-LANGUAGE DIRECT USING PYTHON 3.6 ***
[Gradle] - Launching build.
[src] $ <https://ci-beam.apache.org/job/beam_PostCommit_XVR_Direct/ws/src/gradlew> --continue --max-workers=12 -Dorg.gradle.jvmargs=-Xms2g -Dorg.gradle.jvmargs=-Xmx4g -Dorg.gradle.vfs.watch=false -Pdocker-pull-licenses -PpythonVersion=3.6 :sdks:python:test-suites:direct:xlang:validatesCrossLanguageRunner

FAILURE: Build failed with an exception.

* What went wrong:
Timeout waiting to lock daemon addresses registry. It is currently in use by another Gradle instance.
Owner PID: unknown
Our PID: 2123382
Owner Operation: unknown
Our operation: 
Lock file: /home/jenkins/.gradle/daemon/7.3.2/registry.bin.lock

* Try:
> Run with --stacktrace option to get the stack trace.
> Run with --info or --debug option to get more log output.
> Run with --scan to get full insights.

* Get more help at https://help.gradle.org
Build step 'Invoke Gradle script' changed build result to FAILURE
Build step 'Invoke Gradle script' marked build as failure

---------------------------------------------------------------------
To unsubscribe, e-mail: builds-unsubscribe@beam.apache.org
For additional commands, e-mail: builds-help@beam.apache.org