You are viewing a plain text version of this content. The canonical link for it is here.
Posted to builds@lucene.apache.org by Policeman Jenkins Server <je...@thetaphi.de> on 2019/10/08 15:34:05 UTC

[JENKINS] Lucene-Solr-SOLR-13661-Linux (64bit/jdk-11.0.4) - Build # 4 - Still Unstable!

Build: https://jenkins.thetaphi.de/job/Lucene-Solr-SOLR-13661-Linux/4/
Java: 64bit/jdk-11.0.4 -XX:-UseCompressedOops -XX:+UseSerialGC

4 tests failed.
FAILED:  org.apache.solr.handler.TestPackages.testPluginFrompackage

Error Message:
req: org.apache.solr.handler.TestPackages$$Lambda$520/0x00007ff85212acb0@6edff225 . attempt: 9 Mismatch for value : '[config, queryResponseWriter, json1, _packageinfo_, file, id]' in response , {   "responseHeader":{     "status":0,     "QTime":0},   "config":{"queryResponseWriter":{"json1":{         "name":"json1",         "class":"org.apache.solr.core.RuntimeLibResponseWriter",         "package":"global"}}}}

Stack Trace:
java.lang.AssertionError: req: org.apache.solr.handler.TestPackages$$Lambda$520/0x00007ff85212acb0@6edff225 . attempt: 9 Mismatch for value : '[config, queryResponseWriter, json1, _packageinfo_, file, id]' in response , {
  "responseHeader":{
    "status":0,
    "QTime":0},
  "config":{"queryResponseWriter":{"json1":{
        "name":"json1",
        "class":"org.apache.solr.core.RuntimeLibResponseWriter",
        "package":"global"}}}}
	at __randomizedtesting.SeedInfo.seed([BCC2D53CBBFEEB2:DE96CA275C10AC4C]:0)
	at org.junit.Assert.fail(Assert.java:88)
	at org.apache.solr.handler.TestPackages.assertResponseValues(TestPackages.java:130)
	at org.apache.solr.handler.TestPackages.assertResponseValues(TestPackages.java:101)
	at org.apache.solr.handler.TestPackages.testPluginFrompackage(TestPackages.java:489)
	at java.base/jdk.internal.reflect.NativeMethodAccessorImpl.invoke0(Native Method)
	at java.base/jdk.internal.reflect.NativeMethodAccessorImpl.invoke(NativeMethodAccessorImpl.java:62)
	at java.base/jdk.internal.reflect.DelegatingMethodAccessorImpl.invoke(DelegatingMethodAccessorImpl.java:43)
	at java.base/java.lang.reflect.Method.invoke(Method.java:566)
	at com.carrotsearch.randomizedtesting.RandomizedRunner.invoke(RandomizedRunner.java:1750)
	at com.carrotsearch.randomizedtesting.RandomizedRunner$8.evaluate(RandomizedRunner.java:938)
	at com.carrotsearch.randomizedtesting.RandomizedRunner$9.evaluate(RandomizedRunner.java:974)
	at com.carrotsearch.randomizedtesting.RandomizedRunner$10.evaluate(RandomizedRunner.java:988)
	at com.carrotsearch.randomizedtesting.rules.SystemPropertiesRestoreRule$1.evaluate(SystemPropertiesRestoreRule.java:57)
	at org.apache.lucene.util.TestRuleSetupTeardownChained$1.evaluate(TestRuleSetupTeardownChained.java:49)
	at org.apache.lucene.util.AbstractBeforeAfterRule$1.evaluate(AbstractBeforeAfterRule.java:45)
	at org.apache.lucene.util.TestRuleThreadAndTestName$1.evaluate(TestRuleThreadAndTestName.java:48)
	at org.apache.lucene.util.TestRuleIgnoreAfterMaxFailures$1.evaluate(TestRuleIgnoreAfterMaxFailures.java:64)
	at org.apache.lucene.util.TestRuleMarkFailure$1.evaluate(TestRuleMarkFailure.java:47)
	at com.carrotsearch.randomizedtesting.rules.StatementAdapter.evaluate(StatementAdapter.java:36)
	at com.carrotsearch.randomizedtesting.ThreadLeakControl$StatementRunner.run(ThreadLeakControl.java:368)
	at com.carrotsearch.randomizedtesting.ThreadLeakControl.forkTimeoutingTask(ThreadLeakControl.java:817)
	at com.carrotsearch.randomizedtesting.ThreadLeakControl$3.evaluate(ThreadLeakControl.java:468)
	at com.carrotsearch.randomizedtesting.RandomizedRunner.runSingleTest(RandomizedRunner.java:947)
	at com.carrotsearch.randomizedtesting.RandomizedRunner$5.evaluate(RandomizedRunner.java:832)
	at com.carrotsearch.randomizedtesting.RandomizedRunner$6.evaluate(RandomizedRunner.java:883)
	at com.carrotsearch.randomizedtesting.RandomizedRunner$7.evaluate(RandomizedRunner.java:894)
	at com.carrotsearch.randomizedtesting.rules.StatementAdapter.evaluate(StatementAdapter.java:36)
	at com.carrotsearch.randomizedtesting.rules.SystemPropertiesRestoreRule$1.evaluate(SystemPropertiesRestoreRule.java:57)
	at org.apache.lucene.util.AbstractBeforeAfterRule$1.evaluate(AbstractBeforeAfterRule.java:45)
	at com.carrotsearch.randomizedtesting.rules.StatementAdapter.evaluate(StatementAdapter.java:36)
	at org.apache.lucene.util.TestRuleStoreClassName$1.evaluate(TestRuleStoreClassName.java:41)
	at com.carrotsearch.randomizedtesting.rules.NoShadowingOrOverridesOnMethodsRule$1.evaluate(NoShadowingOrOverridesOnMethodsRule.java:40)
	at com.carrotsearch.randomizedtesting.rules.NoShadowingOrOverridesOnMethodsRule$1.evaluate(NoShadowingOrOverridesOnMethodsRule.java:40)
	at com.carrotsearch.randomizedtesting.rules.StatementAdapter.evaluate(StatementAdapter.java:36)
	at com.carrotsearch.randomizedtesting.rules.StatementAdapter.evaluate(StatementAdapter.java:36)
	at org.apache.lucene.util.TestRuleAssertionsRequired$1.evaluate(TestRuleAssertionsRequired.java:53)
	at org.apache.lucene.util.TestRuleMarkFailure$1.evaluate(TestRuleMarkFailure.java:47)
	at org.apache.lucene.util.TestRuleIgnoreAfterMaxFailures$1.evaluate(TestRuleIgnoreAfterMaxFailures.java:64)
	at org.apache.lucene.util.TestRuleIgnoreTestSuites$1.evaluate(TestRuleIgnoreTestSuites.java:54)
	at com.carrotsearch.randomizedtesting.rules.StatementAdapter.evaluate(StatementAdapter.java:36)
	at com.carrotsearch.randomizedtesting.ThreadLeakControl$StatementRunner.run(ThreadLeakControl.java:368)
	at java.base/java.lang.Thread.run(Thread.java:834)


FAILED:  org.apache.solr.handler.TestPackages.testPackageAPI

Error Message:
actual output : {   "responseHeader":{     "status":400,     "QTime":1},   "error":{     "metadata":{       "error-class":"org.apache.solr.api.ApiBag$ExceptionWithErrObject",       "root-error-class":"org.apache.solr.api.ApiBag$ExceptionWithErrObject"},     "details":[{         "add":{           "name":"global",           "version":"0.1",           "file":{             "id":"wrong-id",             "sig":"wrong-sig"}},         "errorMessages":["node not started with enable.package=true"]}],     "msg":"Error in executing commands",     "code":400}}

Stack Trace:
java.lang.AssertionError: actual output : {
  "responseHeader":{
    "status":400,
    "QTime":1},
  "error":{
    "metadata":{
      "error-class":"org.apache.solr.api.ApiBag$ExceptionWithErrObject",
      "root-error-class":"org.apache.solr.api.ApiBag$ExceptionWithErrObject"},
    "details":[{
        "add":{
          "name":"global",
          "version":"0.1",
          "file":{
            "id":"wrong-id",
            "sig":"wrong-sig"}},
        "errorMessages":["node not started with enable.package=true"]}],
    "msg":"Error in executing commands",
    "code":400}}
	at __randomizedtesting.SeedInfo.seed([BCC2D53CBBFEEB2:79C3381D67E4B4A2]:0)
	at org.junit.Assert.fail(Assert.java:88)
	at org.junit.Assert.assertTrue(Assert.java:41)
	at org.apache.solr.handler.TestPackages.testPackageAPI(TestPackages.java:180)
	at java.base/jdk.internal.reflect.NativeMethodAccessorImpl.invoke0(Native Method)
	at java.base/jdk.internal.reflect.NativeMethodAccessorImpl.invoke(NativeMethodAccessorImpl.java:62)
	at java.base/jdk.internal.reflect.DelegatingMethodAccessorImpl.invoke(DelegatingMethodAccessorImpl.java:43)
	at java.base/java.lang.reflect.Method.invoke(Method.java:566)
	at com.carrotsearch.randomizedtesting.RandomizedRunner.invoke(RandomizedRunner.java:1750)
	at com.carrotsearch.randomizedtesting.RandomizedRunner$8.evaluate(RandomizedRunner.java:938)
	at com.carrotsearch.randomizedtesting.RandomizedRunner$9.evaluate(RandomizedRunner.java:974)
	at com.carrotsearch.randomizedtesting.RandomizedRunner$10.evaluate(RandomizedRunner.java:988)
	at com.carrotsearch.randomizedtesting.rules.SystemPropertiesRestoreRule$1.evaluate(SystemPropertiesRestoreRule.java:57)
	at org.apache.lucene.util.TestRuleSetupTeardownChained$1.evaluate(TestRuleSetupTeardownChained.java:49)
	at org.apache.lucene.util.AbstractBeforeAfterRule$1.evaluate(AbstractBeforeAfterRule.java:45)
	at org.apache.lucene.util.TestRuleThreadAndTestName$1.evaluate(TestRuleThreadAndTestName.java:48)
	at org.apache.lucene.util.TestRuleIgnoreAfterMaxFailures$1.evaluate(TestRuleIgnoreAfterMaxFailures.java:64)
	at org.apache.lucene.util.TestRuleMarkFailure$1.evaluate(TestRuleMarkFailure.java:47)
	at com.carrotsearch.randomizedtesting.rules.StatementAdapter.evaluate(StatementAdapter.java:36)
	at com.carrotsearch.randomizedtesting.ThreadLeakControl$StatementRunner.run(ThreadLeakControl.java:368)
	at com.carrotsearch.randomizedtesting.ThreadLeakControl.forkTimeoutingTask(ThreadLeakControl.java:817)
	at com.carrotsearch.randomizedtesting.ThreadLeakControl$3.evaluate(ThreadLeakControl.java:468)
	at com.carrotsearch.randomizedtesting.RandomizedRunner.runSingleTest(RandomizedRunner.java:947)
	at com.carrotsearch.randomizedtesting.RandomizedRunner$5.evaluate(RandomizedRunner.java:832)
	at com.carrotsearch.randomizedtesting.RandomizedRunner$6.evaluate(RandomizedRunner.java:883)
	at com.carrotsearch.randomizedtesting.RandomizedRunner$7.evaluate(RandomizedRunner.java:894)
	at com.carrotsearch.randomizedtesting.rules.StatementAdapter.evaluate(StatementAdapter.java:36)
	at com.carrotsearch.randomizedtesting.rules.SystemPropertiesRestoreRule$1.evaluate(SystemPropertiesRestoreRule.java:57)
	at org.apache.lucene.util.AbstractBeforeAfterRule$1.evaluate(AbstractBeforeAfterRule.java:45)
	at com.carrotsearch.randomizedtesting.rules.StatementAdapter.evaluate(StatementAdapter.java:36)
	at org.apache.lucene.util.TestRuleStoreClassName$1.evaluate(TestRuleStoreClassName.java:41)
	at com.carrotsearch.randomizedtesting.rules.NoShadowingOrOverridesOnMethodsRule$1.evaluate(NoShadowingOrOverridesOnMethodsRule.java:40)
	at com.carrotsearch.randomizedtesting.rules.NoShadowingOrOverridesOnMethodsRule$1.evaluate(NoShadowingOrOverridesOnMethodsRule.java:40)
	at com.carrotsearch.randomizedtesting.rules.StatementAdapter.evaluate(StatementAdapter.java:36)
	at com.carrotsearch.randomizedtesting.rules.StatementAdapter.evaluate(StatementAdapter.java:36)
	at org.apache.lucene.util.TestRuleAssertionsRequired$1.evaluate(TestRuleAssertionsRequired.java:53)
	at org.apache.lucene.util.TestRuleMarkFailure$1.evaluate(TestRuleMarkFailure.java:47)
	at org.apache.lucene.util.TestRuleIgnoreAfterMaxFailures$1.evaluate(TestRuleIgnoreAfterMaxFailures.java:64)
	at org.apache.lucene.util.TestRuleIgnoreTestSuites$1.evaluate(TestRuleIgnoreTestSuites.java:54)
	at com.carrotsearch.randomizedtesting.rules.StatementAdapter.evaluate(StatementAdapter.java:36)
	at com.carrotsearch.randomizedtesting.ThreadLeakControl$StatementRunner.run(ThreadLeakControl.java:368)
	at java.base/java.lang.Thread.run(Thread.java:834)


FAILED:  org.apache.solr.handler.TestPackages.testPluginFrompackage

Error Message:
Error from server at http://127.0.0.1:43951/solr: Error in executing commands

Stack Trace:
org.apache.solr.client.solrj.impl.HttpSolrClient$RemoteExecutionException: Error from server at http://127.0.0.1:43951/solr: Error in executing commands
	at __randomizedtesting.SeedInfo.seed([BCC2D53CBBFEEB2:DE96CA275C10AC4C]:0)
	at org.apache.solr.client.solrj.impl.BaseHttpSolrClient$RemoteExecutionException.create(BaseHttpSolrClient.java:66)
	at org.apache.solr.client.solrj.impl.HttpSolrClient.executeMethod(HttpSolrClient.java:642)
	at org.apache.solr.client.solrj.impl.HttpSolrClient.request(HttpSolrClient.java:265)
	at org.apache.solr.client.solrj.impl.HttpSolrClient.request(HttpSolrClient.java:248)
	at org.apache.solr.client.solrj.impl.LBSolrClient.doRequest(LBSolrClient.java:368)
	at org.apache.solr.client.solrj.impl.LBSolrClient.request(LBSolrClient.java:296)
	at org.apache.solr.client.solrj.impl.BaseCloudSolrClient.sendRequest(BaseCloudSolrClient.java:1128)
	at org.apache.solr.client.solrj.impl.BaseCloudSolrClient.requestWithRetryOnStaleState(BaseCloudSolrClient.java:897)
	at org.apache.solr.client.solrj.impl.BaseCloudSolrClient.request(BaseCloudSolrClient.java:829)
	at org.apache.solr.client.solrj.SolrRequest.process(SolrRequest.java:207)
	at org.apache.solr.client.solrj.SolrRequest.process(SolrRequest.java:224)
	at org.apache.solr.handler.TestPackages.testPluginFrompackage(TestPackages.java:462)
	at java.base/jdk.internal.reflect.NativeMethodAccessorImpl.invoke0(Native Method)
	at java.base/jdk.internal.reflect.NativeMethodAccessorImpl.invoke(NativeMethodAccessorImpl.java:62)
	at java.base/jdk.internal.reflect.DelegatingMethodAccessorImpl.invoke(DelegatingMethodAccessorImpl.java:43)
	at java.base/java.lang.reflect.Method.invoke(Method.java:566)
	at com.carrotsearch.randomizedtesting.RandomizedRunner.invoke(RandomizedRunner.java:1750)
	at com.carrotsearch.randomizedtesting.RandomizedRunner$8.evaluate(RandomizedRunner.java:938)
	at com.carrotsearch.randomizedtesting.RandomizedRunner$9.evaluate(RandomizedRunner.java:974)
	at com.carrotsearch.randomizedtesting.RandomizedRunner$10.evaluate(RandomizedRunner.java:988)
	at com.carrotsearch.randomizedtesting.rules.SystemPropertiesRestoreRule$1.evaluate(SystemPropertiesRestoreRule.java:57)
	at org.apache.lucene.util.TestRuleSetupTeardownChained$1.evaluate(TestRuleSetupTeardownChained.java:49)
	at org.apache.lucene.util.AbstractBeforeAfterRule$1.evaluate(AbstractBeforeAfterRule.java:45)
	at org.apache.lucene.util.TestRuleThreadAndTestName$1.evaluate(TestRuleThreadAndTestName.java:48)
	at org.apache.lucene.util.TestRuleIgnoreAfterMaxFailures$1.evaluate(TestRuleIgnoreAfterMaxFailures.java:64)
	at org.apache.lucene.util.TestRuleMarkFailure$1.evaluate(TestRuleMarkFailure.java:47)
	at com.carrotsearch.randomizedtesting.rules.StatementAdapter.evaluate(StatementAdapter.java:36)
	at com.carrotsearch.randomizedtesting.ThreadLeakControl$StatementRunner.run(ThreadLeakControl.java:368)
	at com.carrotsearch.randomizedtesting.ThreadLeakControl.forkTimeoutingTask(ThreadLeakControl.java:817)
	at com.carrotsearch.randomizedtesting.ThreadLeakControl$3.evaluate(ThreadLeakControl.java:468)
	at com.carrotsearch.randomizedtesting.RandomizedRunner.runSingleTest(RandomizedRunner.java:947)
	at com.carrotsearch.randomizedtesting.RandomizedRunner$5.evaluate(RandomizedRunner.java:832)
	at com.carrotsearch.randomizedtesting.RandomizedRunner$6.evaluate(RandomizedRunner.java:883)
	at com.carrotsearch.randomizedtesting.RandomizedRunner$7.evaluate(RandomizedRunner.java:894)
	at com.carrotsearch.randomizedtesting.rules.StatementAdapter.evaluate(StatementAdapter.java:36)
	at com.carrotsearch.randomizedtesting.rules.SystemPropertiesRestoreRule$1.evaluate(SystemPropertiesRestoreRule.java:57)
	at org.apache.lucene.util.AbstractBeforeAfterRule$1.evaluate(AbstractBeforeAfterRule.java:45)
	at com.carrotsearch.randomizedtesting.rules.StatementAdapter.evaluate(StatementAdapter.java:36)
	at org.apache.lucene.util.TestRuleStoreClassName$1.evaluate(TestRuleStoreClassName.java:41)
	at com.carrotsearch.randomizedtesting.rules.NoShadowingOrOverridesOnMethodsRule$1.evaluate(NoShadowingOrOverridesOnMethodsRule.java:40)
	at com.carrotsearch.randomizedtesting.rules.NoShadowingOrOverridesOnMethodsRule$1.evaluate(NoShadowingOrOverridesOnMethodsRule.java:40)
	at com.carrotsearch.randomizedtesting.rules.StatementAdapter.evaluate(StatementAdapter.java:36)
	at com.carrotsearch.randomizedtesting.rules.StatementAdapter.evaluate(StatementAdapter.java:36)
	at org.apache.lucene.util.TestRuleAssertionsRequired$1.evaluate(TestRuleAssertionsRequired.java:53)
	at org.apache.lucene.util.TestRuleMarkFailure$1.evaluate(TestRuleMarkFailure.java:47)
	at org.apache.lucene.util.TestRuleIgnoreAfterMaxFailures$1.evaluate(TestRuleIgnoreAfterMaxFailures.java:64)
	at org.apache.lucene.util.TestRuleIgnoreTestSuites$1.evaluate(TestRuleIgnoreTestSuites.java:54)
	at com.carrotsearch.randomizedtesting.rules.StatementAdapter.evaluate(StatementAdapter.java:36)
	at com.carrotsearch.randomizedtesting.ThreadLeakControl$StatementRunner.run(ThreadLeakControl.java:368)
	at java.base/java.lang.Thread.run(Thread.java:834)


FAILED:  org.apache.solr.handler.TestPackages.testRuntimeLibWithSig2048

Error Message:


Stack Trace:
java.lang.AssertionError
	at __randomizedtesting.SeedInfo.seed([BCC2D53CBBFEEB2:D6A10EFB6B0B74D3]:0)
	at org.junit.Assert.fail(Assert.java:86)
	at org.junit.Assert.assertTrue(Assert.java:41)
	at org.junit.Assert.assertTrue(Assert.java:52)
	at org.apache.solr.handler.TestPackages.testRuntimeLibWithSig2048(TestPackages.java:322)
	at java.base/jdk.internal.reflect.NativeMethodAccessorImpl.invoke0(Native Method)
	at java.base/jdk.internal.reflect.NativeMethodAccessorImpl.invoke(NativeMethodAccessorImpl.java:62)
	at java.base/jdk.internal.reflect.DelegatingMethodAccessorImpl.invoke(DelegatingMethodAccessorImpl.java:43)
	at java.base/java.lang.reflect.Method.invoke(Method.java:566)
	at com.carrotsearch.randomizedtesting.RandomizedRunner.invoke(RandomizedRunner.java:1750)
	at com.carrotsearch.randomizedtesting.RandomizedRunner$8.evaluate(RandomizedRunner.java:938)
	at com.carrotsearch.randomizedtesting.RandomizedRunner$9.evaluate(RandomizedRunner.java:974)
	at com.carrotsearch.randomizedtesting.RandomizedRunner$10.evaluate(RandomizedRunner.java:988)
	at com.carrotsearch.randomizedtesting.rules.SystemPropertiesRestoreRule$1.evaluate(SystemPropertiesRestoreRule.java:57)
	at org.apache.lucene.util.TestRuleSetupTeardownChained$1.evaluate(TestRuleSetupTeardownChained.java:49)
	at org.apache.lucene.util.AbstractBeforeAfterRule$1.evaluate(AbstractBeforeAfterRule.java:45)
	at org.apache.lucene.util.TestRuleThreadAndTestName$1.evaluate(TestRuleThreadAndTestName.java:48)
	at org.apache.lucene.util.TestRuleIgnoreAfterMaxFailures$1.evaluate(TestRuleIgnoreAfterMaxFailures.java:64)
	at org.apache.lucene.util.TestRuleMarkFailure$1.evaluate(TestRuleMarkFailure.java:47)
	at com.carrotsearch.randomizedtesting.rules.StatementAdapter.evaluate(StatementAdapter.java:36)
	at com.carrotsearch.randomizedtesting.ThreadLeakControl$StatementRunner.run(ThreadLeakControl.java:368)
	at com.carrotsearch.randomizedtesting.ThreadLeakControl.forkTimeoutingTask(ThreadLeakControl.java:817)
	at com.carrotsearch.randomizedtesting.ThreadLeakControl$3.evaluate(ThreadLeakControl.java:468)
	at com.carrotsearch.randomizedtesting.RandomizedRunner.runSingleTest(RandomizedRunner.java:947)
	at com.carrotsearch.randomizedtesting.RandomizedRunner$5.evaluate(RandomizedRunner.java:832)
	at com.carrotsearch.randomizedtesting.RandomizedRunner$6.evaluate(RandomizedRunner.java:883)
	at com.carrotsearch.randomizedtesting.RandomizedRunner$7.evaluate(RandomizedRunner.java:894)
	at com.carrotsearch.randomizedtesting.rules.StatementAdapter.evaluate(StatementAdapter.java:36)
	at com.carrotsearch.randomizedtesting.rules.SystemPropertiesRestoreRule$1.evaluate(SystemPropertiesRestoreRule.java:57)
	at org.apache.lucene.util.AbstractBeforeAfterRule$1.evaluate(AbstractBeforeAfterRule.java:45)
	at com.carrotsearch.randomizedtesting.rules.StatementAdapter.evaluate(StatementAdapter.java:36)
	at org.apache.lucene.util.TestRuleStoreClassName$1.evaluate(TestRuleStoreClassName.java:41)
	at com.carrotsearch.randomizedtesting.rules.NoShadowingOrOverridesOnMethodsRule$1.evaluate(NoShadowingOrOverridesOnMethodsRule.java:40)
	at com.carrotsearch.randomizedtesting.rules.NoShadowingOrOverridesOnMethodsRule$1.evaluate(NoShadowingOrOverridesOnMethodsRule.java:40)
	at com.carrotsearch.randomizedtesting.rules.StatementAdapter.evaluate(StatementAdapter.java:36)
	at com.carrotsearch.randomizedtesting.rules.StatementAdapter.evaluate(StatementAdapter.java:36)
	at org.apache.lucene.util.TestRuleAssertionsRequired$1.evaluate(TestRuleAssertionsRequired.java:53)
	at org.apache.lucene.util.TestRuleMarkFailure$1.evaluate(TestRuleMarkFailure.java:47)
	at org.apache.lucene.util.TestRuleIgnoreAfterMaxFailures$1.evaluate(TestRuleIgnoreAfterMaxFailures.java:64)
	at org.apache.lucene.util.TestRuleIgnoreTestSuites$1.evaluate(TestRuleIgnoreTestSuites.java:54)
	at com.carrotsearch.randomizedtesting.rules.StatementAdapter.evaluate(StatementAdapter.java:36)
	at com.carrotsearch.randomizedtesting.ThreadLeakControl$StatementRunner.run(ThreadLeakControl.java:368)
	at java.base/java.lang.Thread.run(Thread.java:834)




Build Log:
[...truncated 14946 lines...]
   [junit4] Suite: org.apache.solr.handler.TestPackages
   [junit4]   2> 2090205 INFO  (SUITE-TestPackages-seed#[BCC2D53CBBFEEB2]-worker) [     ] o.a.s.SolrTestCaseJ4 SecureRandom sanity checks: test.solr.allowed.securerandom=null & java.security.egd=file:/dev/./urandom
   [junit4]   2> 2090206 INFO  (SUITE-TestPackages-seed#[BCC2D53CBBFEEB2]-worker) [     ] o.a.s.SolrTestCaseJ4 Created dataDir: /home/jenkins/workspace/Lucene-Solr-SOLR-13661-Linux/solr/build/solr-core/test/J1/temp/solr.handler.TestPackages_BCC2D53CBBFEEB2-001/data-dir-194-001
   [junit4]   2> 2090206 WARN  (SUITE-TestPackages-seed#[BCC2D53CBBFEEB2]-worker) [     ] o.a.s.SolrTestCaseJ4 startTrackingSearchers: numOpens=3 numCloses=3
   [junit4]   2> 2090206 INFO  (SUITE-TestPackages-seed#[BCC2D53CBBFEEB2]-worker) [     ] o.a.s.SolrTestCaseJ4 Using PointFields (NUMERIC_POINTS_SYSPROP=true) w/NUMERIC_DOCVALUES_SYSPROP=true
   [junit4]   2> 2090206 INFO  (SUITE-TestPackages-seed#[BCC2D53CBBFEEB2]-worker) [     ] o.a.s.SolrTestCaseJ4 Randomized ssl (false) and clientAuth (false) via: @org.apache.solr.SolrTestCaseJ4$SuppressSSL(bugUrl="None")
   [junit4]   2> 2090208 INFO  (TEST-TestPackages.testSetClusterReqHandler-seed#[BCC2D53CBBFEEB2]) [     ] o.a.s.SolrTestCaseJ4 ###Starting testSetClusterReqHandler
   [junit4]   2> 2090208 INFO  (TEST-TestPackages.testSetClusterReqHandler-seed#[BCC2D53CBBFEEB2]) [     ] o.a.s.c.MiniSolrCloudCluster Starting cluster of 4 servers in /home/jenkins/workspace/Lucene-Solr-SOLR-13661-Linux/solr/build/solr-core/test/J1/temp/solr.handler.TestPackages_BCC2D53CBBFEEB2-001/tempDir-001
   [junit4]   2> 2090208 INFO  (TEST-TestPackages.testSetClusterReqHandler-seed#[BCC2D53CBBFEEB2]) [     ] o.a.s.c.ZkTestServer STARTING ZK TEST SERVER
   [junit4]   2> 2090208 INFO  (ZkTestServer Run Thread) [     ] o.a.s.c.ZkTestServer client port:0.0.0.0/0.0.0.0:0
   [junit4]   2> 2090208 INFO  (ZkTestServer Run Thread) [     ] o.a.s.c.ZkTestServer Starting server
   [junit4]   2> 2090308 INFO  (TEST-TestPackages.testSetClusterReqHandler-seed#[BCC2D53CBBFEEB2]) [     ] o.a.s.c.ZkTestServer start zk server on port:38277
   [junit4]   2> 2090308 INFO  (TEST-TestPackages.testSetClusterReqHandler-seed#[BCC2D53CBBFEEB2]) [     ] o.a.s.c.ZkTestServer waitForServerUp: 127.0.0.1:38277
   [junit4]   2> 2090308 INFO  (TEST-TestPackages.testSetClusterReqHandler-seed#[BCC2D53CBBFEEB2]) [     ] o.a.s.c.ZkTestServer parse host and port list: 127.0.0.1:38277
   [junit4]   2> 2090308 INFO  (TEST-TestPackages.testSetClusterReqHandler-seed#[BCC2D53CBBFEEB2]) [     ] o.a.s.c.ZkTestServer connecting to 127.0.0.1 38277
   [junit4]   2> 2090309 INFO  (TEST-TestPackages.testSetClusterReqHandler-seed#[BCC2D53CBBFEEB2]) [     ] o.a.s.c.c.ConnectionManager Waiting for client to connect to ZooKeeper
   [junit4]   2> 2090311 INFO  (zkConnectionManagerCallback-13265-thread-1) [     ] o.a.s.c.c.ConnectionManager zkClient has connected
   [junit4]   2> 2090311 INFO  (TEST-TestPackages.testSetClusterReqHandler-seed#[BCC2D53CBBFEEB2]) [     ] o.a.s.c.c.ConnectionManager Client is connected to ZooKeeper
   [junit4]   2> 2090313 INFO  (TEST-TestPackages.testSetClusterReqHandler-seed#[BCC2D53CBBFEEB2]) [     ] o.a.s.c.c.ConnectionManager Waiting for client to connect to ZooKeeper
   [junit4]   2> 2090313 INFO  (zkConnectionManagerCallback-13267-thread-1) [     ] o.a.s.c.c.ConnectionManager zkClient has connected
   [junit4]   2> 2090313 INFO  (TEST-TestPackages.testSetClusterReqHandler-seed#[BCC2D53CBBFEEB2]) [     ] o.a.s.c.c.ConnectionManager Client is connected to ZooKeeper
   [junit4]   2> 2090314 INFO  (TEST-TestPackages.testSetClusterReqHandler-seed#[BCC2D53CBBFEEB2]) [     ] o.a.s.c.c.ConnectionManager Waiting for client to connect to ZooKeeper
   [junit4]   2> 2090314 INFO  (zkConnectionManagerCallback-13269-thread-1) [     ] o.a.s.c.c.ConnectionManager zkClient has connected
   [junit4]   2> 2090314 INFO  (TEST-TestPackages.testSetClusterReqHandler-seed#[BCC2D53CBBFEEB2]) [     ] o.a.s.c.c.ConnectionManager Client is connected to ZooKeeper
   [junit4]   2> 2090416 WARN  (jetty-launcher-13270-thread-3) [     ] o.e.j.s.AbstractConnector Ignoring deprecated socket close linger time
   [junit4]   2> 2090416 WARN  (jetty-launcher-13270-thread-4) [     ] o.e.j.s.AbstractConnector Ignoring deprecated socket close linger time
   [junit4]   2> 2090416 WARN  (jetty-launcher-13270-thread-2) [     ] o.e.j.s.AbstractConnector Ignoring deprecated socket close linger time
   [junit4]   2> 2090416 WARN  (jetty-launcher-13270-thread-1) [     ] o.e.j.s.AbstractConnector Ignoring deprecated socket close linger time
   [junit4]   2> 2090416 INFO  (jetty-launcher-13270-thread-4) [     ] o.a.s.c.s.e.JettySolrRunner Start Jetty (original configured port=0)
   [junit4]   2> 2090416 INFO  (jetty-launcher-13270-thread-1) [     ] o.a.s.c.s.e.JettySolrRunner Start Jetty (original configured port=0)
   [junit4]   2> 2090416 INFO  (jetty-launcher-13270-thread-2) [     ] o.a.s.c.s.e.JettySolrRunner Start Jetty (original configured port=0)
   [junit4]   2> 2090416 INFO  (jetty-launcher-13270-thread-4) [     ] o.a.s.c.s.e.JettySolrRunner Trying to start Jetty on port 0 try number 1 ...
   [junit4]   2> 2090417 INFO  (jetty-launcher-13270-thread-4) [     ] o.e.j.s.Server jetty-9.4.19.v20190610; built: 2019-06-10T16:30:51.723Z; git: afcf563148970e98786327af5e07c261fda175d3; jvm 11.0.4+11
   [junit4]   2> 2090417 INFO  (jetty-launcher-13270-thread-2) [     ] o.a.s.c.s.e.JettySolrRunner Trying to start Jetty on port 0 try number 1 ...
   [junit4]   2> 2090417 INFO  (jetty-launcher-13270-thread-2) [     ] o.e.j.s.Server jetty-9.4.19.v20190610; built: 2019-06-10T16:30:51.723Z; git: afcf563148970e98786327af5e07c261fda175d3; jvm 11.0.4+11
   [junit4]   2> 2090417 INFO  (jetty-launcher-13270-thread-1) [     ] o.a.s.c.s.e.JettySolrRunner Trying to start Jetty on port 0 try number 1 ...
   [junit4]   2> 2090417 INFO  (jetty-launcher-13270-thread-1) [     ] o.e.j.s.Server jetty-9.4.19.v20190610; built: 2019-06-10T16:30:51.723Z; git: afcf563148970e98786327af5e07c261fda175d3; jvm 11.0.4+11
   [junit4]   2> 2090417 INFO  (jetty-launcher-13270-thread-3) [     ] o.a.s.c.s.e.JettySolrRunner Start Jetty (original configured port=0)
   [junit4]   2> 2090417 INFO  (jetty-launcher-13270-thread-3) [     ] o.a.s.c.s.e.JettySolrRunner Trying to start Jetty on port 0 try number 1 ...
   [junit4]   2> 2090417 INFO  (jetty-launcher-13270-thread-3) [     ] o.e.j.s.Server jetty-9.4.19.v20190610; built: 2019-06-10T16:30:51.723Z; git: afcf563148970e98786327af5e07c261fda175d3; jvm 11.0.4+11
   [junit4]   2> 2090419 INFO  (jetty-launcher-13270-thread-1) [     ] o.e.j.s.session DefaultSessionIdManager workerName=node0
   [junit4]   2> 2090420 INFO  (jetty-launcher-13270-thread-1) [     ] o.e.j.s.session No SessionScavenger set, using defaults
   [junit4]   2> 2090420 INFO  (jetty-launcher-13270-thread-1) [     ] o.e.j.s.session node0 Scavenging every 600000ms
   [junit4]   2> 2090420 INFO  (jetty-launcher-13270-thread-2) [     ] o.e.j.s.session DefaultSessionIdManager workerName=node0
   [junit4]   2> 2090420 INFO  (jetty-launcher-13270-thread-1) [     ] o.e.j.s.h.ContextHandler Started o.e.j.s.ServletContextHandler@21d2c65e{/solr,null,AVAILABLE}
   [junit4]   2> 2090420 INFO  (jetty-launcher-13270-thread-2) [     ] o.e.j.s.session No SessionScavenger set, using defaults
   [junit4]   2> 2090420 INFO  (jetty-launcher-13270-thread-3) [     ] o.e.j.s.session DefaultSessionIdManager workerName=node0
   [junit4]   2> 2090420 INFO  (jetty-launcher-13270-thread-3) [     ] o.e.j.s.session No SessionScavenger set, using defaults
   [junit4]   2> 2090420 INFO  (jetty-launcher-13270-thread-3) [     ] o.e.j.s.session node0 Scavenging every 600000ms
   [junit4]   2> 2090420 INFO  (jetty-launcher-13270-thread-2) [     ] o.e.j.s.session node0 Scavenging every 600000ms
   [junit4]   2> 2090420 INFO  (jetty-launcher-13270-thread-3) [     ] o.e.j.s.h.ContextHandler Started o.e.j.s.ServletContextHandler@666e85f5{/solr,null,AVAILABLE}
   [junit4]   2> 2090420 INFO  (jetty-launcher-13270-thread-1) [     ] o.e.j.s.AbstractConnector Started ServerConnector@29427cee{HTTP/1.1,[http/1.1, h2c]}{127.0.0.1:34787}
   [junit4]   2> 2090420 INFO  (jetty-launcher-13270-thread-1) [     ] o.e.j.s.Server Started @2090446ms
   [junit4]   2> 2090420 INFO  (jetty-launcher-13270-thread-1) [     ] o.a.s.c.s.e.JettySolrRunner Jetty properties: {hostContext=/solr, hostPort=34787}
   [junit4]   2> 2090420 ERROR (jetty-launcher-13270-thread-1) [     ] o.a.s.u.StartupLoggingUtils Missing Java Option solr.log.dir. Logging may be missing or incomplete.
   [junit4]   2> 2090420 INFO  (jetty-launcher-13270-thread-1) [     ] o.a.s.s.SolrDispatchFilter Using logger factory org.apache.logging.slf4j.Log4jLoggerFactory
   [junit4]   2> 2090420 INFO  (jetty-launcher-13270-thread-1) [     ] o.a.s.s.SolrDispatchFilter  ___      _       Welcome to Apache Solr? version 9.0.0
   [junit4]   2> 2090420 INFO  (jetty-launcher-13270-thread-1) [     ] o.a.s.s.SolrDispatchFilter / __| ___| |_ _   Starting in cloud mode on port null
   [junit4]   2> 2090420 INFO  (jetty-launcher-13270-thread-1) [     ] o.a.s.s.SolrDispatchFilter \__ \/ _ \ | '_|  Install dir: null
   [junit4]   2> 2090420 INFO  (jetty-launcher-13270-thread-1) [     ] o.a.s.s.SolrDispatchFilter |___/\___/_|_|    Start time: 2019-10-08T15:06:09.881856Z
   [junit4]   2> 2090420 INFO  (jetty-launcher-13270-thread-3) [     ] o.e.j.s.AbstractConnector Started ServerConnector@3b3e60c5{HTTP/1.1,[http/1.1, h2c]}{127.0.0.1:34769}
   [junit4]   2> 2090420 INFO  (jetty-launcher-13270-thread-3) [     ] o.e.j.s.Server Started @2090447ms
   [junit4]   2> 2090420 INFO  (jetty-launcher-13270-thread-3) [     ] o.a.s.c.s.e.JettySolrRunner Jetty properties: {hostContext=/solr, hostPort=34769}
   [junit4]   2> 2090421 INFO  (jetty-launcher-13270-thread-4) [     ] o.e.j.s.session DefaultSessionIdManager workerName=node0
   [junit4]   2> 2090421 INFO  (jetty-launcher-13270-thread-4) [     ] o.e.j.s.session No SessionScavenger set, using defaults
   [junit4]   2> 2090421 ERROR (jetty-launcher-13270-thread-3) [     ] o.a.s.u.StartupLoggingUtils Missing Java Option solr.log.dir. Logging may be missing or incomplete.
   [junit4]   2> 2090421 INFO  (jetty-launcher-13270-thread-3) [     ] o.a.s.s.SolrDispatchFilter Using logger factory org.apache.logging.slf4j.Log4jLoggerFactory
   [junit4]   2> 2090421 INFO  (jetty-launcher-13270-thread-4) [     ] o.e.j.s.session node0 Scavenging every 660000ms
   [junit4]   2> 2090421 INFO  (jetty-launcher-13270-thread-3) [     ] o.a.s.s.SolrDispatchFilter  ___      _       Welcome to Apache Solr? version 9.0.0
   [junit4]   2> 2090421 INFO  (jetty-launcher-13270-thread-3) [     ] o.a.s.s.SolrDispatchFilter / __| ___| |_ _   Starting in cloud mode on port null
   [junit4]   2> 2090421 INFO  (jetty-launcher-13270-thread-3) [     ] o.a.s.s.SolrDispatchFilter \__ \/ _ \ | '_|  Install dir: null
   [junit4]   2> 2090421 INFO  (jetty-launcher-13270-thread-3) [     ] o.a.s.s.SolrDispatchFilter |___/\___/_|_|    Start time: 2019-10-08T15:06:09.882137Z
   [junit4]   2> 2090421 INFO  (jetty-launcher-13270-thread-2) [     ] o.e.j.s.h.ContextHandler Started o.e.j.s.ServletContextHandler@710c85b5{/solr,null,AVAILABLE}
   [junit4]   2> 2090421 INFO  (jetty-launcher-13270-thread-4) [     ] o.e.j.s.h.ContextHandler Started o.e.j.s.ServletContextHandler@5f496d47{/solr,null,AVAILABLE}
   [junit4]   2> 2090421 INFO  (jetty-launcher-13270-thread-1) [     ] o.a.s.c.c.ConnectionManager Waiting for client to connect to ZooKeeper
   [junit4]   2> 2090421 INFO  (jetty-launcher-13270-thread-4) [     ] o.e.j.s.AbstractConnector Started ServerConnector@60c44046{HTTP/1.1,[http/1.1, h2c]}{127.0.0.1:33489}
   [junit4]   2> 2090421 INFO  (jetty-launcher-13270-thread-4) [     ] o.e.j.s.Server Started @2090448ms
   [junit4]   2> 2090421 INFO  (jetty-launcher-13270-thread-4) [     ] o.a.s.c.s.e.JettySolrRunner Jetty properties: {hostContext=/solr, hostPort=33489}
   [junit4]   2> 2090421 ERROR (jetty-launcher-13270-thread-4) [     ] o.a.s.u.StartupLoggingUtils Missing Java Option solr.log.dir. Logging may be missing or incomplete.
   [junit4]   2> 2090421 INFO  (jetty-launcher-13270-thread-4) [     ] o.a.s.s.SolrDispatchFilter Using logger factory org.apache.logging.slf4j.Log4jLoggerFactory
   [junit4]   2> 2090421 INFO  (jetty-launcher-13270-thread-4) [     ] o.a.s.s.SolrDispatchFilter  ___      _       Welcome to Apache Solr? version 9.0.0
   [junit4]   2> 2090422 INFO  (jetty-launcher-13270-thread-4) [     ] o.a.s.s.SolrDispatchFilter / __| ___| |_ _   Starting in cloud mode on port null
   [junit4]   2> 2090422 INFO  (jetty-launcher-13270-thread-4) [     ] o.a.s.s.SolrDispatchFilter \__ \/ _ \ | '_|  Install dir: null
   [junit4]   2> 2090422 INFO  (jetty-launcher-13270-thread-4) [     ] o.a.s.s.SolrDispatchFilter |___/\___/_|_|    Start time: 2019-10-08T15:06:09.883022Z
   [junit4]   2> 2090422 INFO  (zkConnectionManagerCallback-13272-thread-1) [     ] o.a.s.c.c.ConnectionManager zkClient has connected
   [junit4]   2> 2090422 INFO  (jetty-launcher-13270-thread-1) [     ] o.a.s.c.c.ConnectionManager Client is connected to ZooKeeper
   [junit4]   2> 2090422 INFO  (jetty-launcher-13270-thread-1) [     ] o.a.s.s.SolrDispatchFilter solr.xml found in ZooKeeper. Loading...
   [junit4]   2> 2090422 INFO  (jetty-launcher-13270-thread-4) [     ] o.a.s.c.c.ConnectionManager Waiting for client to connect to ZooKeeper
   [junit4]   2> 2090423 INFO  (zkConnectionManagerCallback-13274-thread-1) [     ] o.a.s.c.c.ConnectionManager zkClient has connected
   [junit4]   2> 2090424 INFO  (jetty-launcher-13270-thread-4) [     ] o.a.s.c.c.ConnectionManager Client is connected to ZooKeeper
   [junit4]   2> 2090425 INFO  (jetty-launcher-13270-thread-4) [     ] o.a.s.s.SolrDispatchFilter solr.xml found in ZooKeeper. Loading...
   [junit4]   2> 2090429 INFO  (jetty-launcher-13270-thread-2) [     ] o.e.j.s.AbstractConnector Started ServerConnector@6973241e{HTTP/1.1,[http/1.1, h2c]}{127.0.0.1:37557}
   [junit4]   2> 2090429 INFO  (jetty-launcher-13270-thread-2) [     ] o.e.j.s.Server Started @2090455ms
   [junit4]   2> 2090429 INFO  (jetty-launcher-13270-thread-2) [     ] o.a.s.c.s.e.JettySolrRunner Jetty properties: {hostContext=/solr, hostPort=37557}
   [junit4]   2> 2090429 ERROR (jetty-launcher-13270-thread-2) [     ] o.a.s.u.StartupLoggingUtils Missing Java Option solr.log.dir. Logging may be missing or incomplete.
   [junit4]   2> 2090429 INFO  (jetty-launcher-13270-thread-2) [     ] o.a.s.s.SolrDispatchFilter Using logger factory org.apache.logging.slf4j.Log4jLoggerFactory
   [junit4]   2> 2090429 INFO  (jetty-launcher-13270-thread-2) [     ] o.a.s.s.SolrDispatchFilter  ___      _       Welcome to Apache Solr? version 9.0.0
   [junit4]   2> 2090429 INFO  (jetty-launcher-13270-thread-2) [     ] o.a.s.s.SolrDispatchFilter / __| ___| |_ _   Starting in cloud mode on port null
   [junit4]   2> 2090429 INFO  (jetty-launcher-13270-thread-2) [     ] o.a.s.s.SolrDispatchFilter \__ \/ _ \ | '_|  Install dir: null
   [junit4]   2> 2090429 INFO  (jetty-launcher-13270-thread-2) [     ] o.a.s.s.SolrDispatchFilter |___/\___/_|_|    Start time: 2019-10-08T15:06:09.890828Z
   [junit4]   2> 2090430 INFO  (jetty-launcher-13270-thread-3) [     ] o.a.s.c.c.ConnectionManager Waiting for client to connect to ZooKeeper
   [junit4]   2> 2090430 INFO  (jetty-launcher-13270-thread-2) [     ] o.a.s.c.c.ConnectionManager Waiting for client to connect to ZooKeeper
   [junit4]   2> 2090431 INFO  (zkConnectionManagerCallback-13276-thread-1) [     ] o.a.s.c.c.ConnectionManager zkClient has connected
   [junit4]   2> 2090431 INFO  (jetty-launcher-13270-thread-3) [     ] o.a.s.c.c.ConnectionManager Client is connected to ZooKeeper
   [junit4]   2> 2090431 INFO  (zkConnectionManagerCallback-13278-thread-1) [     ] o.a.s.c.c.ConnectionManager zkClient has connected
   [junit4]   2> 2090431 INFO  (jetty-launcher-13270-thread-2) [     ] o.a.s.c.c.ConnectionManager Client is connected to ZooKeeper
   [junit4]   2> 2090431 INFO  (jetty-launcher-13270-thread-3) [     ] o.a.s.s.SolrDispatchFilter solr.xml found in ZooKeeper. Loading...
   [junit4]   2> 2090431 INFO  (jetty-launcher-13270-thread-2) [     ] o.a.s.s.SolrDispatchFilter solr.xml found in ZooKeeper. Loading...
   [junit4]   2> 2090598 INFO  (jetty-launcher-13270-thread-1) [     ] o.a.s.h.c.HttpShardHandlerFactory Host whitelist initialized: WhitelistHostChecker [whitelistHosts=null, whitelistHostCheckingEnabled=true]
   [junit4]   2> 2090598 WARN  (jetty-launcher-13270-thread-1) [     ] o.e.j.u.s.S.config Trusting all certificates configured for Client@4a18bd65[provider=null,keyStore=null,trustStore=null]
   [junit4]   2> 2090598 WARN  (jetty-launcher-13270-thread-1) [     ] o.e.j.u.s.S.config No Client EndPointIdentificationAlgorithm configured for Client@4a18bd65[provider=null,keyStore=null,trustStore=null]
   [junit4]   2> 2090600 WARN  (jetty-launcher-13270-thread-1) [     ] o.e.j.u.s.S.config Trusting all certificates configured for Client@1ebc8058[provider=null,keyStore=null,trustStore=null]
   [junit4]   2> 2090600 WARN  (jetty-launcher-13270-thread-1) [     ] o.e.j.u.s.S.config No Client EndPointIdentificationAlgorithm configured for Client@1ebc8058[provider=null,keyStore=null,trustStore=null]
   [junit4]   2> 2090602 INFO  (jetty-launcher-13270-thread-1) [     ] o.a.s.c.ZkContainer Zookeeper client=127.0.0.1:38277/solr
   [junit4]   2> 2090602 INFO  (jetty-launcher-13270-thread-1) [     ] o.a.s.c.c.ConnectionManager Waiting for client to connect to ZooKeeper
   [junit4]   2> 2090603 INFO  (zkConnectionManagerCallback-13285-thread-1) [     ] o.a.s.c.c.ConnectionManager zkClient has connected
   [junit4]   2> 2090603 INFO  (jetty-launcher-13270-thread-1) [     ] o.a.s.c.c.ConnectionManager Client is connected to ZooKeeper
   [junit4]   2> 2090745 INFO  (jetty-launcher-13270-thread-3) [     ] o.a.s.h.c.HttpShardHandlerFactory Host whitelist initialized: WhitelistHostChecker [whitelistHosts=null, whitelistHostCheckingEnabled=true]
   [junit4]   2> 2090746 WARN  (jetty-launcher-13270-thread-3) [     ] o.e.j.u.s.S.config Trusting all certificates configured for Client@40dee19e[provider=null,keyStore=null,trustStore=null]
   [junit4]   2> 2090746 WARN  (jetty-launcher-13270-thread-3) [     ] o.e.j.u.s.S.config No Client EndPointIdentificationAlgorithm configured for Client@40dee19e[provider=null,keyStore=null,trustStore=null]
   [junit4]   2> 2090747 WARN  (jetty-launcher-13270-thread-3) [     ] o.e.j.u.s.S.config Trusting all certificates configured for Client@314a2ea9[provider=null,keyStore=null,trustStore=null]
   [junit4]   2> 2090747 WARN  (jetty-launcher-13270-thread-3) [     ] o.e.j.u.s.S.config No Client EndPointIdentificationAlgorithm configured for Client@314a2ea9[provider=null,keyStore=null,trustStore=null]
   [junit4]   2> 2090748 INFO  (jetty-launcher-13270-thread-3) [     ] o.a.s.c.ZkContainer Zookeeper client=127.0.0.1:38277/solr
   [junit4]   2> 2090748 INFO  (jetty-launcher-13270-thread-3) [     ] o.a.s.c.c.ConnectionManager Waiting for client to connect to ZooKeeper
   [junit4]   2> 2090749 INFO  (zkConnectionManagerCallback-13293-thread-1) [     ] o.a.s.c.c.ConnectionManager zkClient has connected
   [junit4]   2> 2090749 INFO  (jetty-launcher-13270-thread-3) [     ] o.a.s.c.c.ConnectionManager Client is connected to ZooKeeper
   [junit4]   2> 2090807 INFO  (jetty-launcher-13270-thread-2) [     ] o.a.s.h.c.HttpShardHandlerFactory Host whitelist initialized: WhitelistHostChecker [whitelistHosts=null, whitelistHostCheckingEnabled=true]
   [junit4]   2> 2090807 WARN  (jetty-launcher-13270-thread-2) [     ] o.e.j.u.s.S.config Trusting all certificates configured for Client@4bbef3f5[provider=null,keyStore=null,trustStore=null]
   [junit4]   2> 2090807 WARN  (jetty-launcher-13270-thread-2) [     ] o.e.j.u.s.S.config No Client EndPointIdentificationAlgorithm configured for Client@4bbef3f5[provider=null,keyStore=null,trustStore=null]
   [junit4]   2> 2090809 WARN  (jetty-launcher-13270-thread-2) [     ] o.e.j.u.s.S.config Trusting all certificates configured for Client@661c1052[provider=null,keyStore=null,trustStore=null]
   [junit4]   2> 2090809 WARN  (jetty-launcher-13270-thread-2) [     ] o.e.j.u.s.S.config No Client EndPointIdentificationAlgorithm configured for Client@661c1052[provider=null,keyStore=null,trustStore=null]
   [junit4]   2> 2090810 INFO  (jetty-launcher-13270-thread-2) [     ] o.a.s.c.ZkContainer Zookeeper client=127.0.0.1:38277/solr
   [junit4]   2> 2090811 INFO  (jetty-launcher-13270-thread-2) [     ] o.a.s.c.c.ConnectionManager Waiting for client to connect to ZooKeeper
   [junit4]   2> 2090812 INFO  (zkConnectionManagerCallback-13299-thread-1) [     ] o.a.s.c.c.ConnectionManager zkClient has connected
   [junit4]   2> 2090812 INFO  (jetty-launcher-13270-thread-2) [     ] o.a.s.c.c.ConnectionManager Client is connected to ZooKeeper
   [junit4]   2> 2090926 INFO  (jetty-launcher-13270-thread-2) [n:127.0.0.1:37557_solr     ] o.a.s.c.c.ConnectionManager Waiting for client to connect to ZooKeeper
   [junit4]   2> 2090927 INFO  (zkConnectionManagerCallback-13302-thread-1) [     ] o.a.s.c.c.ConnectionManager zkClient has connected
   [junit4]   2> 2090927 INFO  (jetty-launcher-13270-thread-2) [n:127.0.0.1:37557_solr     ] o.a.s.c.c.ConnectionManager Client is connected to ZooKeeper
   [junit4]   2> 2090960 DEBUG (jetty-launcher-13270-thread-2) [n:127.0.0.1:37557_solr     ] o.a.s.c.c.ZkStateReader Updating cluster state from ZooKeeper... 
   [junit4]   2> 2090960 DEBUG (jetty-launcher-13270-thread-2) [n:127.0.0.1:37557_solr     ] o.a.s.c.c.ZkStateReader Loaded empty cluster properties
   [junit4]   2> 2090960 DEBUG (jetty-launcher-13270-thread-2) [n:127.0.0.1:37557_solr     ] o.a.s.c.c.ZkStateReader Updated live nodes from ZooKeeper... [] -> []
   [junit4]   2> 2090960 DEBUG (jetty-launcher-13270-thread-2) [n:127.0.0.1:37557_solr     ] o.a.s.c.c.ZkStateReader clusterStateSet: legacy [0] interesting [0] watched [0] lazy [0] total [0]
   [junit4]   2> 2090961 INFO  (jetty-launcher-13270-thread-2) [n:127.0.0.1:37557_solr     ] o.a.s.c.OverseerElectionContext I am going to be the leader 127.0.0.1:37557_solr
   [junit4]   2> 2090962 INFO  (jetty-launcher-13270-thread-2) [n:127.0.0.1:37557_solr     ] o.a.s.c.Overseer Overseer (id=72272847775596554-127.0.0.1:37557_solr-n_0000000000) starting
   [junit4]   2> 2090964 INFO  (jetty-launcher-13270-thread-2) [n:127.0.0.1:37557_solr     ] o.a.s.c.c.ConnectionManager Waiting for client to connect to ZooKeeper
   [junit4]   2> 2090964 INFO  (zkConnectionManagerCallback-13309-thread-1) [     ] o.a.s.c.c.ConnectionManager zkClient has connected
   [junit4]   2> 2090964 INFO  (jetty-launcher-13270-thread-2) [n:127.0.0.1:37557_solr     ] o.a.s.c.c.ConnectionManager Client is connected to ZooKeeper
   [junit4]   2> 2090965 DEBUG (jetty-launcher-13270-thread-2) [n:127.0.0.1:37557_solr     ] o.a.s.c.c.ZkStateReader Updating cluster state from ZooKeeper... 
   [junit4]   2> 2090965 DEBUG (jetty-launcher-13270-thread-2) [n:127.0.0.1:37557_solr     ] o.a.s.c.c.ZkStateReader Loaded empty cluster properties
   [junit4]   2> 2090965 DEBUG (jetty-launcher-13270-thread-2) [n:127.0.0.1:37557_solr     ] o.a.s.c.c.ZkStateReader Updated live nodes from ZooKeeper... [] -> []
   [junit4]   2> 2090965 DEBUG (jetty-launcher-13270-thread-2) [n:127.0.0.1:37557_solr     ] o.a.s.c.c.ZkStateReader clusterStateSet: legacy [0] interesting [0] watched [0] lazy [0] total [0]
   [junit4]   2> 2090965 INFO  (jetty-launcher-13270-thread-2) [n:127.0.0.1:37557_solr     ] o.a.s.c.s.i.ZkClientClusterStateProvider Cluster at 127.0.0.1:38277/solr ready
   [junit4]   2> 2090966 INFO  (OverseerStateUpdate-72272847775596554-127.0.0.1:37557_solr-n_0000000000) [n:127.0.0.1:37557_solr     ] o.a.s.c.Overseer Starting to work on the main queue : 127.0.0.1:37557_solr
   [junit4]   2> 2090966 DEBUG (OverseerStateUpdate-72272847775596554-127.0.0.1:37557_solr-n_0000000000) [n:127.0.0.1:37557_solr     ] o.a.s.c.c.ZkStateReader Updated live nodes from ZooKeeper... [] -> []
   [junit4]   2> 2090966 DEBUG (OverseerStateUpdate-72272847775596554-127.0.0.1:37557_solr-n_0000000000) [n:127.0.0.1:37557_solr     ] o.a.s.c.c.ZkStateReader clusterStateSet: legacy [0] interesting [0] watched [0] lazy [0] total [0]
   [junit4]   2> 2090969 INFO  (jetty-launcher-13270-thread-2) [n:127.0.0.1:37557_solr     ] o.a.s.c.ZkController Register node as live in ZooKeeper:/live_nodes/127.0.0.1:37557_solr
   [junit4]   2> 2090970 DEBUG (zkCallback-13301-thread-1) [     ] o.a.s.c.c.ZkStateReader A live node change: [WatchedEvent state:SyncConnected type:NodeChildrenChanged path:/live_nodes], has occurred - updating... (live nodes size: [0])
   [junit4]   2> 2090970 DEBUG (zkCallback-13308-thread-1) [     ] o.a.s.c.c.ZkStateReader A live node change: [WatchedEvent state:SyncConnected type:NodeChildrenChanged path:/live_nodes], has occurred - updating... (live nodes size: [0])
   [junit4]   2> 2090970 INFO  (zkCallback-13308-thread-1) [     ] o.a.s.c.c.ZkStateReader Updated live nodes from ZooKeeper... (0) -> (1)
   [junit4]   2> 2090970 INFO  (zkCallback-13301-thread-1) [     ] o.a.s.c.c.ZkStateReader Updated live nodes from ZooKeeper... (0) -> (1)
   [junit4]   2> 2090970 DEBUG (zkCallback-13308-thread-1) [     ] o.a.s.c.c.ZkStateReader Updated live nodes from ZooKeeper... [] -> [127.0.0.1:37557_solr]
   [junit4]   2> 2090970 DEBUG (zkCallback-13301-thread-1) [     ] o.a.s.c.c.ZkStateReader Updated live nodes from ZooKeeper... [] -> [127.0.0.1:37557_solr]
   [junit4]   2> 2090970 DEBUG (jetty-launcher-13270-thread-2) [n:127.0.0.1:37557_solr     ] o.a.s.c.PackageBag clusterprops.json changed , version -1
   [junit4]   2> 2090985 INFO  (jetty-launcher-13270-thread-2) [n:127.0.0.1:37557_solr     ] o.a.s.h.a.MetricsHistoryHandler No .system collection, keeping metrics history in memory.
   [junit4]   2> 2090995 INFO  (jetty-launcher-13270-thread-2) [n:127.0.0.1:37557_solr     ] o.a.s.m.r.SolrJmxReporter JMX monitoring for 'solr_37557.solr.node' (registry 'solr.node') enabled at server: com.sun.jmx.mbeanserver.JmxMBeanServer@2737ed8c
   [junit4]   2> 2091000 INFO  (jetty-launcher-13270-thread-2) [n:127.0.0.1:37557_solr     ] o.a.s.m.r.SolrJmxReporter JMX monitoring for 'solr_37557.solr.jvm' (registry 'solr.jvm') enabled at server: com.sun.jmx.mbeanserver.JmxMBeanServer@2737ed8c
   [junit4]   2> 2091000 INFO  (jetty-launcher-13270-thread-2) [n:127.0.0.1:37557_solr     ] o.a.s.m.r.SolrJmxReporter JMX monitoring for 'solr_37557.solr.jetty' (registry 'solr.jetty') enabled at server: com.sun.jmx.mbeanserver.JmxMBeanServer@2737ed8c
   [junit4]   2> 2091000 INFO  (jetty-launcher-13270-thread-2) [n:127.0.0.1:37557_solr     ] o.a.s.c.CorePropertiesLocator Found 0 core definitions underneath /home/jenkins/workspace/Lucene-Solr-SOLR-13661-Linux/solr/build/solr-core/test/J1/temp/solr.handler.TestPackages_BCC2D53CBBFEEB2-001/tempDir-001/node2/.
   [junit4]   2> 2091026 INFO  (jetty-launcher-13270-thread-3) [n:127.0.0.1:34769_solr     ] o.a.s.c.c.ConnectionManager Waiting for client to connect to ZooKeeper
   [junit4]   2> 2091027 INFO  (zkConnectionManagerCallback-13312-thread-1) [     ] o.a.s.c.c.ConnectionManager zkClient has connected
   [junit4]   2> 2091027 INFO  (jetty-launcher-13270-thread-3) [n:127.0.0.1:34769_solr     ] o.a.s.c.c.ConnectionManager Client is connected to ZooKeeper
   [junit4]   2> 2091029 DEBUG (jetty-launcher-13270-thread-3) [n:127.0.0.1:34769_solr     ] o.a.s.c.c.ZkStateReader Updating cluster state from ZooKeeper... 
   [junit4]   2> 2091029 DEBUG (jetty-launcher-13270-thread-3) [n:127.0.0.1:34769_solr     ] o.a.s.c.c.ZkStateReader Loaded empty cluster properties
   [junit4]   2> 2091029 INFO  (jetty-launcher-13270-thread-3) [n:127.0.0.1:34769_solr     ] o.a.s.c.c.ZkStateReader Updated live nodes from ZooKeeper... (0) -> (1)
   [junit4]   2> 2091029 DEBUG (jetty-launcher-13270-thread-3) [n:127.0.0.1:34769_solr     ] o.a.s.c.c.ZkStateReader Updated live nodes from ZooKeeper... [] -> [127.0.0.1:37557_solr]
   [junit4]   2> 2091030 DEBUG (jetty-launcher-13270-thread-3) [n:127.0.0.1:34769_solr     ] o.a.s.c.c.ZkStateReader clusterStateSet: legacy [0] interesting [0] watched [0] lazy [0] total [0]
   [junit4]   2> 2091033 INFO  (jetty-launcher-13270-thread-3) [n:127.0.0.1:34769_solr     ] o.a.s.c.ZkController Publish node=127.0.0.1:34769_solr as DOWN
   [junit4]   2> 2091033 INFO  (jetty-launcher-13270-thread-3) [n:127.0.0.1:34769_solr     ] o.a.s.c.TransientSolrCoreCacheDefault Allocating transient cache for 2147483647 transient cores
   [junit4]   2> 2091033 INFO  (jetty-launcher-13270-thread-3) [n:127.0.0.1:34769_solr     ] o.a.s.c.ZkController Register node as live in ZooKeeper:/live_nodes/127.0.0.1:34769_solr
   [junit4]   2> 2091034 DEBUG (zkCallback-13308-thread-1) [     ] o.a.s.c.c.ZkStateReader A live node change: [WatchedEvent state:SyncConnected type:NodeChildrenChanged path:/live_nodes], has occurred - updating... (live nodes size: [1])
   [junit4]   2> 2091034 DEBUG (zkCallback-13301-thread-2) [     ] o.a.s.c.c.ZkStateReader A live node change: [WatchedEvent state:SyncConnected type:NodeChildrenChanged path:/live_nodes], has occurred - updating... (live nodes size: [1])
   [junit4]   2> 2091034 INFO  (zkCallback-13308-thread-1) [     ] o.a.s.c.c.ZkStateReader Updated live nodes from ZooKeeper... (1) -> (2)
   [junit4]   2> 2091034 DEBUG (zkCallback-13308-thread-1) [     ] o.a.s.c.c.ZkStateReader Updated live nodes from ZooKeeper... [127.0.0.1:37557_solr] -> [127.0.0.1:34769_solr, 127.0.0.1:37557_solr]
   [junit4]   2> 2091034 DEBUG (zkCallback-13311-thread-1) [     ] o.a.s.c.c.ZkStateReader A live node change: [WatchedEvent state:SyncConnected type:NodeChildrenChanged path:/live_nodes], has occurred - updating... (live nodes size: [1])
   [junit4]   2> 2091034 INFO  (zkCallback-13311-thread-1) [     ] o.a.s.c.c.ZkStateReader Updated live nodes from ZooKeeper... (1) -> (2)
   [junit4]   2> 2091034 DEBUG (zkCallback-13311-thread-1) [     ] o.a.s.c.c.ZkStateReader Updated live nodes from ZooKeeper... [127.0.0.1:37557_solr] -> [127.0.0.1:34769_solr, 127.0.0.1:37557_solr]
   [junit4]   2> 2091034 INFO  (zkCallback-13301-thread-2) [     ] o.a.s.c.c.ZkStateReader Updated live nodes from ZooKeeper... (1) -> (2)
   [junit4]   2> 2091034 DEBUG (zkCallback-13301-thread-2) [     ] o.a.s.c.c.ZkStateReader Updated live nodes from ZooKeeper... [127.0.0.1:37557_solr] -> [127.0.0.1:34769_solr, 127.0.0.1:37557_solr]
   [junit4]   2> 2091035 INFO  (jetty-launcher-13270-thread-3) [n:127.0.0.1:34769_solr     ] o.a.s.c.c.ConnectionManager Waiting for client to connect to ZooKeeper
   [junit4]   2> 2091035 INFO  (zkConnectionManagerCallback-13319-thread-1) [     ] o.a.s.c.c.ConnectionManager zkClient has connected
   [junit4]   2> 2091035 INFO  (jetty-launcher-13270-thread-3) [n:127.0.0.1:34769_solr     ] o.a.s.c.c.ConnectionManager Client is connected to ZooKeeper
   [junit4]   2> 2091035 DEBUG (jetty-launcher-13270-thread-3) [n:127.0.0.1:34769_solr     ] o.a.s.c.c.ZkStateReader Updating cluster state from ZooKeeper... 
   [junit4]   2> 2091036 DEBUG (jetty-launcher-13270-thread-3) [n:127.0.0.1:34769_solr     ] o.a.s.c.c.ZkStateReader Loaded empty cluster properties
   [junit4]   2> 2091036 INFO  (jetty-launcher-13270-thread-3) [n:127.0.0.1:34769_solr     ] o.a.s.c.c.ZkStateReader Updated live nodes from ZooKeeper... (0) -> (2)
   [junit4]   2> 2091036 DEBUG (jetty-launcher-13270-thread-3) [n:127.0.0.1:34769_solr     ] o.a.s.c.c.ZkStateReader Updated live nodes from ZooKeeper... [] -> [127.0.0.1:34769_solr, 127.0.0.1:37557_solr]
   [junit4]   2> 2091036 DEBUG (jetty-launcher-13270-thread-3) [n:127.0.0.1:34769_solr     ] o.a.s.c.c.ZkStateReader clusterStateSet: legacy [0] interesting [0] watched [0] lazy [0] total [0]
   [junit4]   2> 2091036 INFO  (jetty-launcher-13270-thread-3) [n:127.0.0.1:34769_solr     ] o.a.s.c.s.i.ZkClientClusterStateProvider Cluster at 127.0.0.1:38277/solr ready
   [junit4]   2> 2091037 DEBUG (jetty-launcher-13270-thread-3) [n:127.0.0.1:34769_solr     ] o.a.s.c.PackageBag clusterprops.json changed , version -1
   [junit4]   2> 2091053 INFO  (jetty-launcher-13270-thread-3) [n:127.0.0.1:34769_solr     ] o.a.s.h.a.MetricsHistoryHandler No .system collection, keeping metrics history in memory.
   [junit4]   2> 2091069 INFO  (jetty-launcher-13270-thread-3) [n:127.0.0.1:34769_solr     ] o.a.s.m.r.SolrJmxReporter JMX monitoring for 'solr_34769.solr.node' (registry 'solr.node') enabled at server: com.sun.jmx.mbeanserver.JmxMBeanServer@2737ed8c
   [junit4]   2> 2091075 INFO  (jetty-launcher-13270-thread-3) [n:127.0.0.1:34769_solr     ] o.a.s.m.r.SolrJmxReporter JMX monitoring for 'solr_34769.solr.jvm' (registry 'solr.jvm') enabled at server: com.sun.jmx.mbeanserver.JmxMBeanServer@2737ed8c
   [junit4]   2> 2091075 INFO  (jetty-launcher-13270-thread-3) [n:127.0.0.1:34769_solr     ] o.a.s.m.r.SolrJmxReporter JMX monitoring for 'solr_34769.solr.jetty' (registry 'solr.jetty') enabled at server: com.sun.jmx.mbeanserver.JmxMBeanServer@2737ed8c
   [junit4]   2> 2091075 INFO  (jetty-launcher-13270-thread-3) [n:127.0.0.1:34769_solr     ] o.a.s.c.CorePropertiesLocator Found 0 core definitions underneath /home/jenkins/workspace/Lucene-Solr-SOLR-13661-Linux/solr/build/solr-core/test/J1/temp/solr.handler.TestPackages_BCC2D53CBBFEEB2-001/tempDir-001/node3/.
   [junit4]   2> 2091126 INFO  (jetty-launcher-13270-thread-1) [n:127.0.0.1:34787_solr     ] o.a.s.c.c.ConnectionManager Waiting for client to connect to ZooKeeper
   [junit4]   2> 2091127 INFO  (zkConnectionManagerCallback-13322-thread-1) [     ] o.a.s.c.c.ConnectionManager zkClient has connected
   [junit4]   2> 2091127 INFO  (jetty-launcher-13270-thread-1) [n:127.0.0.1:34787_solr     ] o.a.s.c.c.ConnectionManager Client is connected to ZooKeeper
   [junit4]   2> 2091129 DEBUG (jetty-launcher-13270-thread-1) [n:127.0.0.1:34787_solr     ] o.a.s.c.c.ZkStateReader Updating cluster state from ZooKeeper... 
   [junit4]   2> 2091129 DEBUG (jetty-launcher-13270-thread-1) [n:127.0.0.1:34787_solr     ] o.a.s.c.c.ZkStateReader Loaded empty cluster properties
   [junit4]   2> 2091129 INFO  (jetty-launcher-13270-thread-1) [n:127.0.0.1:34787_solr     ] o.a.s.c.c.ZkStateReader Updated live nodes from ZooKeeper... (0) -> (2)
   [junit4]   2> 2091129 DEBUG (jetty-launcher-13270-thread-1) [n:127.0.0.1:34787_solr     ] o.a.s.c.c.ZkStateReader Updated live nodes from ZooKeeper... [] -> [127.0.0.1:34769_solr, 127.0.0.1:37557_solr]
   [junit4]   2> 2091130 DEBUG (jetty-launcher-13270-thread-1) [n:127.0.0.1:34787_solr     ] o.a.s.c.c.ZkStateReader clusterStateSet: legacy [0] interesting [0] watched [0] lazy [0] total [0]
   [junit4]   2> 2091131 INFO  (jetty-launcher-13270-thread-1) [n:127.0.0.1:34787_solr     ] o.a.s.c.ZkController Publish node=127.0.0.1:34787_solr as DOWN
   [junit4]   2> 2091131 INFO  (jetty-launcher-13270-thread-1) [n:127.0.0.1:34787_solr     ] o.a.s.c.TransientSolrCoreCacheDefault Allocating transient cache for 2147483647 transient cores
   [junit4]   2> 2091131 INFO  (jetty-launcher-13270-thread-1) [n:127.0.0.1:34787_solr     ] o.a.s.c.ZkController Register node as live in ZooKeeper:/live_nodes/127.0.0.1:34787_solr
   [junit4]   2> 2091132 DEBUG (zkCallback-13311-thread-1) [     ] o.a.s.c.c.ZkStateReader A live node change: [WatchedEvent state:SyncConnected type:NodeChildrenChanged path:/live_nodes], has occurred - updating... (live nodes size: [2])
   [junit4]   2> 2091132 DEBUG (zkCallback-13308-thread-1) [     ] o.a.s.c.c.ZkStateReader A live node change: [WatchedEvent state:SyncConnected type:NodeChildrenChanged path:/live_nodes], has occurred - updating... (live nodes size: [2])
   [junit4]   2> 2091132 DEBUG (zkCallback-13301-thread-1) [     ] o.a.s.c.c.ZkStateReader A live node change: [WatchedEvent state:SyncConnected type:NodeChildrenChanged path:/live_nodes], has occurred - updating... (live nodes size: [2])
   [junit4]   2> 2091132 INFO  (zkCallback-13308-thread-1) [     ] o.a.s.c.c.ZkStateReader Updated live nodes from ZooKeeper... (2) -> (3)
   [junit4]   2> 2091132 DEBUG (zkCallback-13308-thread-1) [     ] o.a.s.c.c.ZkStateReader Updated live nodes from ZooKeeper... [127.0.0.1:34769_solr, 127.0.0.1:37557_solr] -> [127.0.0.1:34769_solr, 127.0.0.1:34787_solr, 127.0.0.1:37557_solr]
   [junit4]   2> 2091132 INFO  (zkCallback-13311-thread-1) [     ] o.a.s.c.c.ZkStateReader Updated live nodes from ZooKeeper... (2) -> (3)
   [junit4]   2> 2091132 DEBUG (zkCallback-13311-thread-1) [     ] o.a.s.c.c.ZkStateReader Updated live nodes from ZooKeeper... [127.0.0.1:34769_solr, 127.0.0.1:37557_solr] -> [127.0.0.1:34769_solr, 127.0.0.1:34787_solr, 127.0.0.1:37557_solr]
   [junit4]   2> 2091132 INFO  (zkCallback-13301-thread-1) [     ] o.a.s.c.c.ZkStateReader Updated live nodes from ZooKeeper... (2) -> (3)
   [junit4]   2> 2091132 DEBUG (zkCallback-13301-thread-1) [     ] o.a.s.c.c.ZkStateReader Updated live nodes from ZooKeeper... [127.0.0.1:34769_solr, 127.0.0.1:37557_solr] -> [127.0.0.1:34769_solr, 127.0.0.1:34787_solr, 127.0.0.1:37557_solr]
   [junit4]   2> 2091132 DEBUG (zkCallback-13318-thread-1) [     ] o.a.s.c.c.ZkStateReader A live node change: [WatchedEvent state:SyncConnected type:NodeChildrenChanged path:/live_nodes], has occurred - updating... (live nodes size: [2])
   [junit4]   2> 2091132 DEBUG (zkCallback-13321-thread-1) [     ] o.a.s.c.c.ZkStateReader A live node change: [WatchedEvent state:SyncConnected type:NodeChildrenChanged path:/live_nodes], has occurred - updating... (live nodes size: [2])
   [junit4]   2> 2091132 INFO  (zkCallback-13318-thread-1) [     ] o.a.s.c.c.ZkStateReader Updated live nodes from ZooKeeper... (2) -> (3)
   [junit4]   2> 2091132 INFO  (zkCallback-13321-thread-1) [     ] o.a.s.c.c.ZkStateReader Updated live nodes from ZooKeeper... (2) -> (3)
   [junit4]   2> 2091132 DEBUG (zkCallback-13318-thread-1) [     ] o.a.s.c.c.ZkStateReader Updated live nodes from ZooKeeper... [127.0.0.1:34769_solr, 127.0.0.1:37557_solr] -> [127.0.0.1:34769_solr, 127.0.0.1:34787_solr, 127.0.0.1:37557_solr]
   [junit4]   2> 2091132 DEBUG (zkCallback-13321-thread-1) [     ] o.a.s.c.c.ZkStateReader Updated live nodes from ZooKeeper... [127.0.0.1:34769_solr, 127.0.0.1:37557_solr] -> [127.0.0.1:34769_solr, 127.0.0.1:34787_solr, 127.0.0.1:37557_solr]
   [junit4]   2> 2091133 INFO  (jetty-launcher-13270-thread-1) [n:127.0.0.1:34787_solr     ] o.a.s.c.c.ConnectionManager Waiting for client to connect to ZooKeeper
   [junit4]   2> 2091133 INFO  (zkConnectionManagerCallback-13329-thread-1) [     ] o.a.s.c.c.ConnectionManager zkClient has connected
   [junit4]   2> 2091133 INFO  (jetty-launcher-13270-thread-1) [n:127.0.0.1:34787_solr     ] o.a.s.c.c.ConnectionManager Client is connected to ZooKeeper
   [junit4]   2> 2091133 DEBUG (jetty-launcher-13270-thread-1) [n:127.0.0.1:34787_solr     ] o.a.s.c.c.ZkStateReader Updating cluster state from ZooKeeper... 
   [junit4]   2> 2091134 DEBUG (jetty-launcher-13270-thread-1) [n:127.0.0.1:34787_solr     ] o.a.s.c.c.ZkStateReader Loaded empty cluster properties
   [junit4]   2> 2091134 INFO  (jetty-launcher-13270-thread-1) [n:127.0.0.1:34787_solr     ] o.a.s.c.c.ZkStateReader Updated live nodes from ZooKeeper... (0) -> (3)
   [junit4]   2> 2091134 DEBUG (jetty-launcher-13270-thread-1) [n:127.0.0.1:34787_solr     ] o.a.s.c.c.ZkStateReader Updated live nodes from ZooKeeper... [] -> [127.0.0.1:34769_solr, 127.0.0.1:34787_solr, 127.0.0.1:37557_solr]
   [junit4]   2> 2091134 DEBUG (jetty-launcher-13270-thread-1) [n:127.0.0.1:34787_solr     ] o.a.s.c.c.ZkStateReader clusterStateSet: legacy [0] interesting [0] watched [0] lazy [0] total [0]
   [junit4]   2> 2091134 INFO  (jetty-launcher-13270-thread-1) [n:127.0.0.1:34787_solr     ] o.a.s.c.s.i.ZkClientClusterStateProvider Cluster at 127.0.0.1:38277/solr ready
   [junit4]   2> 2091134 DEBUG (jetty-launcher-13270-thread-1) [n:127.0.0.1:34787_solr     ] o.a.s.c.PackageBag clusterprops.json changed , version -1
   [junit4]   2> 2091144 INFO  (jetty-launcher-13270-thread-1) [n:127.0.0.1:34787_solr     ] o.a.s.h.a.MetricsHistoryHandler No .system collection, keeping metrics history in memory.
   [junit4]   2> 2091152 INFO  (jetty-launcher-13270-thread-1) [n:127.0.0.1:34787_solr     ] o.a.s.m.r.SolrJmxReporter JMX monitoring for 'solr_34787.solr.node' (registry 'solr.node') enabled at server: com.sun.jmx.mbeanserver.JmxMBeanServer@2737ed8c
   [junit4]   2> 2091157 INFO  (jetty-launcher-13270-thread-1) [n:127.0.0.1:34787_solr     ] o.a.s.m.r.SolrJmxReporter JMX monitoring for 'solr_34787.solr.jvm' (registry 'solr.jvm') enabled at server: com.sun.jmx.mbeanserver.JmxMBeanServer@2737ed8c
   [junit4]   2> 2091157 INFO  (jetty-launcher-13270-thread-1) [n:127.0.0.1:34787_solr     ] o.a.s.m.r.SolrJmxReporter JMX monitoring for 'solr_34787.solr.jetty' (registry 'solr.jetty') enabled at server: com.sun.jmx.mbeanserver.JmxMBeanServer@2737ed8c
   [junit4]   2> 2091158 INFO  (jetty-launcher-13270-thread-1) [n:127.0.0.1:34787_solr     ] o.a.s.c.CorePropertiesLocator Found 0 core definitions underneath /home/jenkins/workspace/Lucene-Solr-SOLR-13661-Linux/solr/build/solr-core/test/J1/temp/solr.handler.TestPackages_BCC2D53CBBFEEB2-001/tempDir-001/node1/.
   [junit4]   2> 2091172 INFO  (jetty-launcher-13270-thread-4) [     ] o.a.s.h.c.HttpShardHandlerFactory Host whitelist initialized: WhitelistHostChecker [whitelistHosts=null, whitelistHostCheckingEnabled=true]
   [junit4]   2> 2091173 WARN  (jetty-launcher-13270-thread-4) [     ] o.e.j.u.s.S.config Trusting all certificates configured for Client@5e382d75[provider=null,keyStore=null,trustStore=null]
   [junit4]   2> 2091173 WARN  (jetty-launcher-13270-thread-4) [     ] o.e.j.u.s.S.config No Client EndPointIdentificationAlgorithm configured for Client@5e382d75[provider=null,keyStore=null,trustStore=null]
   [junit4]   2> 2091174 WARN  (jetty-launcher-13270-thread-4) [     ] o.e.j.u.s.S.config Trusting all certificates configured for Client@323c5c72[provider=null,keyStore=null,trustStore=null]
   [junit4]   2> 2091174 WARN  (jetty-launcher-13270-thread-4) [     ] o.e.j.u.s.S.config No Client EndPointIdentificationAlgorithm configured for Client@323c5c72[provider=null,keyStore=null,trustStore=null]
   [junit4]   2> 2091176 INFO  (jetty-launcher-13270-thread-4) [     ] o.a.s.c.ZkContainer Zookeeper client=127.0.0.1:38277/solr
   [junit4]   2> 2091176 INFO  (jetty-launcher-13270-thread-4) [     ] o.a.s.c.c.ConnectionManager Waiting for client to connect to ZooKeeper
   [junit4]   2> 2091177 INFO  (zkConnectionManagerCallback-13336-thread-1) [     ] o.a.s.c.c.ConnectionManager zkClient has connected
   [junit4]   2> 2091177 INFO  (jetty-launcher-13270-thread-4) [     ] o.a.s.c.c.ConnectionManager Client is connected to ZooKeeper
   [junit4]   2> 2091278 INFO  (jetty-launcher-13270-thread-4) [n:127.0.0.1:33489_solr     ] o.a.s.c.c.ConnectionManager Waiting for client to connect to ZooKeeper
   [junit4]   2> 2091279 INFO  (zkConnectionManagerCallback-13338-thread-1) [     ] o.a.s.c.c.ConnectionManager zkClient has connected
   [junit4]   2> 2091279 INFO  (jetty-launcher-13270-thread-4) [n:127.0.0.1:33489_solr     ] o.a.s.c.c.ConnectionManager Client is connected to ZooKeeper
   [junit4]   2> 2091281 DEBUG (jetty-launcher-13270-thread-4) [n:127.0.0.1:33489_solr     ] o.a.s.c.c.ZkStateReader Updating cluster state from ZooKeeper... 
   [junit4]   2> 2091281 DEBUG (jetty-launcher-13270-thread-4) [n:127.0.0.1:33489_solr     ] o.a.s.c.c.ZkStateReader Loaded empty cluster properties
   [junit4]   2> 2091281 INFO  (jetty-launcher-13270-thread-4) [n:127.0.0.1:33489_solr     ] o.a.s.c.c.ZkStateReader Updated live nodes from ZooKeeper... (0) -> (3)
   [junit4]   2> 2091281 DEBUG (jetty-launcher-13270-thread-4) [n:127.0.0.1:33489_solr     ] o.a.s.c.c.ZkStateReader Updated live nodes from ZooKeeper... [] -> [127.0.0.1:34769_solr, 127.0.0.1:34787_solr, 127.0.0.1:37557_solr]
   [junit4]   2> 2091282 DEBUG (jetty-launcher-13270-thread-4) [n:127.0.0.1:33489_solr     ] o.a.s.c.c.ZkStateReader clusterStateSet: legacy [0] interesting [0] watched [0] lazy [0] total [0]
   [junit4]   2> 2091283 INFO  (jetty-launcher-13270-thread-4) [n:127.0.0.1:33489_solr     ] o.a.s.c.ZkController Publish node=127.0.0.1:33489_solr as DOWN
   [junit4]   2> 2091283 INFO  (jetty-launcher-13270-thread-4) [n:127.0.0.1:33489_solr     ] o.a.s.c.TransientSolrCoreCacheDefault Allocating transient cache for 2147483647 transient cores
   [junit4]   2> 2091283 INFO  (jetty-launcher-13270-thread-4) [n:127.0.0.1:33489_solr     ] o.a.s.c.ZkController Register node as live in ZooKeeper:/live_nodes/127.0.0.1:33489_solr
   [junit4]   2> 2091284 DEBUG (zkCallback-13321-thread-1) [     ] o.a.s.c.c.ZkStateReader A live node change: [WatchedEvent state:SyncConnected type:NodeChildrenChanged path:/live_nodes], has occurred - updating... (live nodes size: [3])
   [junit4]   2> 2091284 DEBUG (zkCallback-13308-thread-1) [     ] o.a.s.c.c.ZkStateReader A live node change: [WatchedEvent state:SyncConnected type:NodeChildrenChanged path:/live_nodes], has occurred - updating... (live nodes size: [3])
   [junit4]   2> 2091284 DEBUG (zkCallback-13311-thread-1) [     ] o.a.s.c.c.ZkStateReader A live node change: [WatchedEvent state:SyncConnected type:NodeChildrenChanged path:/live_nodes], has occurred - updating... (live nodes size: [3])
   [junit4]   2> 2091284 DEBUG (zkCallback-13318-thread-1) [     ] o.a.s.c.c.ZkStateReader A live node change: [WatchedEvent state:SyncConnected type:NodeChildrenChanged path:/live_nodes], has occurred - updating... (live nodes size: [3])
   [junit4]   2> 2091284 DEBUG (zkCallback-13301-thread-1) [     ] o.a.s.c.c.ZkStateReader A live node change: [WatchedEvent state:SyncConnected type:NodeChildrenChanged path:/live_nodes], has occurred - updating... (live nodes size: [3])
   [junit4]   2> 2091284 INFO  (zkCallback-13311-thread-1) [     ] o.a.s.c.c.ZkStateReader Updated live nodes from ZooKeeper... (3) -> (4)
   [junit4]   2> 2091284 INFO  (zkCallback-13321-thread-1) [     ] o.a.s.c.c.ZkStateReader Updated live nodes from ZooKeeper... (3) -> (4)
   [junit4]   2> 2091284 INFO  (zkCallback-13301-thread-1) [     ] o.a.s.c.c.ZkStateReader Updated live nodes from ZooKeeper... (3) -> (4)
   [junit4]   2> 2091284 DEBUG (zkCallback-13321-thread-1) [     ] o.a.s.c.c.ZkStateReader Updated live nodes from ZooKeeper... [127.0.0.1:34769_solr, 127.0.0.1:34787_solr, 127.0.0.1:37557_solr] -> [127.0.0.1:33489_solr, 127.0.0.1:34769_solr, 127.0.0.1:34787_solr, 127.0.0.1:37557_solr]
   [junit4]   2> 2091284 DEBUG (zkCallback-13311-thread-1) [     ] o.a.s.c.c.ZkStateReader Updated live nodes from ZooKeeper... [127.0.0.1:34769_solr, 127.0.0.1:34787_solr, 127.0.0.1:37557_solr] -> [127.0.0.1:33489_solr, 127.0.0.1:34769_solr, 127.0.0.1:34787_solr, 127.0.0.1:37557_solr]
   [junit4]   2> 2091284 DEBUG (zkCallback-13301-thread-1) [     ] o.a.s.c.c.ZkStateReader Updated live nodes from ZooKeeper... [127.0.0.1:34769_solr, 127.0.0.1:34787_solr, 127.0.0.1:37557_solr] -> [127.0.0.1:33489_solr, 127.0.0.1:34769_solr, 127.0.0.1:34787_solr, 127.0.0.1:37557_solr]
   [junit4]   2> 2091284 INFO  (zkCallback-13308-thread-1) [     ] o.a.s.c.c.ZkStateReader Updated live nodes from ZooKeeper... (3) -> (4)
   [junit4]   2> 2091284 DEBUG (zkCallback-13308-thread-1) [     ] o.a.s.c.c.ZkStateReader Updated live nodes from ZooKeeper... [127.0.0.1:34769_solr, 127.0.0.1:34787_solr, 127.0.0.1:37557_solr] -> [127.0.0.1:33489_solr, 127.0.0.1:34769_solr, 127.0.0.1:34787_solr, 127.0.0.1:37557_solr]
   [junit4]   2> 2091284 DEBUG (zkCallback-13337-thread-1) [     ] o.a.s.c.c.ZkStateReader A live node change: [WatchedEvent state:SyncConnected type:NodeChildrenChanged path:/live_nodes], has occurred - updating... (live nodes size: [3])
   [junit4]   2> 2091284 INFO  (zkCallback-13318-thread-1) [     ] o.a.s.c.c.ZkStateReader Updated live nodes from ZooKeeper... (3) -> (4)
   [junit4]   2> 2091284 DEBUG (zkCallback-13318-thread-1) [     ] o.a.s.c.c.ZkStateReader Updated live nodes from ZooKeeper... [127.0.0.1:34769_solr, 127.0.0.1:34787_solr, 127.0.0.1:37557_solr] -> [127.0.0.1:33489_solr, 127.0.0.1:34769_solr, 127.0.0.1:34787_solr, 127.0.0.1:37557_solr]
   [junit4]   2> 2091284 INFO  (zkCallback-13337-thread-1) [     ] o.a.s.c.c.ZkStateReader Updated live nodes from ZooKeeper... (3) -> (4)
   [junit4]   2> 2091284 DEBUG (zkCallback-13337-thread-1) [     ] o.a.s.c.c.ZkStateReader Updated live nodes from ZooKeeper... [127.0.0.1:34769_solr, 127.0.0.1:34787_solr, 127.0.0.1:37557_solr] -> [127.0.0.1:33489_solr, 127.0.0.1:34769_solr, 127.0.0.1:34787_solr, 127.0.0.1:37557_solr]
   [junit4]   2> 2091285 INFO  (jetty-launcher-13270-thread-4) [n:127.0.0.1:33489_solr     ] o.a.s.c.c.ConnectionManager Waiting for client to connect to ZooKeeper
   [junit4]   2> 2091293 DEBUG (zkCallback-13328-thread-1) [     ] o.a.s.c.c.ZkStateReader A live node change: [WatchedEvent state:SyncConnected type:NodeChildrenChanged path:/live_nodes], has occurred - updating... (live nodes size: [3])
   [junit4]   2> 2091293 INFO  (zkConnectionManagerCallback-13345-thread-1) [     ] o.a.s.c.c.ConnectionManager zkClient has connected
   [junit4]   2> 2091293 INFO  (jetty-launcher-13270-thread-4) [n:127.0.0.1:33489_solr     ] o.a.s.c.c.ConnectionManager Client is connected to ZooKeeper
   [junit4]   2> 2091294 DEBUG (jetty-launcher-13270-thread-4) [n:127.0.0.1:33489_solr     ] o.a.s.c.c.ZkStateReader Updating cluster state from ZooKeeper... 
   [junit4]   2> 2091294 INFO  (zkCallback-13328-thread-1) [     ] o.a.s.c.c.ZkStateReader Updated live nodes from ZooKeeper... (3) -> (4)
   [junit4]   2> 2091294 DEBUG (zkCallback-13328-thread-1) [     ] o.a.s.c.c.ZkStateReader Updated live nodes from ZooKeeper... [127.0.0.1:34769_solr, 127.0.0.1:34787_solr, 127.0.0.1:37557_solr] -> [127.0.0.1:33489_solr, 127.0.0.1:34769_solr, 127.0.0.1:34787_solr, 127.0.0.1:37557_solr]
   [junit4]   2> 2091294 DEBUG (jetty-launcher-13270-thread-4) [n:127.0.0.1:33489_solr     ] o.a.s.c.c.ZkStateReader Loaded empty cluster properties
   [junit4]   2> 2091294 INFO  (jetty-launcher-13270-thread-4) [n:127.0.0.1:33489_solr     ] o.a.s.c.c.ZkStateReader Updated live nodes from ZooKeeper... (0) -> (4)
   [junit4]   2> 2091294 DEBUG (jetty-launcher-13270-thread-4) [n:127.0.0.1:33489_solr     ] o.a.s.c.c.ZkStateReader Updated live nodes from ZooKeeper... [] -> [127.0.0.1:33489_solr, 127.0.0.1:34769_solr, 127.0.0.1:34787_solr, 127.0.0.1:37557_solr]
   [junit4]   2> 2091294 DEBUG (jetty-launcher-13270-thread-4) [n:127.0.0.1:33489_solr     ] o.a.s.c.c.ZkStateReader clusterStateSet: legacy [0] interesting [0] watched [0] lazy [0] total [0]
   [junit4]   2> 2091295 INFO  (jetty-launcher-13270-thread-4) [n:127.0.0.1:33489_solr     ] o.a.s.c.s.i.ZkClientClusterStateProvider Cluster at 127.0.0.1:38277/solr ready
   [junit4]   2> 2091295 DEBUG (jetty-launcher-13270-thread-4) [n:127.0.0.1:33489_solr     ] o.a.s.c.PackageBag clusterprops.json changed , version -1
   [junit4]   2> 2091305 INFO  (jetty-launcher-13270-thread-4) [n:127.0.0.1:33489_solr     ] o.a.s.h.a.MetricsHistoryHandler No .system collection, keeping metrics history in memory.
   [junit4]   2> 2091314 INFO  (jetty-launcher-13270-thread-4) [n:127.0.0.1:33489_solr     ] o.a.s.m.r.SolrJmxReporter JMX monitoring for 'solr_33489.solr.node' (registry 'solr.node') enabled at server: com.sun.jmx.mbeanserver.JmxMBeanServer@2737ed8c
   [junit4]   2> 2091321 INFO  (jetty-launcher-13270-thread-4) [n:127.0.0.1:33489_solr     ] o.a.s.m.r.SolrJmxReporter JMX monitoring for 'solr_33489.solr.jvm' (registry 'solr.jvm') enabled at server: com.sun.jmx.mbeanserver.JmxMBeanServer@2737ed8c
   [junit4]   2> 2091321 INFO  (jetty-launcher-13270-thread-4) [n:127.0.0.1:33489_solr     ] o.a.s.m.r.SolrJmxReporter JMX monitoring for 'solr_33489.solr.jetty' (registry 'solr.jetty') enabled at server: com.sun.jmx.mbeanserver.JmxMBeanServer@2737ed8c
   [junit4]   2> 2091322 INFO  (jetty-launcher-13270-thread-4) [n:127.0.0.1:33489_solr     ] o.a.s.c.CorePropertiesLocator Found 0 core definitions underneath /home/jenkins/workspace/Lucene-Solr-SOLR-13661-Linux/solr/build/solr-core/test/J1/temp/solr.handler.TestPackages_BCC2D53CBBFEEB2-001/tempDir-001/node4/.
   [junit4]   2> 2091349 INFO  (TEST-TestPackages.testSetClusterReqHandler-seed#[BCC2D53CBBFEEB2]) [     ] o.a.s.c.MiniSolrCloudCluster waitForAllNodes: numServers=4
   [junit4]   2> 2091349 INFO  (TEST-TestPackages.testSetClusterReqHandler-seed#[BCC2D53CBBFEEB2]) [     ] o.a.s.c.c.ConnectionManager Waiting for client to connect to ZooKeeper
   [junit4]   2> 2091350 INFO  (zkConnectionManagerCallback-13351-thread-1) [     ] o.a.s.c.c.ConnectionManager zkClient has connected
   [junit4]   2> 2091350 INFO  (TEST-TestPackages.testSetClusterReqHandler-seed#[BCC2D53CBBFEEB2]) [     ] o.a.s.c.c.ConnectionManager Client is connected to ZooKeeper
   [junit4]   2> 2091350 DEBUG (TEST-TestPackages.testSetClusterReqHandler-seed#[BCC2D53CBBFEEB2]) [     ] o.a.s.c.c.ZkStateReader Updating cluster state from ZooKeeper... 
   [junit4]   2> 2091350 DEBUG (TEST-TestPackages.testSetClusterReqHandler-seed#[BCC2D53CBBFEEB2]) [     ] o.a.s.c.c.ZkStateReader Loaded empty cluster properties
   [junit4]   2> 2091350 INFO  (TEST-TestPackages.testSetClusterReqHandler-seed#[BCC2D53CBBFEEB2]) [     ] o.a.s.c.c.ZkStateReader Updated live nodes from ZooKeeper... (0) -> (4)
   [junit4]   2> 2091350 DEBUG (TEST-TestPackages.testSetClusterReqHandler-seed#[BCC2D53CBBFEEB2]) [     ] o.a.s.c.c.ZkStateReader Updated live nodes from ZooKeeper... [] -> [127.0.0.1:33489_solr, 127.0.0.1:34769_solr, 127.0.0.1:34787_solr, 127.0.0.1:37557_solr]
   [junit4]   2> 2091351 DEBUG (TEST-TestPackages.testSetClusterReqHandler-seed#[BCC2D53CBBFEEB2]) [     ] o.a.s.c.c.ZkStateReader clusterStateSet: legacy [0] interesting [0] watched [0] lazy [0] total [0]
   [junit4]   2> 2091351 INFO  (TEST-TestPackages.testSetClusterReqHandler-seed#[BCC2D53CBBFEEB2]) [     ] o.a.s.c.s.i.ZkClientClusterStateProvider Cluster at 127.0.0.1:38277/solr ready
   [junit4]   2> 2091354 DEBUG (zkCallback-13321-thread-1) [     ] o.a.s.c.c.ZkStateReader Loaded cluster properties: {requestHandler={foo={name=foo, class=org.apache.solr.handler.DumpRequestHandler}}} to version 0
   [junit4]   2> 2091354 DEBUG (zkCallback-13321-thread-1) [     ] o.a.s.c.PackageBag clusterprops.json changed , version 0
   [junit4]   2> 2091355 DEBUG (zkCallback-13311-thread-1) [     ] o.a.s.c.c.ZkStateReader Loaded cluster properties: {requestHandler={foo={name=foo, class=org.apache.solr.handler.DumpRequestHandler}}} to version 0
   [junit4]   2> 2091355 DEBUG (zkCallback-13311-thread-1) [     ] o.a.s.c.PackageBag clusterprops.json changed , version 0
   [junit4]   2> 2091355 DEBUG (zkCallback-13308-thread-1) [     ] o.a.s.c.c.ZkStateReader Loaded cluster properties: {requestHandler={foo={name=foo, class=org.apache.solr.handler.DumpRequestHandler}}} to version 0
   [junit4]   2> 2091355 DEBUG (zkCallback-13301-thread-1) [     ] o.a.s.c.c.ZkStateReader Loaded cluster properties: {requestHandler={foo={name=foo, class=org.apache.solr.handler.DumpRequestHandler}}} to version 0
   [junit4]   2> 2091355 DEBUG (zkCallback-13318-thread-1) [     ] o.a.s.c.c.ZkStateReader Loaded cluster properties: {requestHandler={foo={name=foo, class=org.apache.solr.handler.DumpRequestHandler}}} to version 0
   [junit4]   2> 2091355 DEBUG (zkCallback-13328-thread-1) [     ] o.a.s.c.c.ZkStateReader Loaded cluster properties: {requestHandler={foo={name=foo, class=org.apache.solr.handler.DumpRequestHandler}}} to version 0
   [junit4]   2> 2091355 DEBUG (zkCallback-13301-thread-1) [     ] o.a.s.c.PackageBag clusterprops.json changed , version 0
   [junit4]   2> 2091355 DEBUG (qtp1845736438-42048) [n:127.0.0.1:33489_solr     ] o.a.s.c.PackageBag clusterprops.json changed , version -1
   [junit4]   2> 2091355 DEBUG (zkCallback-13337-thread-1) [     ] o.a.s.c.c.ZkStateReader Loaded cluster properties: {requestHandler={foo={name=foo, class=org.apache.solr.handler.DumpRequestHandler}}} to version 0
   [junit4]   2> 2091355 DEBUG (zkCallback-13337-thread-1) [     ] o.a.s.c.PackageBag clusterprops.json changed , version 0
   [junit4]   2> 2091355 DEBUG (zkCallback-13344-thread-1) [     ] o.a.s.c.c.ZkStateReader Loaded cluster properties: {requestHandler={foo={name=foo, class=org.apache.solr.handler.DumpRequestHandler}}} to version 0
   [junit4]   2> 2091355 INFO  (qtp1845736438-42048) [n:127.0.0.1:33489_solr     ] o.a.s.h.a.ClusterAPI current version of clusterprops.json is 0 , trying to get every node to update 
   [junit4]   2> 2091355 DEBUG (qtp1845736438-42048) [n:127.0.0.1:33489_solr     ] o.a.s.h.a.ClusterAPI The current clusterprops.json:  {requestHandler={foo={name=foo, class=org.apache.solr.handler.DumpRequestHandler}}}
   [junit4]   2> 2091356 INFO  (qtp1845736438-42048) [n:127.0.0.1:33489_solr     ] o.a.s.h.a.ClusterAPI Waiting up to 30 secs for 4 nodes to update clusterprops to be of version 0 
   [junit4]   2> 2091356 DEBUG (zkCallback-13350-thread-1) [     ] o.a.s.c.c.ZkStateReader Loaded cluster properties: {requestHandler={foo={name=foo, class=org.apache.solr.handler.DumpRequestHandler}}} to version 0
   [junit4]   2> 2091357 DEBUG (solrHandlerExecutor-11430-thread-1-processing-n:127.0.0.1:33489_solr) [n:127.0.0.1:33489_solr     ] o.a.s.h.a.ClusterAPI Time elapsed : 0 secs, maxWait 30
   [junit4]   2> 2091357 DEBUG (solrHandlerExecutor-11430-thread-2-processing-n:127.0.0.1:33489_solr) [n:127.0.0.1:33489_solr     ] o.a.s.h.a.ClusterAPI Time elapsed : 0 secs, maxWait 30
   [junit4]   2> 2091357 DEBUG (solrHandlerExecutor-11430-thread-3-processing-n:127.0.0.1:33489_solr) [n:127.0.0.1:33489_solr     ] o.a.s.h.a.ClusterAPI Time elapsed : 0 secs, maxWait 30
   [junit4]   2> 2091357 DEBUG (solrHandlerExecutor-11430-thread-4-processing-n:127.0.0.1:33489_solr) [n:127.0.0.1:33489_solr     ] o.a.s.h.a.ClusterAPI Time elapsed : 0 secs, maxWait 30
   [junit4]   2> 2091475 INFO  (qtp1739904664-42045) [n:127.0.0.1:37557_solr     ] o.a.s.s.HttpSolrCall [admin] webapp=null path=/node/ext params={omitHeader=true&wt=javabin} status=0 QTime=0
   [junit4]   2> 2091475 INFO  (qtp905545738-42049) [n:127.0.0.1:34769_solr     ] o.a.s.s.HttpSolrCall [admin] webapp=null path=/node/ext params={omitHeader=true&wt=javabin} status=0 QTime=0
   [junit4]   2> 2091475 INFO  (qtp1845736438-42055) [n:127.0.0.1:33489_solr     ] o.a.s.s.HttpSolrCall [admin] webapp=null path=/node/ext params={omitHeader=true&wt=javabin} status=0 QTime=0
   [junit4]   2> 2091475 INFO  (qtp663066222-42043) [n:127.0.0.1:34787_solr     ] o.a.s.s.HttpSolrCall [admin] webapp=null path=/node/ext params={omitHeader=true&wt=javabin} status=0 QTime=0
   [junit4]   2> 2091475 INFO  (qtp1845736438-42048) [n:127.0.0.1:33489_solr     ] o.a.s.h.a.ClusterAPI Took 120.0ms to update the clusterprops to be of version 0  on 4 nodes
   [junit4]   2> 2091475 INFO  (qtp1845736438-42048) [n:127.0.0.1:33489_solr     ] o.a.s.s.HttpSolrCall [admin] webapp=null path=/cluster params={wt=javabin&version=2} status=0 QTime=123
   [junit4]   2> 2091477 INFO  (qtp905545738-42046) [n:127.0.0.1:34769_solr     ] o.a.s.s.HttpSolrCall [admin] webapp=null path=/node/ext params={wt=javabin&version=2} status=0 QTime=0
   [junit4]   2> 2091479 INFO  (qtp1739904664-42039) [n:127.0.0.1:37557_solr     ] o.a.s.s.HttpSolrCall [admin] webapp=null path=/node/ext params={wt=javabin&version=2} status=0 QTime=0
   [junit4]   2> 2091479 INFO  (qtp1739904664-42045) [n:127.0.0.1:37557_solr     ] o.a.s.s.HttpSolrCall [admin] webapp=null path=/node/ext/foo params={testkey=testval&wt=javabin&version=2} status=0 QTime=0
   [junit4]   2> 2091483 DEBUG (zkCallback-13311-thread-1) [     ] o.a.s.c.c.ZkStateReader Loaded cluster properties: {requestHandler={}} to version 1
   [junit4]   2> 2091483 DEBUG (zkCallback-13311-thread-1) [     ] o.a.s.c.PackageBag clusterprops.json changed , version 1
   [junit4]   2> 2091483 DEBUG (zkCallback-13350-thread-1) [     ] o.a.s.c.c.ZkStateReader Loaded cluster properties: {requestHandler={}} to version 1
   [junit4]   2> 2091483 DEBUG (zkCallback-13328-thread-1) [     ] o.a.s.c.c.ZkStateReader Loaded cluster properties: {requestHandler={}} to version 1
   [junit4]   2> 2091483 DEBUG (qtp1739904664-42052) [n:127.0.0.1:37557_solr     ] o.a.s.c.PackageBag clusterprops.json changed , version 0
   [junit4]   2> 2091483 DEBUG (zkCallback-13301-thread-1) [     ] o.a.s.c.c.ZkStateReader Loaded cluster properties: {requestHandler={}} to version 1
   [junit4]   2> 2091483 DEBUG (zkCallback-13301-thread-1) [     ] o.a.s.c.PackageBag clusterprops.json changed , version 1
   [junit4]   2> 2091483 INFO  (qtp1739904664-42052) [n:127.0.0.1:37557_solr     ] o.a.s.h.a.ClusterAPI current version of clusterprops.json is 1 , trying to get every node to update 
   [junit4]   2> 2091483 DEBUG (qtp1739904664-42052) [n:127.0.0.1:37557_solr     ] o.a.s.h.a.ClusterAPI The current clusterprops.json:  {requestHandler={}}
   [junit4]   2> 2091483 INFO  (qtp1739904664-42052) [n:127.0.0.1:37557_solr     ] o.a.s.h.a.ClusterAPI Waiting up to 30 secs for 4 nodes to update clusterprops to be of version 1 
   [junit4]   2> 2091484 DEBUG (solrHandlerExecutor-11431-thread-1-processing-n:127.0.0.1:37557_solr) [n:127.0.0.1:37557_solr     ] o.a.s.h.a.ClusterAPI Time elapsed : 0 secs, maxWait 30
   [junit4]   2> 2091484 DEBUG (solrHandlerExecutor-11431-thread-2-processing-n:127.0.0.1:37557_solr) [n:127.0.0.1:37557_solr     ] o.a.s.h.a.ClusterAPI Time elapsed : 0 secs, maxWait 30
   [junit4]   2> 2091485 DEBUG (zkCallback-13321-thread-1) [     ] o.a.s.c.c.ZkStateReader Loaded cluster properties: {requestHandler={}} to version 1
   [junit4]   2> 2091485 DEBUG (zkCallback-13344-thread-1) [     ] o.a.s.c.c.ZkStateReader Loaded cluster properties: {requestHandler={}} to version 1
   [junit4]   2> 2091485 DEBUG (zkCallback-13321-thread-1) [     ] o.a.s.c.PackageBag clusterprops.json changed , version 1
   [junit4]   2> 2091485 DEBUG (zkCallback-13337-thread-1) [     ] o.a.s.c.c.ZkStateReader Loaded cluster properties: {requestHandler={}} to version 1
   [junit4]   2> 2091485 DEBUG (zkCallback-13337-thread-1) [     ] o.a.s.c.PackageBag clusterprops.json changed , version 1
   [junit4]   2> 2091485 DEBUG (zkCallback-13308-thread-1) [     ] o.a.s.c.c.ZkStateReader Loaded cluster properties: {requestHandler={}} to version 1
   [junit4]   2> 2091485 DEBUG (zkCallback-13318-thread-1) [     ] o.a.s.c.c.ZkStateReader Loaded cluster properties: {requestHandler={}} to version 1
   [junit4]   2> 2091489 DEBUG (solrHandlerExecutor-11431-thread-3-processing-n:127.0.0.1:37557_solr) [n:127.0.0.1:37557_solr     ] o.a.s.h.a.ClusterAPI Time elapsed : 0 secs, maxWait 30
   [junit4]   2> 2091491 DEBUG (solrHandlerExecutor-11431-thread-4-processing-n:127.0.0.1:37557_solr) [n:127.0.0.1:37557_solr     ] o.a.s.h.a.ClusterAPI Time elapsed : 0 secs, maxWait 30
   [junit4]   2> 2091584 INFO  (qtp905545738-42051) [n:127.0.0.1:34769_solr     ] o.a.s.s.HttpSolrCall [admin] webapp=null path=/node/ext params={omitHeader=true&wt=javabin} status=0 QTime=0
   [junit4]   2> 2091585 INFO  (qtp1845736438-42055) [n:127.0.0.1:33489_solr     ] o.a.s.s.HttpSolrCall [admin] webapp=null path=/node/ext params={omitHeader=true&wt=javabin} status=0 QTime=0
   [junit4]   2> 2091590 INFO  (qtp663066222-42041) [n:127.0.0.1:34787_solr     ] o.a.s.s.HttpSolrCall [admin] webapp=null path=/node/ext params={omitHeader=true&wt=javabin} status=0 QTime=0
   [junit4]   2> 2091592 INFO  (qtp1739904664-42045) [n:127.0.0.1:37557_solr     ] o.a.s.s.HttpSolrCall [admin] webapp=null path=/node/ext params={omitHeader=true&wt=javabin} status=0 QTime=0
   [junit4]   2> 2091592 INFO  (qtp1739904664-42052) [n:127.0.0.1:37557_solr     ] o.a.s.h.a.ClusterAPI Took 109.0ms to update the clusterprops to be of version 1  on 4 nodes
   [junit4]   2> 2091592 INFO  (qtp1739904664-42052) [n:127.0.0.1:37557_solr     ] o.a.s.s.HttpSolrCall [admin] webapp=null path=/cluster params={wt=javabin&version=2} status=0 QTime=112
   [junit4]   2> 2091694 INFO  (jetty-closer-13352-thread-1) [     ] o.a.s.c.CoreContainer Shutting down CoreContainer instance=334133734
   [junit4]   2> 2091694 INFO  (jetty-closer-13352-thread-2) [     ] o.a.s.c.CoreContainer Shutting down CoreContainer instance=1173956834
   [junit4]   2> 2091694 INFO  (jetty-closer-13352-thread-1) [     ] o.a.s.c.ZkController Remove node as live in ZooKeeper:/live_nodes/127.0.0.1:37557_solr
   [junit4]   2> 2091694 INFO  (jetty-closer-13352-thread-2) [     ] o.a.s.c.ZkController Remove node as live in ZooKeeper:/live_nodes/127.0.0.1:34769_solr
   [junit4]   2> 2091694 INFO  (jetty-closer-13352-thread-3) [     ] o.a.s.c.CoreContainer Shutting down CoreContainer instance=1336437026
   [junit4]   2> 2091694 INFO  (jetty-closer-13352-thread-3) [     ] o.a.s.c.ZkController Remove node as live in ZooKeeper:/live_nodes/127.0.0.1:34787_solr
   [junit4]   2> 2091694 INFO  (jetty-closer-13352-thread-2) [     ] o.a.s.c.ZkController Publish this node as DOWN...
   [junit4]   2> 2091694 INFO  (jetty-closer-13352-thread-1) [     ] o.a.s.c.ZkController Publish this node as DOWN...
   [junit4]   2> 2091694 INFO  (jetty-closer-13352-thread-2) [     ] o.a.s.c.ZkController Publish node=127.0.0.1:34769_solr as DOWN
   [junit4]   2> 2091694 INFO  (jetty-closer-13352-thread-1) [     ] o.a.s.c.ZkController Publish node=127.0.0.1:37557_solr as DOWN
   [junit4]   2> 2091694 INFO  (jetty-closer-13352-thread-3) [     ] o.a.s.c.ZkController Publish this node as DOWN...
   [junit4]   2> 2091694 INFO  (jetty-closer-13352-thread-3) [     ] o.a.s.c.ZkController Publish node=127.0.0.1:34787_solr as DOWN
   [junit4]   2> 2091695 INFO  (jetty-closer-13352-thread-1) [     ] o.a.s.c.TransientSolrCoreCacheDefault Allocating transient cache for 2147483647 transient cores
   [junit4]   2> 2091695 INFO  (jetty-closer-13352-thread-4) [     ] o.a.s.c.CoreContainer Shutting down CoreContainer instance=1782367815
   [junit4]   2> 2091695 INFO  (jetty-closer-13352-thread-4) [     ] o.a.s.c.ZkController Remove node as live in ZooKeeper:/live_nodes/127.0.0.1:33489_solr
   [junit4]   2> 2091696 INFO  (jetty-closer-13352-thread-1) [     ] o.a.s.m.SolrMetricManager Closing metric reporters for registry=solr.node, tag=null
   [junit4]   2> 2091696 INFO  (jetty-closer-13352-thread-3) [     ] o.a.s.m.SolrMetricManager Closing metric reporters for registry=solr.node, tag=null
   [junit4]   2> 2091696 INFO  (jetty-closer-13352-thread-1) [     ] o.a.s.m.r.SolrJmxReporter Closing reporter [org.apache.solr.metrics.reporters.SolrJmxReporter@2be42ed0: rootName = solr_37557, domain = solr.node, service url = null, agent id = null] for registry solr.node / com.codahale.metrics.MetricRegistry@7c790ffe
   [junit4]   2> 2091696 INFO  (jetty-closer-13352-thread-3) [     ] o.a.s.m.r.SolrJmxReporter Closing reporter [org.apache.solr.metrics.reporters.SolrJmxReporter@19d9c7ad: rootName = solr_34787, domain = solr.node, service url = null, agent id = null] for registry solr.node / com.codahale.metrics.MetricRegistry@6990dbf4
   [junit4]   2> 2091696 INFO  (jetty-closer-13352-thread-4) [     ] o.a.s.c.ZkController Publish this node as DOWN...
   [junit4]   2> 2091696 INFO  (jetty-closer-13352-thread-4) [     ] o.a.s.c.ZkController Publish node=127.0.0.1:33489_solr as DOWN
   [junit4]   2> 2091697 INFO  (jetty-closer-13352-thread-2) [     ] o.a.s.m.SolrMetricManager Closing metric reporters for registry=solr.node, tag=null
   [junit4]   2> 2091697 INFO  (jetty-closer-13352-thread-2) [     ] o.a.s.m.r.SolrJmxReporter Closing reporter [org.apache.solr.metrics.reporters.SolrJmxReporter@2e3c22e2: rootName = solr_34769, domain = solr.node, service url = null, agent id = null] for registry solr.node / com.codahale.metrics.MetricRegistry@fa0dcc1
   [junit4]   2> 2091698 INFO  (jetty-closer-13352-thread-4) [     ] o.a.s.m.SolrMetricManager Closing metric reporters for registry=solr.node, tag=null
   [junit4]   2> 2091698 INFO  (jetty-closer-13352-thread-4) [     ] o.a.s.m.r.SolrJmxReporter Closing reporter [org.apache.solr.metrics.reporters.SolrJmxReporter@1575eb35: rootName = solr_33489, domain = solr.node, service url = null, agent id = null] for registry solr.node / com.codahale.metrics.MetricRegistry@60e85a2a
   [junit4]   2> 2091701 INFO  (jetty-closer-13352-thread-1) [     ] o.a.s.m.SolrMetricManager Closing metric reporters for registry=solr.jvm, tag=null
   [junit4]   2> 2091701 INFO  (jetty-closer-13352-thread-1) [     ] o.a.s.m.r.SolrJmxReporter Closing reporter [org.apache.solr.metrics.reporters.SolrJmxReporter@73440c07: rootName = solr_37557, domain = solr.jvm, service url = null, agent id = null] for registry solr.jvm / com.codahale.metrics.MetricRegistry@71f1b61
   [junit4]   2> 2091702 INFO  (jetty-closer-13352-thread-3) [     ] o.a.s.m.SolrMetricManager Closing metric reporters for registry=solr.jvm, tag=null
   [junit4]   2> 2091702 INFO  (jetty-closer-13352-thread-3) [     ] o.a.s.m.r.SolrJmxReporter Closing reporter [org.apache.solr.metrics.reporters.SolrJmxReporter@53ac9746: rootName = solr_34787, domain = solr.jvm, service url = null, agent id = null] for registry solr.jvm / com.codahale.metrics.MetricRegistry@71f1b61
   [junit4]   2> 2091705 INFO  (jetty-closer-13352-thread-4) [     ] o.a.s.m.SolrMetricManager Closing metric reporters for registry=solr.jvm, tag=null
   [junit4]   2> 2091705 INFO  (jetty-closer-13352-thread-4) [     ] o.a.s.m.r.SolrJmxReporter Closing reporter [org.apache.solr.metrics.reporters.SolrJmxReporter@5463aef9: rootName = solr_33489, domain = solr.jvm, service url = null, agent id = null] for registry solr.jvm / com.codahale.metrics.MetricRegistry@71f1b61
   [junit4]   2> 2091706 INFO  (jetty-closer-13352-thread-1) [     ] o.a.s.m.SolrMetricManager Closing metric reporters for registry=solr.jetty, tag=null
   [junit

[...truncated too long message...]

le.metrics.MetricRegistry@1df67be6
   [junit4]   2> 54333 INFO  (jetty-closer-1061-thread-2) [     ] o.a.s.m.SolrMetricManager Closing metric reporters for registry=solr.cluster, tag=null
   [junit4]   2> 54333 INFO  (jetty-closer-1061-thread-3) [     ] o.a.s.m.SolrMetricManager Closing metric reporters for registry=solr.cluster, tag=null
   [junit4]   2> 54346 INFO  (closeThreadPool-1076-thread-1) [     ] o.a.s.c.Overseer Overseer (id=72272954505756684-127.0.0.1:37473_solr-n_0000000000) closing
   [junit4]   2> 54347 INFO  (OverseerStateUpdate-72272954505756684-127.0.0.1:37473_solr-n_0000000000) [n:127.0.0.1:37473_solr     ] o.a.s.c.Overseer Overseer Loop exiting : 127.0.0.1:37473_solr
   [junit4]   2> 54347 INFO  (OverseerAutoScalingTriggerThread-72272954505756684-127.0.0.1:37473_solr-n_0000000000) [     ] o.a.s.c.a.OverseerTriggerThread OverseerTriggerThread woken up but we are closed, exiting.
   [junit4]   2> 54356 INFO  (closeThreadPool-1076-thread-2) [     ] o.a.s.c.Overseer Overseer (id=72272954505756684-127.0.0.1:37473_solr-n_0000000000) closing
   [junit4]   2> 54357 DEBUG (zkCallback-1031-thread-1) [     ] o.a.s.c.c.ZkStateReader A live node change: [WatchedEvent state:SyncConnected type:NodeChildrenChanged path:/live_nodes], has occurred - updating... (live nodes size: [4])
   [junit4]   2> 54357 DEBUG (zkCallback-1043-thread-1) [     ] o.a.s.c.c.ZkStateReader A live node change: [WatchedEvent state:SyncConnected type:NodeChildrenChanged path:/live_nodes], has occurred - updating... (live nodes size: [4])
   [junit4]   2> 54358 INFO  (zkCallback-1031-thread-1) [     ] o.a.s.c.c.ZkStateReader Updated live nodes from ZooKeeper... (4) -> (3)
   [junit4]   2> 54358 DEBUG (zkCallback-1031-thread-1) [     ] o.a.s.c.c.ZkStateReader Updated live nodes from ZooKeeper... [127.0.0.1:34185_solr, 127.0.0.1:37473_solr, 127.0.0.1:42811_solr, 127.0.0.1:45447_solr] -> [127.0.0.1:34185_solr, 127.0.0.1:42811_solr, 127.0.0.1:45447_solr]
   [junit4]   2> 54458 INFO  (jetty-closer-1061-thread-2) [     ] o.a.s.c.Overseer Overseer (id=72272954505756684-127.0.0.1:37473_solr-n_0000000000) closing
   [junit4]   2> 54458 INFO  (zkCallback-1043-thread-1) [     ] o.a.s.c.c.ZkStateReader Updated live nodes from ZooKeeper... (4) -> (1)
   [junit4]   2> 54458 DEBUG (zkCallback-1043-thread-1) [     ] o.a.s.c.c.ZkStateReader Updated live nodes from ZooKeeper... [127.0.0.1:34185_solr, 127.0.0.1:37473_solr, 127.0.0.1:42811_solr, 127.0.0.1:45447_solr] -> [127.0.0.1:45447_solr]
   [junit4]   2> 54559 INFO  (jetty-closer-1061-thread-2) [     ] o.e.j.s.AbstractConnector Stopped ServerConnector@1746a58d{HTTP/1.1,[http/1.1, h2c]}{127.0.0.1:0}
   [junit4]   2> 54559 INFO  (jetty-closer-1061-thread-2) [     ] o.e.j.s.h.ContextHandler Stopped o.e.j.s.ServletContextHandler@7a8711c0{/solr,null,UNAVAILABLE}
   [junit4]   2> 54559 INFO  (jetty-closer-1061-thread-2) [     ] o.e.j.s.session node0 Stopped scavenging
   [junit4]   2> 54659 INFO  (jetty-closer-1061-thread-4) [     ] o.e.j.s.AbstractConnector Stopped ServerConnector@3c400689{HTTP/1.1,[http/1.1, h2c]}{127.0.0.1:0}
   [junit4]   2> 54659 INFO  (jetty-closer-1061-thread-4) [     ] o.e.j.s.h.ContextHandler Stopped o.e.j.s.ServletContextHandler@66d34f97{/solr,null,UNAVAILABLE}
   [junit4]   2> 54659 INFO  (jetty-closer-1061-thread-4) [     ] o.e.j.s.session node0 Stopped scavenging
   [junit4]   2> 54859 INFO  (jetty-closer-1061-thread-3) [     ] o.e.j.s.AbstractConnector Stopped ServerConnector@13ad8d21{HTTP/1.1,[http/1.1, h2c]}{127.0.0.1:0}
   [junit4]   2> 54859 INFO  (jetty-closer-1061-thread-3) [     ] o.e.j.s.h.ContextHandler Stopped o.e.j.s.ServletContextHandler@4af5d759{/solr,null,UNAVAILABLE}
   [junit4]   2> 54859 INFO  (jetty-closer-1061-thread-3) [     ] o.e.j.s.session node0 Stopped scavenging
   [junit4]   2> 55060 INFO  (jetty-closer-1061-thread-1) [     ] o.e.j.s.AbstractConnector Stopped ServerConnector@786f40d{HTTP/1.1,[http/1.1, h2c]}{127.0.0.1:0}
   [junit4]   2> 55060 INFO  (jetty-closer-1061-thread-1) [     ] o.e.j.s.h.ContextHandler Stopped o.e.j.s.ServletContextHandler@41a85409{/solr,null,UNAVAILABLE}
   [junit4]   2> 55060 INFO  (jetty-closer-1061-thread-1) [     ] o.e.j.s.session node0 Stopped scavenging
   [junit4]   2> 55060 INFO  (TEST-TestPackages.testFileStoreManagement-seed#[BCC2D53CBBFEEB2]) [     ] o.a.s.c.ZkTestServer Shutting down ZkTestServer.
   [junit4]   2> 55262 WARN  (ZkTestServer Run Thread) [     ] o.a.s.c.ZkTestServer Watch limit violations: 
   [junit4]   2> Maximum concurrent create/delete watches above limit:
   [junit4]   2> 
   [junit4]   2> 	9	/solr/aliases.json
   [junit4]   2> 	9	/solr/clusterprops.json
   [junit4]   2> 	4	/solr/security.json
   [junit4]   2> 
   [junit4]   2> Maximum concurrent data watches above limit:
   [junit4]   2> 
   [junit4]   2> 	9	/solr/clusterstate.json
   [junit4]   2> 
   [junit4]   2> Maximum concurrent children watches above limit:
   [junit4]   2> 
   [junit4]   2> 	29	/solr/live_nodes
   [junit4]   2> 	9	/solr/collections
   [junit4]   2> 	6	/solr/overseer/queue
   [junit4]   2> 
   [junit4]   2> 55264 INFO  (TEST-TestPackages.testFileStoreManagement-seed#[BCC2D53CBBFEEB2]) [     ] o.a.s.c.ZkTestServer waitForServerDown: 127.0.0.1:33499
   [junit4]   2> 55264 INFO  (TEST-TestPackages.testFileStoreManagement-seed#[BCC2D53CBBFEEB2]) [     ] o.a.s.c.ZkTestServer parse host and port list: 127.0.0.1:33499
   [junit4]   2> 55264 INFO  (TEST-TestPackages.testFileStoreManagement-seed#[BCC2D53CBBFEEB2]) [     ] o.a.s.c.ZkTestServer connecting to 127.0.0.1 33499
   [junit4]   2> 55264 INFO  (TEST-TestPackages.testFileStoreManagement-seed#[BCC2D53CBBFEEB2]) [     ] o.a.s.SolrTestCaseJ4 ###Ending testFileStoreManagement
   [junit4] OK      4.35s J1 | TestPackages.testFileStoreManagement
   [junit4]   2> 55265 INFO  (SUITE-TestPackages-seed#[BCC2D53CBBFEEB2]-worker) [     ] o.a.s.c.ZkTestServer Shutting down ZkTestServer.
   [junit4]   2> 55265 INFO  (SUITE-TestPackages-seed#[BCC2D53CBBFEEB2]-worker) [     ] o.a.s.c.ZkTestServer waitForServerDown: 127.0.0.1:33499
   [junit4]   2> 55265 INFO  (SUITE-TestPackages-seed#[BCC2D53CBBFEEB2]-worker) [     ] o.a.s.c.ZkTestServer parse host and port list: 127.0.0.1:33499
   [junit4]   2> 55265 INFO  (SUITE-TestPackages-seed#[BCC2D53CBBFEEB2]-worker) [     ] o.a.s.c.ZkTestServer connecting to 127.0.0.1 33499
   [junit4]   2> NOTE: leaving temporary files on disk at: /home/jenkins/workspace/Lucene-Solr-SOLR-13661-Linux/solr/build/solr-core/test/J1/temp/solr.handler.TestPackages_BCC2D53CBBFEEB2-001
   [junit4]   2> Oct 08, 2019 3:33:22 PM com.carrotsearch.randomizedtesting.ThreadLeakControl checkThreadLeaks
   [junit4]   2> WARNING: Will linger awaiting termination of 5 leaked thread(s).
   [junit4]   2> NOTE: test params are: codec=Asserting(Lucene80): {}, docValues:{}, maxPointsInLeafNode=1464, maxMBSortInHeap=7.992598527329813, sim=Asserting(org.apache.lucene.search.similarities.AssertingSimilarity@3aef6c71), locale=ii, timezone=America/Whitehorse
   [junit4]   2> NOTE: Linux 5.0.0-25-generic amd64/AdoptOpenJDK 11.0.4 (64-bit)/cpus=8,threads=1,free=361690880,total=518979584
   [junit4]   2> NOTE: All tests run in this JVM: [TestPackages, TestPackages]
   [junit4] Completed [5/5 (2!)] on J1 in 27.05s, 6 tests, 1 failure, 1 skipped <<< FAILURES!
   [junit4] 
   [junit4] 
   [junit4] Tests with failures [seed: BCC2D53CBBFEEB2]:
   [junit4]   - org.apache.solr.handler.TestPackages.testPluginFrompackage
   [junit4]   - org.apache.solr.handler.TestPackages.testPluginFrompackage
   [junit4] 
   [junit4] 
   [junit4] JVM J0:     0.75 ..    64.12 =    63.37s
   [junit4] JVM J1:     0.75 ..    65.18 =    64.43s
   [junit4] JVM J2:     0.75 ..    37.92 =    37.17s
   [junit4] Execution time total: 1 minute 5 seconds
   [junit4] Tests summary: 5 suites, 30 tests, 2 failures, 5 ignored (5 assumptions)

BUILD FAILED
/home/jenkins/workspace/Lucene-Solr-SOLR-13661-Linux/lucene/common-build.xml:1492: The following error occurred while executing this line:
/home/jenkins/workspace/Lucene-Solr-SOLR-13661-Linux/lucene/common-build.xml:1019: There were test failures: 5 suites, 30 tests, 2 failures, 5 ignored (5 assumptions) [seed: BCC2D53CBBFEEB2]

Total time: 1 minute 6 seconds

[repro] Setting last failure code to 256

[repro] Failures:
[repro]   2/5 failed: org.apache.solr.handler.TestPackages
[repro] Exiting with code 256
+ mv lucene/build lucene/build.repro
+ mv solr/build solr/build.repro
+ mv lucene/build.orig lucene/build
+ mv solr/build.orig solr/build
Archiving artifacts
Setting ANT_1_8_2_HOME=/home/jenkins/tools/hudson.tasks.Ant_AntInstallation/ANT_1.8.2
[WARNINGS] Parsing warnings in console log with parser Java Compiler (javac)
Setting ANT_1_8_2_HOME=/home/jenkins/tools/hudson.tasks.Ant_AntInstallation/ANT_1.8.2
No credentials specified
Setting ANT_1_8_2_HOME=/home/jenkins/tools/hudson.tasks.Ant_AntInstallation/ANT_1.8.2
<Git Blamer> Using GitBlamer to create author and commit information for all warnings.
<Git Blamer> GIT_COMMIT=f664c92e1d47ca99c8b161eba7519d7fcab0402c, workspace=/home/jenkins/workspace/Lucene-Solr-SOLR-13661-Linux
[WARNINGS] Computing warning deltas based on reference build #3
Recording test results
Setting ANT_1_8_2_HOME=/home/jenkins/tools/hudson.tasks.Ant_AntInstallation/ANT_1.8.2
Build step 'Publish JUnit test result report' changed build result to UNSTABLE
Email was triggered for: Unstable (Test Failures)
Sending email for trigger: Unstable (Test Failures)
Setting ANT_1_8_2_HOME=/home/jenkins/tools/hudson.tasks.Ant_AntInstallation/ANT_1.8.2
Setting ANT_1_8_2_HOME=/home/jenkins/tools/hudson.tasks.Ant_AntInstallation/ANT_1.8.2
Setting ANT_1_8_2_HOME=/home/jenkins/tools/hudson.tasks.Ant_AntInstallation/ANT_1.8.2
Setting ANT_1_8_2_HOME=/home/jenkins/tools/hudson.tasks.Ant_AntInstallation/ANT_1.8.2
Setting ANT_1_8_2_HOME=/home/jenkins/tools/hudson.tasks.Ant_AntInstallation/ANT_1.8.2
Setting ANT_1_8_2_HOME=/home/jenkins/tools/hudson.tasks.Ant_AntInstallation/ANT_1.8.2

[JENKINS] Lucene-Solr-SOLR-13661-Linux (64bit/jdk-13) - Build # 6 - Failure!

Posted by Policeman Jenkins Server <je...@thetaphi.de>.
Build: https://jenkins.thetaphi.de/job/Lucene-Solr-SOLR-13661-Linux/6/
Java: 64bit/jdk-13 -XX:+UseCompressedOops -XX:+UseConcMarkSweepGC

All tests passed

Build Log:
[...truncated 2096 lines...]
   [junit4] JVM J1: stderr was not empty, see: /home/jenkins/workspace/Lucene-Solr-SOLR-13661-Linux/lucene/build/core/test/temp/junit4-J1-20191009_010745_01013420673059224035267.syserr
   [junit4] >>> JVM J1 emitted unexpected output (verbatim) ----
   [junit4] OpenJDK 64-Bit Server VM warning: Option UseConcMarkSweepGC was deprecated in version 9.0 and will likely be removed in a future release.
   [junit4] <<< JVM J1: EOF ----

[...truncated 5 lines...]
   [junit4] JVM J2: stderr was not empty, see: /home/jenkins/workspace/Lucene-Solr-SOLR-13661-Linux/lucene/build/core/test/temp/junit4-J2-20191009_010745_0177734559618707558279.syserr
   [junit4] >>> JVM J2 emitted unexpected output (verbatim) ----
   [junit4] OpenJDK 64-Bit Server VM warning: Option UseConcMarkSweepGC was deprecated in version 9.0 and will likely be removed in a future release.
   [junit4] <<< JVM J2: EOF ----

[...truncated 5 lines...]
   [junit4] JVM J0: stderr was not empty, see: /home/jenkins/workspace/Lucene-Solr-SOLR-13661-Linux/lucene/build/core/test/temp/junit4-J0-20191009_010745_01611600034059423416862.syserr
   [junit4] >>> JVM J0 emitted unexpected output (verbatim) ----
   [junit4] OpenJDK 64-Bit Server VM warning: Option UseConcMarkSweepGC was deprecated in version 9.0 and will likely be removed in a future release.
   [junit4] <<< JVM J0: EOF ----

[...truncated 301 lines...]
   [junit4] JVM J2: stderr was not empty, see: /home/jenkins/workspace/Lucene-Solr-SOLR-13661-Linux/lucene/build/test-framework/test/temp/junit4-J2-20191009_011833_3267786302521262428432.syserr
   [junit4] >>> JVM J2 emitted unexpected output (verbatim) ----
   [junit4] OpenJDK 64-Bit Server VM warning: Option UseConcMarkSweepGC was deprecated in version 9.0 and will likely be removed in a future release.
   [junit4] <<< JVM J2: EOF ----

[...truncated 3 lines...]
   [junit4] JVM J1: stderr was not empty, see: /home/jenkins/workspace/Lucene-Solr-SOLR-13661-Linux/lucene/build/test-framework/test/temp/junit4-J1-20191009_011833_32615019737912378385094.syserr
   [junit4] >>> JVM J1 emitted unexpected output (verbatim) ----
   [junit4] OpenJDK 64-Bit Server VM warning: Option UseConcMarkSweepGC was deprecated in version 9.0 and will likely be removed in a future release.
   [junit4] <<< JVM J1: EOF ----

[...truncated 3 lines...]
   [junit4] JVM J0: stderr was not empty, see: /home/jenkins/workspace/Lucene-Solr-SOLR-13661-Linux/lucene/build/test-framework/test/temp/junit4-J0-20191009_011833_32613025262872222019938.syserr
   [junit4] >>> JVM J0 emitted unexpected output (verbatim) ----
   [junit4] OpenJDK 64-Bit Server VM warning: Option UseConcMarkSweepGC was deprecated in version 9.0 and will likely be removed in a future release.
   [junit4] <<< JVM J0: EOF ----

[...truncated 1088 lines...]
   [junit4] JVM J2: stderr was not empty, see: /home/jenkins/workspace/Lucene-Solr-SOLR-13661-Linux/lucene/build/analysis/common/test/temp/junit4-J2-20191009_012022_84012701173338162936806.syserr
   [junit4] >>> JVM J2 emitted unexpected output (verbatim) ----
   [junit4] OpenJDK 64-Bit Server VM warning: Option UseConcMarkSweepGC was deprecated in version 9.0 and will likely be removed in a future release.
   [junit4] <<< JVM J2: EOF ----

[...truncated 6 lines...]
   [junit4] JVM J0: stderr was not empty, see: /home/jenkins/workspace/Lucene-Solr-SOLR-13661-Linux/lucene/build/analysis/common/test/temp/junit4-J0-20191009_012022_840617169361264332550.syserr
   [junit4] >>> JVM J0 emitted unexpected output (verbatim) ----
   [junit4] OpenJDK 64-Bit Server VM warning: Option UseConcMarkSweepGC was deprecated in version 9.0 and will likely be removed in a future release.
   [junit4] <<< JVM J0: EOF ----

   [junit4] JVM J1: stderr was not empty, see: /home/jenkins/workspace/Lucene-Solr-SOLR-13661-Linux/lucene/build/analysis/common/test/temp/junit4-J1-20191009_012022_84015889314230694367090.syserr
   [junit4] >>> JVM J1 emitted unexpected output (verbatim) ----
   [junit4] OpenJDK 64-Bit Server VM warning: Option UseConcMarkSweepGC was deprecated in version 9.0 and will likely be removed in a future release.
   [junit4] <<< JVM J1: EOF ----

[...truncated 241 lines...]
   [junit4] JVM J1: stderr was not empty, see: /home/jenkins/workspace/Lucene-Solr-SOLR-13661-Linux/lucene/build/analysis/icu/test/temp/junit4-J1-20191009_012219_0329582123466898791969.syserr
   [junit4] >>> JVM J1 emitted unexpected output (verbatim) ----
   [junit4] OpenJDK 64-Bit Server VM warning: Option UseConcMarkSweepGC was deprecated in version 9.0 and will likely be removed in a future release.
   [junit4] <<< JVM J1: EOF ----

[...truncated 3 lines...]
   [junit4] JVM J2: stderr was not empty, see: /home/jenkins/workspace/Lucene-Solr-SOLR-13661-Linux/lucene/build/analysis/icu/test/temp/junit4-J2-20191009_012219_0327115449080920543344.syserr
   [junit4] >>> JVM J2 emitted unexpected output (verbatim) ----
   [junit4] OpenJDK 64-Bit Server VM warning: Option UseConcMarkSweepGC was deprecated in version 9.0 and will likely be removed in a future release.
   [junit4] <<< JVM J2: EOF ----

[...truncated 3 lines...]
   [junit4] JVM J0: stderr was not empty, see: /home/jenkins/workspace/Lucene-Solr-SOLR-13661-Linux/lucene/build/analysis/icu/test/temp/junit4-J0-20191009_012219_032106880486839316561.syserr
   [junit4] >>> JVM J0 emitted unexpected output (verbatim) ----
   [junit4] OpenJDK 64-Bit Server VM warning: Option UseConcMarkSweepGC was deprecated in version 9.0 and will likely be removed in a future release.
   [junit4] <<< JVM J0: EOF ----

[...truncated 215 lines...]
   [junit4] JVM J1: stderr was not empty, see: /home/jenkins/workspace/Lucene-Solr-SOLR-13661-Linux/lucene/build/analysis/kuromoji/test/temp/junit4-J1-20191009_012232_6137816621133655964620.syserr
   [junit4] >>> JVM J1 emitted unexpected output (verbatim) ----
   [junit4] OpenJDK 64-Bit Server VM warning: Option UseConcMarkSweepGC was deprecated in version 9.0 and will likely be removed in a future release.
   [junit4] <<< JVM J1: EOF ----

[...truncated 3 lines...]
   [junit4] JVM J2: stderr was not empty, see: /home/jenkins/workspace/Lucene-Solr-SOLR-13661-Linux/lucene/build/analysis/kuromoji/test/temp/junit4-J2-20191009_012232_6134609848596275876928.syserr
   [junit4] >>> JVM J2 emitted unexpected output (verbatim) ----
   [junit4] OpenJDK 64-Bit Server VM warning: Option UseConcMarkSweepGC was deprecated in version 9.0 and will likely be removed in a future release.
   [junit4] <<< JVM J2: EOF ----

[...truncated 5 lines...]
   [junit4] JVM J0: stderr was not empty, see: /home/jenkins/workspace/Lucene-Solr-SOLR-13661-Linux/lucene/build/analysis/kuromoji/test/temp/junit4-J0-20191009_012232_61314098706949685248902.syserr
   [junit4] >>> JVM J0 emitted unexpected output (verbatim) ----
   [junit4] OpenJDK 64-Bit Server VM warning: Option UseConcMarkSweepGC was deprecated in version 9.0 and will likely be removed in a future release.
   [junit4] <<< JVM J0: EOF ----

[...truncated 154 lines...]
   [junit4] JVM J1: stderr was not empty, see: /home/jenkins/workspace/Lucene-Solr-SOLR-13661-Linux/lucene/build/analysis/morfologik/test/temp/junit4-J1-20191009_012301_0144149882856952924969.syserr
   [junit4] >>> JVM J1 emitted unexpected output (verbatim) ----
   [junit4] OpenJDK 64-Bit Server VM warning: Option UseConcMarkSweepGC was deprecated in version 9.0 and will likely be removed in a future release.
   [junit4] <<< JVM J1: EOF ----

[...truncated 3 lines...]
   [junit4] JVM J0: stderr was not empty, see: /home/jenkins/workspace/Lucene-Solr-SOLR-13661-Linux/lucene/build/analysis/morfologik/test/temp/junit4-J0-20191009_012301_0148027724983874763289.syserr
   [junit4] >>> JVM J0 emitted unexpected output (verbatim) ----
   [junit4] OpenJDK 64-Bit Server VM warning: Option UseConcMarkSweepGC was deprecated in version 9.0 and will likely be removed in a future release.
   [junit4] <<< JVM J0: EOF ----

[...truncated 3 lines...]
   [junit4] JVM J2: stderr was not empty, see: /home/jenkins/workspace/Lucene-Solr-SOLR-13661-Linux/lucene/build/analysis/morfologik/test/temp/junit4-J2-20191009_012301_01612276919120054722650.syserr
   [junit4] >>> JVM J2 emitted unexpected output (verbatim) ----
   [junit4] OpenJDK 64-Bit Server VM warning: Option UseConcMarkSweepGC was deprecated in version 9.0 and will likely be removed in a future release.
   [junit4] <<< JVM J2: EOF ----

[...truncated 177 lines...]
   [junit4] JVM J1: stderr was not empty, see: /home/jenkins/workspace/Lucene-Solr-SOLR-13661-Linux/lucene/build/analysis/nori/test/temp/junit4-J1-20191009_012306_03715056477512479198923.syserr
   [junit4] >>> JVM J1 emitted unexpected output (verbatim) ----
   [junit4] OpenJDK 64-Bit Server VM warning: Option UseConcMarkSweepGC was deprecated in version 9.0 and will likely be removed in a future release.
   [junit4] <<< JVM J1: EOF ----

[...truncated 3 lines...]
   [junit4] JVM J2: stderr was not empty, see: /home/jenkins/workspace/Lucene-Solr-SOLR-13661-Linux/lucene/build/analysis/nori/test/temp/junit4-J2-20191009_012306_03716597819281243586043.syserr
   [junit4] >>> JVM J2 emitted unexpected output (verbatim) ----
   [junit4] OpenJDK 64-Bit Server VM warning: Option UseConcMarkSweepGC was deprecated in version 9.0 and will likely be removed in a future release.
   [junit4] <<< JVM J2: EOF ----

[...truncated 6 lines...]
   [junit4] JVM J0: stderr was not empty, see: /home/jenkins/workspace/Lucene-Solr-SOLR-13661-Linux/lucene/build/analysis/nori/test/temp/junit4-J0-20191009_012306_03717085970309187850699.syserr
   [junit4] >>> JVM J0 emitted unexpected output (verbatim) ----
   [junit4] OpenJDK 64-Bit Server VM warning: Option UseConcMarkSweepGC was deprecated in version 9.0 and will likely be removed in a future release.
   [junit4] <<< JVM J0: EOF ----

[...truncated 160 lines...]
   [junit4] JVM J1: stderr was not empty, see: /home/jenkins/workspace/Lucene-Solr-SOLR-13661-Linux/lucene/build/analysis/opennlp/test/temp/junit4-J1-20191009_012319_50818324639776577084441.syserr
   [junit4] >>> JVM J1 emitted unexpected output (verbatim) ----
   [junit4] OpenJDK 64-Bit Server VM warning: Option UseConcMarkSweepGC was deprecated in version 9.0 and will likely be removed in a future release.
   [junit4] <<< JVM J1: EOF ----

[...truncated 6 lines...]
   [junit4] JVM J0: stderr was not empty, see: /home/jenkins/workspace/Lucene-Solr-SOLR-13661-Linux/lucene/build/analysis/opennlp/test/temp/junit4-J0-20191009_012319_50713769292534084115459.syserr
   [junit4] >>> JVM J0 emitted unexpected output (verbatim) ----
   [junit4] OpenJDK 64-Bit Server VM warning: Option UseConcMarkSweepGC was deprecated in version 9.0 and will likely be removed in a future release.
   [junit4] <<< JVM J0: EOF ----

   [junit4] JVM J2: stderr was not empty, see: /home/jenkins/workspace/Lucene-Solr-SOLR-13661-Linux/lucene/build/analysis/opennlp/test/temp/junit4-J2-20191009_012319_50815176638041104013880.syserr
   [junit4] >>> JVM J2 emitted unexpected output (verbatim) ----
   [junit4] OpenJDK 64-Bit Server VM warning: Option UseConcMarkSweepGC was deprecated in version 9.0 and will likely be removed in a future release.
   [junit4] <<< JVM J2: EOF ----

[...truncated 168 lines...]
   [junit4] JVM J0: stderr was not empty, see: /home/jenkins/workspace/Lucene-Solr-SOLR-13661-Linux/lucene/build/analysis/phonetic/test/temp/junit4-J0-20191009_012323_5611273681411638758884.syserr
   [junit4] >>> JVM J0 emitted unexpected output (verbatim) ----
   [junit4] OpenJDK 64-Bit Server VM warning: Option UseConcMarkSweepGC was deprecated in version 9.0 and will likely be removed in a future release.
   [junit4] <<< JVM J0: EOF ----

[...truncated 3 lines...]
   [junit4] JVM J1: stderr was not empty, see: /home/jenkins/workspace/Lucene-Solr-SOLR-13661-Linux/lucene/build/analysis/phonetic/test/temp/junit4-J1-20191009_012323_56210558349217576837521.syserr
   [junit4] >>> JVM J1 emitted unexpected output (verbatim) ----
   [junit4] OpenJDK 64-Bit Server VM warning: Option UseConcMarkSweepGC was deprecated in version 9.0 and will likely be removed in a future release.
   [junit4] <<< JVM J1: EOF ----

[...truncated 3 lines...]
   [junit4] JVM J2: stderr was not empty, see: /home/jenkins/workspace/Lucene-Solr-SOLR-13661-Linux/lucene/build/analysis/phonetic/test/temp/junit4-J2-20191009_012323_56212037498757563056232.syserr
   [junit4] >>> JVM J2 emitted unexpected output (verbatim) ----
   [junit4] OpenJDK 64-Bit Server VM warning: Option UseConcMarkSweepGC was deprecated in version 9.0 and will likely be removed in a future release.
   [junit4] <<< JVM J2: EOF ----

[...truncated 153 lines...]
   [junit4] JVM J0: stderr was not empty, see: /home/jenkins/workspace/Lucene-Solr-SOLR-13661-Linux/lucene/build/analysis/smartcn/test/temp/junit4-J0-20191009_012333_3163813663731362827649.syserr
   [junit4] >>> JVM J0 emitted unexpected output (verbatim) ----
   [junit4] OpenJDK 64-Bit Server VM warning: Option UseConcMarkSweepGC was deprecated in version 9.0 and will likely be removed in a future release.
   [junit4] <<< JVM J0: EOF ----

[...truncated 3 lines...]
   [junit4] JVM J1: stderr was not empty, see: /home/jenkins/workspace/Lucene-Solr-SOLR-13661-Linux/lucene/build/analysis/smartcn/test/temp/junit4-J1-20191009_012333_31618348969023077540168.syserr
   [junit4] >>> JVM J1 emitted unexpected output (verbatim) ----
   [junit4] OpenJDK 64-Bit Server VM warning: Option UseConcMarkSweepGC was deprecated in version 9.0 and will likely be removed in a future release.
   [junit4] <<< JVM J1: EOF ----

[...truncated 154 lines...]
   [junit4] JVM J1: stderr was not empty, see: /home/jenkins/workspace/Lucene-Solr-SOLR-13661-Linux/lucene/build/analysis/stempel/test/temp/junit4-J1-20191009_012342_2066930039448868531888.syserr
   [junit4] >>> JVM J1 emitted unexpected output (verbatim) ----
   [junit4] OpenJDK 64-Bit Server VM warning: Option UseConcMarkSweepGC was deprecated in version 9.0 and will likely be removed in a future release.
   [junit4] <<< JVM J1: EOF ----

[...truncated 3 lines...]
   [junit4] JVM J2: stderr was not empty, see: /home/jenkins/workspace/Lucene-Solr-SOLR-13661-Linux/lucene/build/analysis/stempel/test/temp/junit4-J2-20191009_012342_20714578362027781457910.syserr
   [junit4] >>> JVM J2 emitted unexpected output (verbatim) ----
   [junit4] OpenJDK 64-Bit Server VM warning: Option UseConcMarkSweepGC was deprecated in version 9.0 and will likely be removed in a future release.
   [junit4] <<< JVM J2: EOF ----

[...truncated 3 lines...]
   [junit4] JVM J0: stderr was not empty, see: /home/jenkins/workspace/Lucene-Solr-SOLR-13661-Linux/lucene/build/analysis/stempel/test/temp/junit4-J0-20191009_012342_2046818635245762769468.syserr
   [junit4] >>> JVM J0 emitted unexpected output (verbatim) ----
   [junit4] OpenJDK 64-Bit Server VM warning: Option UseConcMarkSweepGC was deprecated in version 9.0 and will likely be removed in a future release.
   [junit4] <<< JVM J0: EOF ----

[...truncated 178 lines...]
   [junit4] JVM J0: stderr was not empty, see: /home/jenkins/workspace/Lucene-Solr-SOLR-13661-Linux/lucene/build/backward-codecs/test/temp/junit4-J0-20191009_012347_2281686535990578560076.syserr
   [junit4] >>> JVM J0 emitted unexpected output (verbatim) ----
   [junit4] OpenJDK 64-Bit Server VM warning: Option UseConcMarkSweepGC was deprecated in version 9.0 and will likely be removed in a future release.
   [junit4] <<< JVM J0: EOF ----

[...truncated 9 lines...]
   [junit4] JVM J2: stderr was not empty, see: /home/jenkins/workspace/Lucene-Solr-SOLR-13661-Linux/lucene/build/backward-codecs/test/temp/junit4-J2-20191009_012347_22815261675464732801696.syserr
   [junit4] >>> JVM J2 emitted unexpected output (verbatim) ----
   [junit4] OpenJDK 64-Bit Server VM warning: Option UseConcMarkSweepGC was deprecated in version 9.0 and will likely be removed in a future release.
   [junit4] <<< JVM J2: EOF ----

[...truncated 1 lines...]
   [junit4] JVM J1: stdout was not empty, see: /home/jenkins/workspace/Lucene-Solr-SOLR-13661-Linux/lucene/build/backward-codecs/test/temp/junit4-J1-20191009_012347_2281375661738911692401.sysout
   [junit4] >>> JVM J1 emitted unexpected output (verbatim) ----
   [junit4] #
   [junit4] # A fatal error has been detected by the Java Runtime Environment:
   [junit4] #
   [junit4] #  SIGSEGV (0xb) at pc=0x00007f13cb137846, pid=12951, tid=12994
   [junit4] #
   [junit4] # JRE version: OpenJDK Runtime Environment (13.0+33) (build 13+33)
   [junit4] # Java VM: OpenJDK 64-Bit Server VM (13+33, mixed mode, sharing, tiered, compressed oops, concurrent mark sweep gc, linux-amd64)
   [junit4] # Problematic frame:
   [junit4] # V  [libjvm.so+0xcac846]  PhaseIdealLoop::split_up(Node*, Node*, Node*)+0x7f6
   [junit4] #
   [junit4] # No core dump will be written. Core dumps have been disabled. To enable core dumping, try "ulimit -c unlimited" before starting Java again
   [junit4] #
   [junit4] # An error report file with more information is saved as:
   [junit4] # /home/jenkins/workspace/Lucene-Solr-SOLR-13661-Linux/lucene/build/backward-codecs/test/J1/hs_err_pid12951.log
   [junit4] [thread 14311 also had an error][thread 14316 also had an error]
   [junit4] 
   [junit4] 
   [junit4] ------ Timeout during error reporting after 120 s. ------
   [junit4] # [ timer expired, abort... ]
   [junit4] <<< JVM J1: EOF ----

   [junit4] JVM J1: stderr was not empty, see: /home/jenkins/workspace/Lucene-Solr-SOLR-13661-Linux/lucene/build/backward-codecs/test/temp/junit4-J1-20191009_012347_2284372992480905578107.syserr
   [junit4] >>> JVM J1 emitted unexpected output (verbatim) ----
   [junit4] OpenJDK 64-Bit Server VM warning: Option UseConcMarkSweepGC was deprecated in version 9.0 and will likely be removed in a future release.
   [junit4] <<< JVM J1: EOF ----

[...truncated 3 lines...]
   [junit4] ERROR: JVM J1 ended with an exception, command line: /home/jenkins/tools/java/64bit/jdk-13/bin/java -XX:+UseCompressedOops -XX:+UseConcMarkSweepGC -XX:+HeapDumpOnOutOfMemoryError -XX:HeapDumpPath=/home/jenkins/workspace/Lucene-Solr-SOLR-13661-Linux/heapdumps -ea -esa --illegal-access=deny -Dtests.prefix=tests -Dtests.seed=40089A543C91D447 -Xmx512M -Dtests.iters= -Dtests.verbose=false -Dtests.infostream=false -Dtests.codec=random -Dtests.postingsformat=random -Dtests.docvaluesformat=random -Dtests.locale=random -Dtests.timezone=random -Dtests.directory=random -Dtests.linedocsfile=europarl.lines.txt.gz -Dtests.luceneMatchVersion=9.0.0 -Dtests.cleanthreads=perMethod -Djava.util.logging.config.file=/home/jenkins/workspace/Lucene-Solr-SOLR-13661-Linux/lucene/tools/junit4/logging.properties -Dtests.nightly=false -Dtests.weekly=false -Dtests.monster=false -Dtests.slow=true -Dtests.asserts=true -Dtests.multiplier=3 -DtempDir=./temp -Djava.io.tmpdir=./temp -Dcommon.dir=/home/jenkins/workspace/Lucene-Solr-SOLR-13661-Linux/lucene -Dclover.db.dir=/home/jenkins/workspace/Lucene-Solr-SOLR-13661-Linux/lucene/build/clover/db -Djava.security.policy=/home/jenkins/workspace/Lucene-Solr-SOLR-13661-Linux/lucene/tools/junit4/tests.policy -Dtests.LUCENE_VERSION=9.0.0 -Djetty.testMode=1 -Djetty.insecurerandom=1 -Dsolr.directoryFactory=org.apache.solr.core.MockDirectoryFactory -Djava.awt.headless=true -Djdk.map.althashing.threshold=0 -Dtests.src.home=/home/jenkins/workspace/Lucene-Solr-SOLR-13661-Linux -Djava.security.egd=file:/dev/./urandom -Djunit4.childvm.cwd=/home/jenkins/workspace/Lucene-Solr-SOLR-13661-Linux/lucene/build/backward-codecs/test/J1 -Djunit4.tempDir=/home/jenkins/workspace/Lucene-Solr-SOLR-13661-Linux/lucene/build/backward-codecs/test/temp -Djunit4.childvm.id=1 -Djunit4.childvm.count=3 -Dfile.encoding=US-ASCII -Djava.security.manager=org.apache.lucene.util.TestSecurityManager -Dtests.filterstacks=true -Dtests.leaveTemporary=false -Dtests.badapples=false -classpath /home/jenkins/workspace/Lucene-Solr-SOLR-13661-Linux/lucene/build/backward-codecs/classes/test:/home/jenkins/workspace/Lucene-Solr-SOLR-13661-Linux/lucene/build/test-framework/classes/java:/home/jenkins/workspace/Lucene-Solr-SOLR-13661-Linux/lucene/build/codecs/classes/java:/home/jenkins/workspace/Lucene-Solr-SOLR-13661-Linux/lucene/build/core/classes/java:/home/jenkins/workspace/Lucene-Solr-SOLR-13661-Linux/lucene/test-framework/lib/hamcrest-core-1.3.jar:/home/jenkins/workspace/Lucene-Solr-SOLR-13661-Linux/lucene/test-framework/lib/junit-4.12.jar:/home/jenkins/workspace/Lucene-Solr-SOLR-13661-Linux/lucene/test-framework/lib/randomizedtesting-runner-2.7.2.jar:/home/jenkins/workspace/Lucene-Solr-SOLR-13661-Linux/lucene/build/backward-codecs/classes/java:/home/jenkins/tools/hudson.tasks.Ant_AntInstallation/ANT_1.8.2/lib/ant-launcher.jar:/home/jenkins/.ant/lib/ivy-2.4.0.jar:/home/jenkins/tools/hudson.tasks.Ant_AntInstallation/ANT_1.8.2/lib/ant-netrexx.jar:/home/jenkins/tools/hudson.tasks.Ant_AntInstallation/ANT_1.8.2/lib/ant-apache-xalan2.jar:/home/jenkins/tools/hudson.tasks.Ant_AntInstallation/ANT_1.8.2/lib/ant.jar:/home/jenkins/tools/hudson.tasks.Ant_AntInstallation/ANT_1.8.2/lib/ant-javamail.jar:/home/jenkins/tools/hudson.tasks.Ant_AntInstallation/ANT_1.8.2/lib/ant-commons-net.jar:/home/jenkins/tools/hudson.tasks.Ant_AntInstallation/ANT_1.8.2/lib/ant-apache-regexp.jar:/home/jenkins/tools/hudson.tasks.Ant_AntInstallation/ANT_1.8.2/lib/ant-apache-oro.jar:/home/jenkins/tools/hudson.tasks.Ant_AntInstallation/ANT_1.8.2/lib/ant-jmf.jar:/home/jenkins/tools/hudson.tasks.Ant_AntInstallation/ANT_1.8.2/lib/ant-apache-log4j.jar:/home/jenkins/tools/hudson.tasks.Ant_AntInstallation/ANT_1.8.2/lib/ant-jsch.jar:/home/jenkins/tools/hudson.tasks.Ant_AntInstallation/ANT_1.8.2/lib/ant-jai.jar:/home/jenkins/tools/hudson.tasks.Ant_AntInstallation/ANT_1.8.2/lib/ant-apache-bsf.jar:/home/jenkins/tools/hudson.tasks.Ant_AntInstallation/ANT_1.8.2/lib/ant-junit4.jar:/home/jenkins/tools/hudson.tasks.Ant_AntInstallation/ANT_1.8.2/lib/ant-apache-resolver.jar:/home/jenkins/tools/hudson.tasks.Ant_AntInstallation/ANT_1.8.2/lib/ant-apache-bcel.jar:/home/jenkins/tools/hudson.tasks.Ant_AntInstallation/ANT_1.8.2/lib/ant-junit.jar:/home/jenkins/tools/hudson.tasks.Ant_AntInstallation/ANT_1.8.2/lib/ant-jdepend.jar:/home/jenkins/tools/hudson.tasks.Ant_AntInstallation/ANT_1.8.2/lib/ant-testutil.jar:/home/jenkins/tools/hudson.tasks.Ant_AntInstallation/ANT_1.8.2/lib/ant-antlr.jar:/home/jenkins/tools/hudson.tasks.Ant_AntInstallation/ANT_1.8.2/lib/ant-swing.jar:/home/jenkins/tools/hudson.tasks.Ant_AntInstallation/ANT_1.8.2/lib/ant-commons-logging.jar:/home/jenkins/.ivy2/cache/com.carrotsearch.randomizedtesting/junit4-ant/jars/junit4-ant-2.7.2.jar com.carrotsearch.ant.tasks.junit4.slave.SlaveMainSafe -eventsfile /home/jenkins/workspace/Lucene-Solr-SOLR-13661-Linux/lucene/build/backward-codecs/test/temp/junit4-J1-20191009_012347_22813886816325373809016.events @/home/jenkins/workspace/Lucene-Solr-SOLR-13661-Linux/lucene/build/backward-codecs/test/temp/junit4-J1-20191009_012347_22818403937015531663284.suites -stdin
   [junit4] ERROR: JVM J1 ended with an exception: Forked process returned with error code: 134. Very likely a JVM crash.  See process stdout at: /home/jenkins/workspace/Lucene-Solr-SOLR-13661-Linux/lucene/build/backward-codecs/test/temp/junit4-J1-20191009_012347_2281375661738911692401.sysout See process stderr at: /home/jenkins/workspace/Lucene-Solr-SOLR-13661-Linux/lucene/build/backward-codecs/test/temp/junit4-J1-20191009_012347_2284372992480905578107.syserr
   [junit4] 	at com.carrotsearch.ant.tasks.junit4.JUnit4.executeSlave(JUnit4.java:1542)
   [junit4] 	at com.carrotsearch.ant.tasks.junit4.JUnit4.access$000(JUnit4.java:123)
   [junit4] 	at com.carrotsearch.ant.tasks.junit4.JUnit4$2.call(JUnit4.java:997)
   [junit4] 	at com.carrotsearch.ant.tasks.junit4.JUnit4$2.call(JUnit4.java:994)
   [junit4] 	at java.base/java.util.concurrent.FutureTask.run(FutureTask.java:264)
   [junit4] 	at java.base/java.util.concurrent.ThreadPoolExecutor.runWorker(ThreadPoolExecutor.java:1128)
   [junit4] 	at java.base/java.util.concurrent.ThreadPoolExecutor$Worker.run(ThreadPoolExecutor.java:628)
   [junit4] 	at java.base/java.lang.Thread.run(Thread.java:830)

BUILD FAILED
/home/jenkins/workspace/Lucene-Solr-SOLR-13661-Linux/build.xml:634: The following error occurred while executing this line:
/home/jenkins/workspace/Lucene-Solr-SOLR-13661-Linux/build.xml:578: The following error occurred while executing this line:
/home/jenkins/workspace/Lucene-Solr-SOLR-13661-Linux/build.xml:59: The following error occurred while executing this line:
/home/jenkins/workspace/Lucene-Solr-SOLR-13661-Linux/lucene/build.xml:481: The following error occurred while executing this line:
/home/jenkins/workspace/Lucene-Solr-SOLR-13661-Linux/lucene/common-build.xml:2181: The following error occurred while executing this line:
/home/jenkins/workspace/Lucene-Solr-SOLR-13661-Linux/lucene/module-build.xml:58: The following error occurred while executing this line:
/home/jenkins/workspace/Lucene-Solr-SOLR-13661-Linux/lucene/common-build.xml:1492: The following error occurred while executing this line:
/home/jenkins/workspace/Lucene-Solr-SOLR-13661-Linux/lucene/common-build.xml:1019: At least one slave process threw an exception, first: Forked process returned with error code: 134. Very likely a JVM crash.  See process stdout at: /home/jenkins/workspace/Lucene-Solr-SOLR-13661-Linux/lucene/build/backward-codecs/test/temp/junit4-J1-20191009_012347_2281375661738911692401.sysout See process stderr at: /home/jenkins/workspace/Lucene-Solr-SOLR-13661-Linux/lucene/build/backward-codecs/test/temp/junit4-J1-20191009_012347_2284372992480905578107.syserr

Total time: 19 minutes 27 seconds
Build step 'Invoke Ant' marked build as failure
Archiving artifacts
Setting ANT_1_8_2_HOME=/home/jenkins/tools/hudson.tasks.Ant_AntInstallation/ANT_1.8.2
[WARNINGS] Skipping publisher since build result is FAILURE
Recording test results
Setting ANT_1_8_2_HOME=/home/jenkins/tools/hudson.tasks.Ant_AntInstallation/ANT_1.8.2
Email was triggered for: Failure - Any
Sending email for trigger: Failure - Any
Setting ANT_1_8_2_HOME=/home/jenkins/tools/hudson.tasks.Ant_AntInstallation/ANT_1.8.2
Setting ANT_1_8_2_HOME=/home/jenkins/tools/hudson.tasks.Ant_AntInstallation/ANT_1.8.2
Setting ANT_1_8_2_HOME=/home/jenkins/tools/hudson.tasks.Ant_AntInstallation/ANT_1.8.2
Setting ANT_1_8_2_HOME=/home/jenkins/tools/hudson.tasks.Ant_AntInstallation/ANT_1.8.2
Setting ANT_1_8_2_HOME=/home/jenkins/tools/hudson.tasks.Ant_AntInstallation/ANT_1.8.2
Setting ANT_1_8_2_HOME=/home/jenkins/tools/hudson.tasks.Ant_AntInstallation/ANT_1.8.2

[JENKINS-EA] Lucene-Solr-SOLR-13661-Linux (64bit/jdk-14-ea+14) - Build # 5 - Still Unstable!

Posted by Policeman Jenkins Server <je...@thetaphi.de>.
Build: https://jenkins.thetaphi.de/job/Lucene-Solr-SOLR-13661-Linux/5/
Java: 64bit/jdk-14-ea+14 -XX:+UseCompressedOops -XX:+UseConcMarkSweepGC

6 tests failed.
FAILED:  org.apache.solr.handler.TestPackages.testPluginFrompackage

Error Message:
req: org.apache.solr.handler.TestPackages$$Lambda$543/0x0000000800fa8c40@1ea08ee0 . attempt: 9 Mismatch for value : '[config, queryResponseWriter, json1, _packageinfo_, file, id]' in response , {   "responseHeader":{     "status":0,     "QTime":0},   "config":{"queryResponseWriter":{"json1":{         "name":"json1",         "class":"org.apache.solr.core.RuntimeLibResponseWriter",         "package":"global"}}}}

Stack Trace:
java.lang.AssertionError: req: org.apache.solr.handler.TestPackages$$Lambda$543/0x0000000800fa8c40@1ea08ee0 . attempt: 9 Mismatch for value : '[config, queryResponseWriter, json1, _packageinfo_, file, id]' in response , {
  "responseHeader":{
    "status":0,
    "QTime":0},
  "config":{"queryResponseWriter":{"json1":{
        "name":"json1",
        "class":"org.apache.solr.core.RuntimeLibResponseWriter",
        "package":"global"}}}}
	at __randomizedtesting.SeedInfo.seed([5DF91F058ABC2679:88A3F8711D136487]:0)
	at org.junit.Assert.fail(Assert.java:88)
	at org.apache.solr.handler.TestPackages.assertResponseValues(TestPackages.java:130)
	at org.apache.solr.handler.TestPackages.assertResponseValues(TestPackages.java:101)
	at org.apache.solr.handler.TestPackages.testPluginFrompackage(TestPackages.java:489)
	at java.base/jdk.internal.reflect.NativeMethodAccessorImpl.invoke0(Native Method)
	at java.base/jdk.internal.reflect.NativeMethodAccessorImpl.invoke(NativeMethodAccessorImpl.java:62)
	at java.base/jdk.internal.reflect.DelegatingMethodAccessorImpl.invoke(DelegatingMethodAccessorImpl.java:43)
	at java.base/java.lang.reflect.Method.invoke(Method.java:564)
	at com.carrotsearch.randomizedtesting.RandomizedRunner.invoke(RandomizedRunner.java:1750)
	at com.carrotsearch.randomizedtesting.RandomizedRunner$8.evaluate(RandomizedRunner.java:938)
	at com.carrotsearch.randomizedtesting.RandomizedRunner$9.evaluate(RandomizedRunner.java:974)
	at com.carrotsearch.randomizedtesting.RandomizedRunner$10.evaluate(RandomizedRunner.java:988)
	at com.carrotsearch.randomizedtesting.rules.SystemPropertiesRestoreRule$1.evaluate(SystemPropertiesRestoreRule.java:57)
	at org.apache.lucene.util.TestRuleSetupTeardownChained$1.evaluate(TestRuleSetupTeardownChained.java:49)
	at org.apache.lucene.util.AbstractBeforeAfterRule$1.evaluate(AbstractBeforeAfterRule.java:45)
	at org.apache.lucene.util.TestRuleThreadAndTestName$1.evaluate(TestRuleThreadAndTestName.java:48)
	at org.apache.lucene.util.TestRuleIgnoreAfterMaxFailures$1.evaluate(TestRuleIgnoreAfterMaxFailures.java:64)
	at org.apache.lucene.util.TestRuleMarkFailure$1.evaluate(TestRuleMarkFailure.java:47)
	at com.carrotsearch.randomizedtesting.rules.StatementAdapter.evaluate(StatementAdapter.java:36)
	at com.carrotsearch.randomizedtesting.ThreadLeakControl$StatementRunner.run(ThreadLeakControl.java:368)
	at com.carrotsearch.randomizedtesting.ThreadLeakControl.forkTimeoutingTask(ThreadLeakControl.java:817)
	at com.carrotsearch.randomizedtesting.ThreadLeakControl$3.evaluate(ThreadLeakControl.java:468)
	at com.carrotsearch.randomizedtesting.RandomizedRunner.runSingleTest(RandomizedRunner.java:947)
	at com.carrotsearch.randomizedtesting.RandomizedRunner$5.evaluate(RandomizedRunner.java:832)
	at com.carrotsearch.randomizedtesting.RandomizedRunner$6.evaluate(RandomizedRunner.java:883)
	at com.carrotsearch.randomizedtesting.RandomizedRunner$7.evaluate(RandomizedRunner.java:894)
	at com.carrotsearch.randomizedtesting.rules.StatementAdapter.evaluate(StatementAdapter.java:36)
	at com.carrotsearch.randomizedtesting.rules.SystemPropertiesRestoreRule$1.evaluate(SystemPropertiesRestoreRule.java:57)
	at org.apache.lucene.util.AbstractBeforeAfterRule$1.evaluate(AbstractBeforeAfterRule.java:45)
	at com.carrotsearch.randomizedtesting.rules.StatementAdapter.evaluate(StatementAdapter.java:36)
	at org.apache.lucene.util.TestRuleStoreClassName$1.evaluate(TestRuleStoreClassName.java:41)
	at com.carrotsearch.randomizedtesting.rules.NoShadowingOrOverridesOnMethodsRule$1.evaluate(NoShadowingOrOverridesOnMethodsRule.java:40)
	at com.carrotsearch.randomizedtesting.rules.NoShadowingOrOverridesOnMethodsRule$1.evaluate(NoShadowingOrOverridesOnMethodsRule.java:40)
	at com.carrotsearch.randomizedtesting.rules.StatementAdapter.evaluate(StatementAdapter.java:36)
	at com.carrotsearch.randomizedtesting.rules.StatementAdapter.evaluate(StatementAdapter.java:36)
	at org.apache.lucene.util.TestRuleAssertionsRequired$1.evaluate(TestRuleAssertionsRequired.java:53)
	at org.apache.lucene.util.TestRuleMarkFailure$1.evaluate(TestRuleMarkFailure.java:47)
	at org.apache.lucene.util.TestRuleIgnoreAfterMaxFailures$1.evaluate(TestRuleIgnoreAfterMaxFailures.java:64)
	at org.apache.lucene.util.TestRuleIgnoreTestSuites$1.evaluate(TestRuleIgnoreTestSuites.java:54)
	at com.carrotsearch.randomizedtesting.rules.StatementAdapter.evaluate(StatementAdapter.java:36)
	at com.carrotsearch.randomizedtesting.ThreadLeakControl$StatementRunner.run(ThreadLeakControl.java:368)
	at java.base/java.lang.Thread.run(Thread.java:830)


FAILED:  org.apache.solr.handler.TestPackages.testPluginFrompackage

Error Message:
req: org.apache.solr.handler.TestPackages$$Lambda$558/0x0000000800fa1c40@21a940ab . attempt: 9 Mismatch for value : '[config, queryResponseWriter, json1, _packageinfo_, file, id]' in response , {   "responseHeader":{     "status":0,     "QTime":0},   "config":{"queryResponseWriter":{"json1":{         "name":"json1",         "class":"org.apache.solr.core.RuntimeLibResponseWriter",         "package":"global"}}}}

Stack Trace:
java.lang.AssertionError: req: org.apache.solr.handler.TestPackages$$Lambda$558/0x0000000800fa1c40@21a940ab . attempt: 9 Mismatch for value : '[config, queryResponseWriter, json1, _packageinfo_, file, id]' in response , {
  "responseHeader":{
    "status":0,
    "QTime":0},
  "config":{"queryResponseWriter":{"json1":{
        "name":"json1",
        "class":"org.apache.solr.core.RuntimeLibResponseWriter",
        "package":"global"}}}}
	at __randomizedtesting.SeedInfo.seed([5DF91F058ABC2679:88A3F8711D136487]:0)
	at org.junit.Assert.fail(Assert.java:88)
	at org.apache.solr.handler.TestPackages.assertResponseValues(TestPackages.java:130)
	at org.apache.solr.handler.TestPackages.assertResponseValues(TestPackages.java:101)
	at org.apache.solr.handler.TestPackages.testPluginFrompackage(TestPackages.java:489)
	at java.base/jdk.internal.reflect.NativeMethodAccessorImpl.invoke0(Native Method)
	at java.base/jdk.internal.reflect.NativeMethodAccessorImpl.invoke(NativeMethodAccessorImpl.java:62)
	at java.base/jdk.internal.reflect.DelegatingMethodAccessorImpl.invoke(DelegatingMethodAccessorImpl.java:43)
	at java.base/java.lang.reflect.Method.invoke(Method.java:564)
	at com.carrotsearch.randomizedtesting.RandomizedRunner.invoke(RandomizedRunner.java:1750)
	at com.carrotsearch.randomizedtesting.RandomizedRunner$8.evaluate(RandomizedRunner.java:938)
	at com.carrotsearch.randomizedtesting.RandomizedRunner$9.evaluate(RandomizedRunner.java:974)
	at com.carrotsearch.randomizedtesting.RandomizedRunner$10.evaluate(RandomizedRunner.java:988)
	at com.carrotsearch.randomizedtesting.rules.SystemPropertiesRestoreRule$1.evaluate(SystemPropertiesRestoreRule.java:57)
	at org.apache.lucene.util.TestRuleSetupTeardownChained$1.evaluate(TestRuleSetupTeardownChained.java:49)
	at org.apache.lucene.util.AbstractBeforeAfterRule$1.evaluate(AbstractBeforeAfterRule.java:45)
	at org.apache.lucene.util.TestRuleThreadAndTestName$1.evaluate(TestRuleThreadAndTestName.java:48)
	at org.apache.lucene.util.TestRuleIgnoreAfterMaxFailures$1.evaluate(TestRuleIgnoreAfterMaxFailures.java:64)
	at org.apache.lucene.util.TestRuleMarkFailure$1.evaluate(TestRuleMarkFailure.java:47)
	at com.carrotsearch.randomizedtesting.rules.StatementAdapter.evaluate(StatementAdapter.java:36)
	at com.carrotsearch.randomizedtesting.ThreadLeakControl$StatementRunner.run(ThreadLeakControl.java:368)
	at com.carrotsearch.randomizedtesting.ThreadLeakControl.forkTimeoutingTask(ThreadLeakControl.java:817)
	at com.carrotsearch.randomizedtesting.ThreadLeakControl$3.evaluate(ThreadLeakControl.java:468)
	at com.carrotsearch.randomizedtesting.RandomizedRunner.runSingleTest(RandomizedRunner.java:947)
	at com.carrotsearch.randomizedtesting.RandomizedRunner$5.evaluate(RandomizedRunner.java:832)
	at com.carrotsearch.randomizedtesting.RandomizedRunner$6.evaluate(RandomizedRunner.java:883)
	at com.carrotsearch.randomizedtesting.RandomizedRunner$7.evaluate(RandomizedRunner.java:894)
	at com.carrotsearch.randomizedtesting.rules.StatementAdapter.evaluate(StatementAdapter.java:36)
	at com.carrotsearch.randomizedtesting.rules.SystemPropertiesRestoreRule$1.evaluate(SystemPropertiesRestoreRule.java:57)
	at org.apache.lucene.util.AbstractBeforeAfterRule$1.evaluate(AbstractBeforeAfterRule.java:45)
	at com.carrotsearch.randomizedtesting.rules.StatementAdapter.evaluate(StatementAdapter.java:36)
	at org.apache.lucene.util.TestRuleStoreClassName$1.evaluate(TestRuleStoreClassName.java:41)
	at com.carrotsearch.randomizedtesting.rules.NoShadowingOrOverridesOnMethodsRule$1.evaluate(NoShadowingOrOverridesOnMethodsRule.java:40)
	at com.carrotsearch.randomizedtesting.rules.NoShadowingOrOverridesOnMethodsRule$1.evaluate(NoShadowingOrOverridesOnMethodsRule.java:40)
	at com.carrotsearch.randomizedtesting.rules.StatementAdapter.evaluate(StatementAdapter.java:36)
	at com.carrotsearch.randomizedtesting.rules.StatementAdapter.evaluate(StatementAdapter.java:36)
	at org.apache.lucene.util.TestRuleAssertionsRequired$1.evaluate(TestRuleAssertionsRequired.java:53)
	at org.apache.lucene.util.TestRuleMarkFailure$1.evaluate(TestRuleMarkFailure.java:47)
	at org.apache.lucene.util.TestRuleIgnoreAfterMaxFailures$1.evaluate(TestRuleIgnoreAfterMaxFailures.java:64)
	at org.apache.lucene.util.TestRuleIgnoreTestSuites$1.evaluate(TestRuleIgnoreTestSuites.java:54)
	at com.carrotsearch.randomizedtesting.rules.StatementAdapter.evaluate(StatementAdapter.java:36)
	at com.carrotsearch.randomizedtesting.ThreadLeakControl$StatementRunner.run(ThreadLeakControl.java:368)
	at java.base/java.lang.Thread.run(Thread.java:830)


FAILED:  org.apache.solr.handler.TestPackages.testPluginFrompackage

Error Message:
req: org.apache.solr.handler.TestPackages$$Lambda$543/0x0000000800fa8c40@28715206 . attempt: 9 Mismatch for value : '[config, queryResponseWriter, json1, _packageinfo_, file, id]' in response , {   "responseHeader":{     "status":0,     "QTime":0},   "config":{"queryResponseWriter":{"json1":{         "name":"json1",         "class":"org.apache.solr.core.RuntimeLibResponseWriter",         "package":"global"}}}}

Stack Trace:
java.lang.AssertionError: req: org.apache.solr.handler.TestPackages$$Lambda$543/0x0000000800fa8c40@28715206 . attempt: 9 Mismatch for value : '[config, queryResponseWriter, json1, _packageinfo_, file, id]' in response , {
  "responseHeader":{
    "status":0,
    "QTime":0},
  "config":{"queryResponseWriter":{"json1":{
        "name":"json1",
        "class":"org.apache.solr.core.RuntimeLibResponseWriter",
        "package":"global"}}}}
	at __randomizedtesting.SeedInfo.seed([5DF91F058ABC2679:88A3F8711D136487]:0)
	at org.junit.Assert.fail(Assert.java:88)
	at org.apache.solr.handler.TestPackages.assertResponseValues(TestPackages.java:130)
	at org.apache.solr.handler.TestPackages.assertResponseValues(TestPackages.java:101)
	at org.apache.solr.handler.TestPackages.testPluginFrompackage(TestPackages.java:489)
	at java.base/jdk.internal.reflect.NativeMethodAccessorImpl.invoke0(Native Method)
	at java.base/jdk.internal.reflect.NativeMethodAccessorImpl.invoke(NativeMethodAccessorImpl.java:62)
	at java.base/jdk.internal.reflect.DelegatingMethodAccessorImpl.invoke(DelegatingMethodAccessorImpl.java:43)
	at java.base/java.lang.reflect.Method.invoke(Method.java:564)
	at com.carrotsearch.randomizedtesting.RandomizedRunner.invoke(RandomizedRunner.java:1750)
	at com.carrotsearch.randomizedtesting.RandomizedRunner$8.evaluate(RandomizedRunner.java:938)
	at com.carrotsearch.randomizedtesting.RandomizedRunner$9.evaluate(RandomizedRunner.java:974)
	at com.carrotsearch.randomizedtesting.RandomizedRunner$10.evaluate(RandomizedRunner.java:988)
	at com.carrotsearch.randomizedtesting.rules.SystemPropertiesRestoreRule$1.evaluate(SystemPropertiesRestoreRule.java:57)
	at org.apache.lucene.util.TestRuleSetupTeardownChained$1.evaluate(TestRuleSetupTeardownChained.java:49)
	at org.apache.lucene.util.AbstractBeforeAfterRule$1.evaluate(AbstractBeforeAfterRule.java:45)
	at org.apache.lucene.util.TestRuleThreadAndTestName$1.evaluate(TestRuleThreadAndTestName.java:48)
	at org.apache.lucene.util.TestRuleIgnoreAfterMaxFailures$1.evaluate(TestRuleIgnoreAfterMaxFailures.java:64)
	at org.apache.lucene.util.TestRuleMarkFailure$1.evaluate(TestRuleMarkFailure.java:47)
	at com.carrotsearch.randomizedtesting.rules.StatementAdapter.evaluate(StatementAdapter.java:36)
	at com.carrotsearch.randomizedtesting.ThreadLeakControl$StatementRunner.run(ThreadLeakControl.java:368)
	at com.carrotsearch.randomizedtesting.ThreadLeakControl.forkTimeoutingTask(ThreadLeakControl.java:817)
	at com.carrotsearch.randomizedtesting.ThreadLeakControl$3.evaluate(ThreadLeakControl.java:468)
	at com.carrotsearch.randomizedtesting.RandomizedRunner.runSingleTest(RandomizedRunner.java:947)
	at com.carrotsearch.randomizedtesting.RandomizedRunner$5.evaluate(RandomizedRunner.java:832)
	at com.carrotsearch.randomizedtesting.RandomizedRunner$6.evaluate(RandomizedRunner.java:883)
	at com.carrotsearch.randomizedtesting.RandomizedRunner$7.evaluate(RandomizedRunner.java:894)
	at com.carrotsearch.randomizedtesting.rules.StatementAdapter.evaluate(StatementAdapter.java:36)
	at com.carrotsearch.randomizedtesting.rules.SystemPropertiesRestoreRule$1.evaluate(SystemPropertiesRestoreRule.java:57)
	at org.apache.lucene.util.AbstractBeforeAfterRule$1.evaluate(AbstractBeforeAfterRule.java:45)
	at com.carrotsearch.randomizedtesting.rules.StatementAdapter.evaluate(StatementAdapter.java:36)
	at org.apache.lucene.util.TestRuleStoreClassName$1.evaluate(TestRuleStoreClassName.java:41)
	at com.carrotsearch.randomizedtesting.rules.NoShadowingOrOverridesOnMethodsRule$1.evaluate(NoShadowingOrOverridesOnMethodsRule.java:40)
	at com.carrotsearch.randomizedtesting.rules.NoShadowingOrOverridesOnMethodsRule$1.evaluate(NoShadowingOrOverridesOnMethodsRule.java:40)
	at com.carrotsearch.randomizedtesting.rules.StatementAdapter.evaluate(StatementAdapter.java:36)
	at com.carrotsearch.randomizedtesting.rules.StatementAdapter.evaluate(StatementAdapter.java:36)
	at org.apache.lucene.util.TestRuleAssertionsRequired$1.evaluate(TestRuleAssertionsRequired.java:53)
	at org.apache.lucene.util.TestRuleMarkFailure$1.evaluate(TestRuleMarkFailure.java:47)
	at org.apache.lucene.util.TestRuleIgnoreAfterMaxFailures$1.evaluate(TestRuleIgnoreAfterMaxFailures.java:64)
	at org.apache.lucene.util.TestRuleIgnoreTestSuites$1.evaluate(TestRuleIgnoreTestSuites.java:54)
	at com.carrotsearch.randomizedtesting.rules.StatementAdapter.evaluate(StatementAdapter.java:36)
	at com.carrotsearch.randomizedtesting.ThreadLeakControl$StatementRunner.run(ThreadLeakControl.java:368)
	at java.base/java.lang.Thread.run(Thread.java:830)


FAILED:  org.apache.solr.handler.TestPackages.testRuntimeLibWithSig2048

Error Message:


Stack Trace:
java.lang.AssertionError
	at __randomizedtesting.SeedInfo.seed([5DF91F058ABC2679:80943CAD2A08BC18]:0)
	at org.junit.Assert.fail(Assert.java:86)
	at org.junit.Assert.assertTrue(Assert.java:41)
	at org.junit.Assert.assertTrue(Assert.java:52)
	at org.apache.solr.handler.TestPackages.testRuntimeLibWithSig2048(TestPackages.java:322)
	at java.base/jdk.internal.reflect.NativeMethodAccessorImpl.invoke0(Native Method)
	at java.base/jdk.internal.reflect.NativeMethodAccessorImpl.invoke(NativeMethodAccessorImpl.java:62)
	at java.base/jdk.internal.reflect.DelegatingMethodAccessorImpl.invoke(DelegatingMethodAccessorImpl.java:43)
	at java.base/java.lang.reflect.Method.invoke(Method.java:564)
	at com.carrotsearch.randomizedtesting.RandomizedRunner.invoke(RandomizedRunner.java:1750)
	at com.carrotsearch.randomizedtesting.RandomizedRunner$8.evaluate(RandomizedRunner.java:938)
	at com.carrotsearch.randomizedtesting.RandomizedRunner$9.evaluate(RandomizedRunner.java:974)
	at com.carrotsearch.randomizedtesting.RandomizedRunner$10.evaluate(RandomizedRunner.java:988)
	at com.carrotsearch.randomizedtesting.rules.SystemPropertiesRestoreRule$1.evaluate(SystemPropertiesRestoreRule.java:57)
	at org.apache.lucene.util.TestRuleSetupTeardownChained$1.evaluate(TestRuleSetupTeardownChained.java:49)
	at org.apache.lucene.util.AbstractBeforeAfterRule$1.evaluate(AbstractBeforeAfterRule.java:45)
	at org.apache.lucene.util.TestRuleThreadAndTestName$1.evaluate(TestRuleThreadAndTestName.java:48)
	at org.apache.lucene.util.TestRuleIgnoreAfterMaxFailures$1.evaluate(TestRuleIgnoreAfterMaxFailures.java:64)
	at org.apache.lucene.util.TestRuleMarkFailure$1.evaluate(TestRuleMarkFailure.java:47)
	at com.carrotsearch.randomizedtesting.rules.StatementAdapter.evaluate(StatementAdapter.java:36)
	at com.carrotsearch.randomizedtesting.ThreadLeakControl$StatementRunner.run(ThreadLeakControl.java:368)
	at com.carrotsearch.randomizedtesting.ThreadLeakControl.forkTimeoutingTask(ThreadLeakControl.java:817)
	at com.carrotsearch.randomizedtesting.ThreadLeakControl$3.evaluate(ThreadLeakControl.java:468)
	at com.carrotsearch.randomizedtesting.RandomizedRunner.runSingleTest(RandomizedRunner.java:947)
	at com.carrotsearch.randomizedtesting.RandomizedRunner$5.evaluate(RandomizedRunner.java:832)
	at com.carrotsearch.randomizedtesting.RandomizedRunner$6.evaluate(RandomizedRunner.java:883)
	at com.carrotsearch.randomizedtesting.RandomizedRunner$7.evaluate(RandomizedRunner.java:894)
	at com.carrotsearch.randomizedtesting.rules.StatementAdapter.evaluate(StatementAdapter.java:36)
	at com.carrotsearch.randomizedtesting.rules.SystemPropertiesRestoreRule$1.evaluate(SystemPropertiesRestoreRule.java:57)
	at org.apache.lucene.util.AbstractBeforeAfterRule$1.evaluate(AbstractBeforeAfterRule.java:45)
	at com.carrotsearch.randomizedtesting.rules.StatementAdapter.evaluate(StatementAdapter.java:36)
	at org.apache.lucene.util.TestRuleStoreClassName$1.evaluate(TestRuleStoreClassName.java:41)
	at com.carrotsearch.randomizedtesting.rules.NoShadowingOrOverridesOnMethodsRule$1.evaluate(NoShadowingOrOverridesOnMethodsRule.java:40)
	at com.carrotsearch.randomizedtesting.rules.NoShadowingOrOverridesOnMethodsRule$1.evaluate(NoShadowingOrOverridesOnMethodsRule.java:40)
	at com.carrotsearch.randomizedtesting.rules.StatementAdapter.evaluate(StatementAdapter.java:36)
	at com.carrotsearch.randomizedtesting.rules.StatementAdapter.evaluate(StatementAdapter.java:36)
	at org.apache.lucene.util.TestRuleAssertionsRequired$1.evaluate(TestRuleAssertionsRequired.java:53)
	at org.apache.lucene.util.TestRuleMarkFailure$1.evaluate(TestRuleMarkFailure.java:47)
	at org.apache.lucene.util.TestRuleIgnoreAfterMaxFailures$1.evaluate(TestRuleIgnoreAfterMaxFailures.java:64)
	at org.apache.lucene.util.TestRuleIgnoreTestSuites$1.evaluate(TestRuleIgnoreTestSuites.java:54)
	at com.carrotsearch.randomizedtesting.rules.StatementAdapter.evaluate(StatementAdapter.java:36)
	at com.carrotsearch.randomizedtesting.ThreadLeakControl$StatementRunner.run(ThreadLeakControl.java:368)
	at java.base/java.lang.Thread.run(Thread.java:830)


FAILED:  org.apache.solr.handler.TestPackages.testPackageAPI

Error Message:
actual output : {   "responseHeader":{     "status":400,     "QTime":1},   "error":{     "metadata":{       "error-class":"org.apache.solr.api.ApiBag$ExceptionWithErrObject",       "root-error-class":"org.apache.solr.api.ApiBag$ExceptionWithErrObject"},     "details":[{         "add":{           "name":"global",           "version":"0.1",           "file":{             "id":"wrong-id",             "sig":"wrong-sig"}},         "errorMessages":["node not started with enable.package=true"]}],     "msg":"Error in executing commands",     "code":400}}

Stack Trace:
java.lang.AssertionError: actual output : {
  "responseHeader":{
    "status":400,
    "QTime":1},
  "error":{
    "metadata":{
      "error-class":"org.apache.solr.api.ApiBag$ExceptionWithErrObject",
      "root-error-class":"org.apache.solr.api.ApiBag$ExceptionWithErrObject"},
    "details":[{
        "add":{
          "name":"global",
          "version":"0.1",
          "file":{
            "id":"wrong-id",
            "sig":"wrong-sig"}},
        "errorMessages":["node not started with enable.package=true"]}],
    "msg":"Error in executing commands",
    "code":400}}
	at __randomizedtesting.SeedInfo.seed([5DF91F058ABC2679:2FF60A4B26E77C69]:0)
	at org.junit.Assert.fail(Assert.java:88)
	at org.junit.Assert.assertTrue(Assert.java:41)
	at org.apache.solr.handler.TestPackages.testPackageAPI(TestPackages.java:180)
	at java.base/jdk.internal.reflect.NativeMethodAccessorImpl.invoke0(Native Method)
	at java.base/jdk.internal.reflect.NativeMethodAccessorImpl.invoke(NativeMethodAccessorImpl.java:62)
	at java.base/jdk.internal.reflect.DelegatingMethodAccessorImpl.invoke(DelegatingMethodAccessorImpl.java:43)
	at java.base/java.lang.reflect.Method.invoke(Method.java:564)
	at com.carrotsearch.randomizedtesting.RandomizedRunner.invoke(RandomizedRunner.java:1750)
	at com.carrotsearch.randomizedtesting.RandomizedRunner$8.evaluate(RandomizedRunner.java:938)
	at com.carrotsearch.randomizedtesting.RandomizedRunner$9.evaluate(RandomizedRunner.java:974)
	at com.carrotsearch.randomizedtesting.RandomizedRunner$10.evaluate(RandomizedRunner.java:988)
	at com.carrotsearch.randomizedtesting.rules.SystemPropertiesRestoreRule$1.evaluate(SystemPropertiesRestoreRule.java:57)
	at org.apache.lucene.util.TestRuleSetupTeardownChained$1.evaluate(TestRuleSetupTeardownChained.java:49)
	at org.apache.lucene.util.AbstractBeforeAfterRule$1.evaluate(AbstractBeforeAfterRule.java:45)
	at org.apache.lucene.util.TestRuleThreadAndTestName$1.evaluate(TestRuleThreadAndTestName.java:48)
	at org.apache.lucene.util.TestRuleIgnoreAfterMaxFailures$1.evaluate(TestRuleIgnoreAfterMaxFailures.java:64)
	at org.apache.lucene.util.TestRuleMarkFailure$1.evaluate(TestRuleMarkFailure.java:47)
	at com.carrotsearch.randomizedtesting.rules.StatementAdapter.evaluate(StatementAdapter.java:36)
	at com.carrotsearch.randomizedtesting.ThreadLeakControl$StatementRunner.run(ThreadLeakControl.java:368)
	at com.carrotsearch.randomizedtesting.ThreadLeakControl.forkTimeoutingTask(ThreadLeakControl.java:817)
	at com.carrotsearch.randomizedtesting.ThreadLeakControl$3.evaluate(ThreadLeakControl.java:468)
	at com.carrotsearch.randomizedtesting.RandomizedRunner.runSingleTest(RandomizedRunner.java:947)
	at com.carrotsearch.randomizedtesting.RandomizedRunner$5.evaluate(RandomizedRunner.java:832)
	at com.carrotsearch.randomizedtesting.RandomizedRunner$6.evaluate(RandomizedRunner.java:883)
	at com.carrotsearch.randomizedtesting.RandomizedRunner$7.evaluate(RandomizedRunner.java:894)
	at com.carrotsearch.randomizedtesting.rules.StatementAdapter.evaluate(StatementAdapter.java:36)
	at com.carrotsearch.randomizedtesting.rules.SystemPropertiesRestoreRule$1.evaluate(SystemPropertiesRestoreRule.java:57)
	at org.apache.lucene.util.AbstractBeforeAfterRule$1.evaluate(AbstractBeforeAfterRule.java:45)
	at com.carrotsearch.randomizedtesting.rules.StatementAdapter.evaluate(StatementAdapter.java:36)
	at org.apache.lucene.util.TestRuleStoreClassName$1.evaluate(TestRuleStoreClassName.java:41)
	at com.carrotsearch.randomizedtesting.rules.NoShadowingOrOverridesOnMethodsRule$1.evaluate(NoShadowingOrOverridesOnMethodsRule.java:40)
	at com.carrotsearch.randomizedtesting.rules.NoShadowingOrOverridesOnMethodsRule$1.evaluate(NoShadowingOrOverridesOnMethodsRule.java:40)
	at com.carrotsearch.randomizedtesting.rules.StatementAdapter.evaluate(StatementAdapter.java:36)
	at com.carrotsearch.randomizedtesting.rules.StatementAdapter.evaluate(StatementAdapter.java:36)
	at org.apache.lucene.util.TestRuleAssertionsRequired$1.evaluate(TestRuleAssertionsRequired.java:53)
	at org.apache.lucene.util.TestRuleMarkFailure$1.evaluate(TestRuleMarkFailure.java:47)
	at org.apache.lucene.util.TestRuleIgnoreAfterMaxFailures$1.evaluate(TestRuleIgnoreAfterMaxFailures.java:64)
	at org.apache.lucene.util.TestRuleIgnoreTestSuites$1.evaluate(TestRuleIgnoreTestSuites.java:54)
	at com.carrotsearch.randomizedtesting.rules.StatementAdapter.evaluate(StatementAdapter.java:36)
	at com.carrotsearch.randomizedtesting.ThreadLeakControl$StatementRunner.run(ThreadLeakControl.java:368)
	at java.base/java.lang.Thread.run(Thread.java:830)


FAILED:  org.apache.solr.handler.TestPackages.testPluginFrompackage

Error Message:
Error from server at http://127.0.0.1:42991/solr: Error in executing commands

Stack Trace:
org.apache.solr.client.solrj.impl.HttpSolrClient$RemoteExecutionException: Error from server at http://127.0.0.1:42991/solr: Error in executing commands
	at __randomizedtesting.SeedInfo.seed([5DF91F058ABC2679:88A3F8711D136487]:0)
	at org.apache.solr.client.solrj.impl.BaseHttpSolrClient$RemoteExecutionException.create(BaseHttpSolrClient.java:66)
	at org.apache.solr.client.solrj.impl.HttpSolrClient.executeMethod(HttpSolrClient.java:642)
	at org.apache.solr.client.solrj.impl.HttpSolrClient.request(HttpSolrClient.java:265)
	at org.apache.solr.client.solrj.impl.HttpSolrClient.request(HttpSolrClient.java:248)
	at org.apache.solr.client.solrj.impl.LBSolrClient.doRequest(LBSolrClient.java:368)
	at org.apache.solr.client.solrj.impl.LBSolrClient.request(LBSolrClient.java:296)
	at org.apache.solr.client.solrj.impl.BaseCloudSolrClient.sendRequest(BaseCloudSolrClient.java:1128)
	at org.apache.solr.client.solrj.impl.BaseCloudSolrClient.requestWithRetryOnStaleState(BaseCloudSolrClient.java:897)
	at org.apache.solr.client.solrj.impl.BaseCloudSolrClient.request(BaseCloudSolrClient.java:829)
	at org.apache.solr.client.solrj.SolrRequest.process(SolrRequest.java:207)
	at org.apache.solr.client.solrj.SolrRequest.process(SolrRequest.java:224)
	at org.apache.solr.handler.TestPackages.testPluginFrompackage(TestPackages.java:462)
	at java.base/jdk.internal.reflect.NativeMethodAccessorImpl.invoke0(Native Method)
	at java.base/jdk.internal.reflect.NativeMethodAccessorImpl.invoke(NativeMethodAccessorImpl.java:62)
	at java.base/jdk.internal.reflect.DelegatingMethodAccessorImpl.invoke(DelegatingMethodAccessorImpl.java:43)
	at java.base/java.lang.reflect.Method.invoke(Method.java:564)
	at com.carrotsearch.randomizedtesting.RandomizedRunner.invoke(RandomizedRunner.java:1750)
	at com.carrotsearch.randomizedtesting.RandomizedRunner$8.evaluate(RandomizedRunner.java:938)
	at com.carrotsearch.randomizedtesting.RandomizedRunner$9.evaluate(RandomizedRunner.java:974)
	at com.carrotsearch.randomizedtesting.RandomizedRunner$10.evaluate(RandomizedRunner.java:988)
	at com.carrotsearch.randomizedtesting.rules.SystemPropertiesRestoreRule$1.evaluate(SystemPropertiesRestoreRule.java:57)
	at org.apache.lucene.util.TestRuleSetupTeardownChained$1.evaluate(TestRuleSetupTeardownChained.java:49)
	at org.apache.lucene.util.AbstractBeforeAfterRule$1.evaluate(AbstractBeforeAfterRule.java:45)
	at org.apache.lucene.util.TestRuleThreadAndTestName$1.evaluate(TestRuleThreadAndTestName.java:48)
	at org.apache.lucene.util.TestRuleIgnoreAfterMaxFailures$1.evaluate(TestRuleIgnoreAfterMaxFailures.java:64)
	at org.apache.lucene.util.TestRuleMarkFailure$1.evaluate(TestRuleMarkFailure.java:47)
	at com.carrotsearch.randomizedtesting.rules.StatementAdapter.evaluate(StatementAdapter.java:36)
	at com.carrotsearch.randomizedtesting.ThreadLeakControl$StatementRunner.run(ThreadLeakControl.java:368)
	at com.carrotsearch.randomizedtesting.ThreadLeakControl.forkTimeoutingTask(ThreadLeakControl.java:817)
	at com.carrotsearch.randomizedtesting.ThreadLeakControl$3.evaluate(ThreadLeakControl.java:468)
	at com.carrotsearch.randomizedtesting.RandomizedRunner.runSingleTest(RandomizedRunner.java:947)
	at com.carrotsearch.randomizedtesting.RandomizedRunner$5.evaluate(RandomizedRunner.java:832)
	at com.carrotsearch.randomizedtesting.RandomizedRunner$6.evaluate(RandomizedRunner.java:883)
	at com.carrotsearch.randomizedtesting.RandomizedRunner$7.evaluate(RandomizedRunner.java:894)
	at com.carrotsearch.randomizedtesting.rules.StatementAdapter.evaluate(StatementAdapter.java:36)
	at com.carrotsearch.randomizedtesting.rules.SystemPropertiesRestoreRule$1.evaluate(SystemPropertiesRestoreRule.java:57)
	at org.apache.lucene.util.AbstractBeforeAfterRule$1.evaluate(AbstractBeforeAfterRule.java:45)
	at com.carrotsearch.randomizedtesting.rules.StatementAdapter.evaluate(StatementAdapter.java:36)
	at org.apache.lucene.util.TestRuleStoreClassName$1.evaluate(TestRuleStoreClassName.java:41)
	at com.carrotsearch.randomizedtesting.rules.NoShadowingOrOverridesOnMethodsRule$1.evaluate(NoShadowingOrOverridesOnMethodsRule.java:40)
	at com.carrotsearch.randomizedtesting.rules.NoShadowingOrOverridesOnMethodsRule$1.evaluate(NoShadowingOrOverridesOnMethodsRule.java:40)
	at com.carrotsearch.randomizedtesting.rules.StatementAdapter.evaluate(StatementAdapter.java:36)
	at com.carrotsearch.randomizedtesting.rules.StatementAdapter.evaluate(StatementAdapter.java:36)
	at org.apache.lucene.util.TestRuleAssertionsRequired$1.evaluate(TestRuleAssertionsRequired.java:53)
	at org.apache.lucene.util.TestRuleMarkFailure$1.evaluate(TestRuleMarkFailure.java:47)
	at org.apache.lucene.util.TestRuleIgnoreAfterMaxFailures$1.evaluate(TestRuleIgnoreAfterMaxFailures.java:64)
	at org.apache.lucene.util.TestRuleIgnoreTestSuites$1.evaluate(TestRuleIgnoreTestSuites.java:54)
	at com.carrotsearch.randomizedtesting.rules.StatementAdapter.evaluate(StatementAdapter.java:36)
	at com.carrotsearch.randomizedtesting.ThreadLeakControl$StatementRunner.run(ThreadLeakControl.java:368)
	at java.base/java.lang.Thread.run(Thread.java:830)




Build Log:
[...truncated 2087 lines...]
   [junit4] JVM J2: stderr was not empty, see: /home/jenkins/workspace/Lucene-Solr-SOLR-13661-Linux/lucene/build/core/test/temp/junit4-J2-20191008_190138_94617398042646405597040.syserr
   [junit4] >>> JVM J2 emitted unexpected output (verbatim) ----
   [junit4] OpenJDK 64-Bit Server VM warning: Option UseConcMarkSweepGC was deprecated in version 9.0 and will likely be removed in a future release.
   [junit4] <<< JVM J2: EOF ----

[...truncated 3 lines...]
   [junit4] JVM J0: stderr was not empty, see: /home/jenkins/workspace/Lucene-Solr-SOLR-13661-Linux/lucene/build/core/test/temp/junit4-J0-20191008_190138_9466372522641464157327.syserr
   [junit4] >>> JVM J0 emitted unexpected output (verbatim) ----
   [junit4] OpenJDK 64-Bit Server VM warning: Option UseConcMarkSweepGC was deprecated in version 9.0 and will likely be removed in a future release.
   [junit4] <<< JVM J0: EOF ----

[...truncated 5 lines...]
   [junit4] JVM J1: stderr was not empty, see: /home/jenkins/workspace/Lucene-Solr-SOLR-13661-Linux/lucene/build/core/test/temp/junit4-J1-20191008_190138_94613497802454195743506.syserr
   [junit4] >>> JVM J1 emitted unexpected output (verbatim) ----
   [junit4] OpenJDK 64-Bit Server VM warning: Option UseConcMarkSweepGC was deprecated in version 9.0 and will likely be removed in a future release.
   [junit4] <<< JVM J1: EOF ----

[...truncated 304 lines...]
   [junit4] JVM J0: stderr was not empty, see: /home/jenkins/workspace/Lucene-Solr-SOLR-13661-Linux/lucene/build/test-framework/test/temp/junit4-J0-20191008_191254_54615610415784283588786.syserr
   [junit4] >>> JVM J0 emitted unexpected output (verbatim) ----
   [junit4] OpenJDK 64-Bit Server VM warning: Option UseConcMarkSweepGC was deprecated in version 9.0 and will likely be removed in a future release.
   [junit4] <<< JVM J0: EOF ----

   [junit4] JVM J1: stderr was not empty, see: /home/jenkins/workspace/Lucene-Solr-SOLR-13661-Linux/lucene/build/test-framework/test/temp/junit4-J1-20191008_191254_54616155465304459725915.syserr
   [junit4] >>> JVM J1 emitted unexpected output (verbatim) ----
   [junit4] OpenJDK 64-Bit Server VM warning: Option UseConcMarkSweepGC was deprecated in version 9.0 and will likely be removed in a future release.
   [junit4] <<< JVM J1: EOF ----

[...truncated 3 lines...]
   [junit4] JVM J2: stderr was not empty, see: /home/jenkins/workspace/Lucene-Solr-SOLR-13661-Linux/lucene/build/test-framework/test/temp/junit4-J2-20191008_191254_5463611319295838096777.syserr
   [junit4] >>> JVM J2 emitted unexpected output (verbatim) ----
   [junit4] OpenJDK 64-Bit Server VM warning: Option UseConcMarkSweepGC was deprecated in version 9.0 and will likely be removed in a future release.
   [junit4] <<< JVM J2: EOF ----

[...truncated 1091 lines...]
   [junit4] JVM J1: stderr was not empty, see: /home/jenkins/workspace/Lucene-Solr-SOLR-13661-Linux/lucene/build/analysis/common/test/temp/junit4-J1-20191008_191427_77010845076539958236514.syserr
   [junit4] >>> JVM J1 emitted unexpected output (verbatim) ----
   [junit4] OpenJDK 64-Bit Server VM warning: Option UseConcMarkSweepGC was deprecated in version 9.0 and will likely be removed in a future release.
   [junit4] <<< JVM J1: EOF ----

   [junit4] JVM J2: stderr was not empty, see: /home/jenkins/workspace/Lucene-Solr-SOLR-13661-Linux/lucene/build/analysis/common/test/temp/junit4-J2-20191008_191427_7707916014049125360468.syserr
   [junit4] >>> JVM J2 emitted unexpected output (verbatim) ----
   [junit4] OpenJDK 64-Bit Server VM warning: Option UseConcMarkSweepGC was deprecated in version 9.0 and will likely be removed in a future release.
   [junit4] <<< JVM J2: EOF ----

[...truncated 3 lines...]
   [junit4] JVM J0: stderr was not empty, see: /home/jenkins/workspace/Lucene-Solr-SOLR-13661-Linux/lucene/build/analysis/common/test/temp/junit4-J0-20191008_191427_77017859460465409939106.syserr
   [junit4] >>> JVM J0 emitted unexpected output (verbatim) ----
   [junit4] OpenJDK 64-Bit Server VM warning: Option UseConcMarkSweepGC was deprecated in version 9.0 and will likely be removed in a future release.
   [junit4] <<< JVM J0: EOF ----

[...truncated 241 lines...]
   [junit4] JVM J1: stderr was not empty, see: /home/jenkins/workspace/Lucene-Solr-SOLR-13661-Linux/lucene/build/analysis/icu/test/temp/junit4-J1-20191008_191632_1211135313741505869340.syserr
   [junit4] >>> JVM J1 emitted unexpected output (verbatim) ----
   [junit4] OpenJDK 64-Bit Server VM warning: Option UseConcMarkSweepGC was deprecated in version 9.0 and will likely be removed in a future release.
   [junit4] <<< JVM J1: EOF ----

[...truncated 6 lines...]
   [junit4] JVM J0: stderr was not empty, see: /home/jenkins/workspace/Lucene-Solr-SOLR-13661-Linux/lucene/build/analysis/icu/test/temp/junit4-J0-20191008_191632_12112114904968568329177.syserr
   [junit4] >>> JVM J0 emitted unexpected output (verbatim) ----
   [junit4] OpenJDK 64-Bit Server VM warning: Option UseConcMarkSweepGC was deprecated in version 9.0 and will likely be removed in a future release.
   [junit4] <<< JVM J0: EOF ----

   [junit4] JVM J2: stderr was not empty, see: /home/jenkins/workspace/Lucene-Solr-SOLR-13661-Linux/lucene/build/analysis/icu/test/temp/junit4-J2-20191008_191632_12115229932255614200538.syserr
   [junit4] >>> JVM J2 emitted unexpected output (verbatim) ----
   [junit4] OpenJDK 64-Bit Server VM warning: Option UseConcMarkSweepGC was deprecated in version 9.0 and will likely be removed in a future release.
   [junit4] <<< JVM J2: EOF ----

[...truncated 208 lines...]
   [junit4] JVM J1: stderr was not empty, see: /home/jenkins/workspace/Lucene-Solr-SOLR-13661-Linux/lucene/build/analysis/kuromoji/test/temp/junit4-J1-20191008_191641_6327534118862793699857.syserr
   [junit4] >>> JVM J1 emitted unexpected output (verbatim) ----
   [junit4] OpenJDK 64-Bit Server VM warning: Option UseConcMarkSweepGC was deprecated in version 9.0 and will likely be removed in a future release.
   [junit4] <<< JVM J1: EOF ----

[...truncated 3 lines...]
   [junit4] JVM J0: stderr was not empty, see: /home/jenkins/workspace/Lucene-Solr-SOLR-13661-Linux/lucene/build/analysis/kuromoji/test/temp/junit4-J0-20191008_191641_6329526351414105496967.syserr
   [junit4] >>> JVM J0 emitted unexpected output (verbatim) ----
   [junit4] OpenJDK 64-Bit Server VM warning: Option UseConcMarkSweepGC was deprecated in version 9.0 and will likely be removed in a future release.
   [junit4] <<< JVM J0: EOF ----

[...truncated 12 lines...]
   [junit4] JVM J2: stderr was not empty, see: /home/jenkins/workspace/Lucene-Solr-SOLR-13661-Linux/lucene/build/analysis/kuromoji/test/temp/junit4-J2-20191008_191641_6324551432932514392220.syserr
   [junit4] >>> JVM J2 emitted unexpected output (verbatim) ----
   [junit4] OpenJDK 64-Bit Server VM warning: Option UseConcMarkSweepGC was deprecated in version 9.0 and will likely be removed in a future release.
   [junit4] <<< JVM J2: EOF ----

[...truncated 154 lines...]
   [junit4] JVM J1: stderr was not empty, see: /home/jenkins/workspace/Lucene-Solr-SOLR-13661-Linux/lucene/build/analysis/morfologik/test/temp/junit4-J1-20191008_191700_66712737106004917253048.syserr
   [junit4] >>> JVM J1 emitted unexpected output (verbatim) ----
   [junit4] OpenJDK 64-Bit Server VM warning: Option UseConcMarkSweepGC was deprecated in version 9.0 and will likely be removed in a future release.
   [junit4] <<< JVM J1: EOF ----

[...truncated 3 lines...]
   [junit4] JVM J0: stderr was not empty, see: /home/jenkins/workspace/Lucene-Solr-SOLR-13661-Linux/lucene/build/analysis/morfologik/test/temp/junit4-J0-20191008_191700_66715698175032608850693.syserr
   [junit4] >>> JVM J0 emitted unexpected output (verbatim) ----
   [junit4] OpenJDK 64-Bit Server VM warning: Option UseConcMarkSweepGC was deprecated in version 9.0 and will likely be removed in a future release.
   [junit4] <<< JVM J0: EOF ----

[...truncated 3 lines...]
   [junit4] JVM J2: stderr was not empty, see: /home/jenkins/workspace/Lucene-Solr-SOLR-13661-Linux/lucene/build/analysis/morfologik/test/temp/junit4-J2-20191008_191700_66815548621912952974633.syserr
   [junit4] >>> JVM J2 emitted unexpected output (verbatim) ----
   [junit4] OpenJDK 64-Bit Server VM warning: Option UseConcMarkSweepGC was deprecated in version 9.0 and will likely be removed in a future release.
   [junit4] <<< JVM J2: EOF ----

[...truncated 180 lines...]
   [junit4] JVM J1: stderr was not empty, see: /home/jenkins/workspace/Lucene-Solr-SOLR-13661-Linux/lucene/build/analysis/nori/test/temp/junit4-J1-20191008_191705_28411731960784793631490.syserr
   [junit4] >>> JVM J1 emitted unexpected output (verbatim) ----
   [junit4] OpenJDK 64-Bit Server VM warning: Option UseConcMarkSweepGC was deprecated in version 9.0 and will likely be removed in a future release.
   [junit4] <<< JVM J1: EOF ----

[...truncated 3 lines...]
   [junit4] JVM J2: stderr was not empty, see: /home/jenkins/workspace/Lucene-Solr-SOLR-13661-Linux/lucene/build/analysis/nori/test/temp/junit4-J2-20191008_191705_28412129433003214182613.syserr
   [junit4] >>> JVM J2 emitted unexpected output (verbatim) ----
   [junit4] OpenJDK 64-Bit Server VM warning: Option UseConcMarkSweepGC was deprecated in version 9.0 and will likely be removed in a future release.
   [junit4] <<< JVM J2: EOF ----

[...truncated 3 lines...]
   [junit4] JVM J0: stderr was not empty, see: /home/jenkins/workspace/Lucene-Solr-SOLR-13661-Linux/lucene/build/analysis/nori/test/temp/junit4-J0-20191008_191705_28415388058668629346528.syserr
   [junit4] >>> JVM J0 emitted unexpected output (verbatim) ----
   [junit4] OpenJDK 64-Bit Server VM warning: Option UseConcMarkSweepGC was deprecated in version 9.0 and will likely be removed in a future release.
   [junit4] <<< JVM J0: EOF ----

[...truncated 160 lines...]
   [junit4] JVM J2: stderr was not empty, see: /home/jenkins/workspace/Lucene-Solr-SOLR-13661-Linux/lucene/build/analysis/opennlp/test/temp/junit4-J2-20191008_191718_6773282541622912699596.syserr
   [junit4] >>> JVM J2 emitted unexpected output (verbatim) ----
   [junit4] OpenJDK 64-Bit Server VM warning: Option UseConcMarkSweepGC was deprecated in version 9.0 and will likely be removed in a future release.
   [junit4] <<< JVM J2: EOF ----

[...truncated 6 lines...]
   [junit4] JVM J0: stderr was not empty, see: /home/jenkins/workspace/Lucene-Solr-SOLR-13661-Linux/lucene/build/analysis/opennlp/test/temp/junit4-J0-20191008_191718_6777179695787829927844.syserr
   [junit4] >>> JVM J0 emitted unexpected output (verbatim) ----
   [junit4] OpenJDK 64-Bit Server VM warning: Option UseConcMarkSweepGC was deprecated in version 9.0 and will likely be removed in a future release.
   [junit4] <<< JVM J0: EOF ----

   [junit4] JVM J1: stderr was not empty, see: /home/jenkins/workspace/Lucene-Solr-SOLR-13661-Linux/lucene/build/analysis/opennlp/test/temp/junit4-J1-20191008_191718_67716163387703577078065.syserr
   [junit4] >>> JVM J1 emitted unexpected output (verbatim) ----
   [junit4] OpenJDK 64-Bit Server VM warning: Option UseConcMarkSweepGC was deprecated in version 9.0 and will likely be removed in a future release.
   [junit4] <<< JVM J1: EOF ----

[...truncated 168 lines...]
   [junit4] JVM J2: stderr was not empty, see: /home/jenkins/workspace/Lucene-Solr-SOLR-13661-Linux/lucene/build/analysis/phonetic/test/temp/junit4-J2-20191008_191721_9145903917725331372435.syserr
   [junit4] >>> JVM J2 emitted unexpected output (verbatim) ----
   [junit4] OpenJDK 64-Bit Server VM warning: Option UseConcMarkSweepGC was deprecated in version 9.0 and will likely be removed in a future release.
   [junit4] <<< JVM J2: EOF ----

[...truncated 3 lines...]
   [junit4] JVM J1: stderr was not empty, see: /home/jenkins/workspace/Lucene-Solr-SOLR-13661-Linux/lucene/build/analysis/phonetic/test/temp/junit4-J1-20191008_191721_91413811780261166064309.syserr
   [junit4] >>> JVM J1 emitted unexpected output (verbatim) ----
   [junit4] OpenJDK 64-Bit Server VM warning: Option UseConcMarkSweepGC was deprecated in version 9.0 and will likely be removed in a future release.
   [junit4] <<< JVM J1: EOF ----

[...truncated 3 lines...]
   [junit4] JVM J0: stderr was not empty, see: /home/jenkins/workspace/Lucene-Solr-SOLR-13661-Linux/lucene/build/analysis/phonetic/test/temp/junit4-J0-20191008_191721_914555800690548734211.syserr
   [junit4] >>> JVM J0 emitted unexpected output (verbatim) ----
   [junit4] OpenJDK 64-Bit Server VM warning: Option UseConcMarkSweepGC was deprecated in version 9.0 and will likely be removed in a future release.
   [junit4] <<< JVM J0: EOF ----

[...truncated 153 lines...]
   [junit4] JVM J0: stderr was not empty, see: /home/jenkins/workspace/Lucene-Solr-SOLR-13661-Linux/lucene/build/analysis/smartcn/test/temp/junit4-J0-20191008_191732_8357276340145968539671.syserr
   [junit4] >>> JVM J0 emitted unexpected output (verbatim) ----
   [junit4] OpenJDK 64-Bit Server VM warning: Option UseConcMarkSweepGC was deprecated in version 9.0 and will likely be removed in a future release.
   [junit4] <<< JVM J0: EOF ----

[...truncated 3 lines...]
   [junit4] JVM J1: stderr was not empty, see: /home/jenkins/workspace/Lucene-Solr-SOLR-13661-Linux/lucene/build/analysis/smartcn/test/temp/junit4-J1-20191008_191732_83516926490978596358595.syserr
   [junit4] >>> JVM J1 emitted unexpected output (verbatim) ----
   [junit4] OpenJDK 64-Bit Server VM warning: Option UseConcMarkSweepGC was deprecated in version 9.0 and will likely be removed in a future release.
   [junit4] <<< JVM J1: EOF ----

[...truncated 157 lines...]
   [junit4] JVM J2: stderr was not empty, see: /home/jenkins/workspace/Lucene-Solr-SOLR-13661-Linux/lucene/build/analysis/stempel/test/temp/junit4-J2-20191008_191740_23414576376698813929886.syserr
   [junit4] >>> JVM J2 emitted unexpected output (verbatim) ----
   [junit4] OpenJDK 64-Bit Server VM warning: Option UseConcMarkSweepGC was deprecated in version 9.0 and will likely be removed in a future release.
   [junit4] <<< JVM J2: EOF ----

   [junit4] JVM J1: stderr was not empty, see: /home/jenkins/workspace/Lucene-Solr-SOLR-13661-Linux/lucene/build/analysis/stempel/test/temp/junit4-J1-20191008_191740_23015193692006946352238.syserr
   [junit4] >>> JVM J1 emitted unexpected output (verbatim) ----
   [junit4] OpenJDK 64-Bit Server VM warning: Option UseConcMarkSweepGC was deprecated in version 9.0 and will likely be removed in a future release.
   [junit4] <<< JVM J1: EOF ----

[...truncated 3 lines...]
   [junit4] JVM J0: stderr was not empty, see: /home/jenkins/workspace/Lucene-Solr-SOLR-13661-Linux/lucene/build/analysis/stempel/test/temp/junit4-J0-20191008_191740_23015312252241514068454.syserr
   [junit4] >>> JVM J0 emitted unexpected output (verbatim) ----
   [junit4] OpenJDK 64-Bit Server VM warning: Option UseConcMarkSweepGC was deprecated in version 9.0 and will likely be removed in a future release.
   [junit4] <<< JVM J0: EOF ----

[...truncated 178 lines...]
   [junit4] JVM J0: stderr was not empty, see: /home/jenkins/workspace/Lucene-Solr-SOLR-13661-Linux/lucene/build/backward-codecs/test/temp/junit4-J0-20191008_191743_86214001837994073854956.syserr
   [junit4] >>> JVM J0 emitted unexpected output (verbatim) ----
   [junit4] OpenJDK 64-Bit Server VM warning: Option UseConcMarkSweepGC was deprecated in version 9.0 and will likely be removed in a future release.
   [junit4] <<< JVM J0: EOF ----

[...truncated 9 lines...]
   [junit4] JVM J2: stderr was not empty, see: /home/jenkins/workspace/Lucene-Solr-SOLR-13661-Linux/lucene/build/backward-codecs/test/temp/junit4-J2-20191008_191743_86213655885317674621647.syserr
   [junit4] >>> JVM J2 emitted unexpected output (verbatim) ----
   [junit4] OpenJDK 64-Bit Server VM warning: Option UseConcMarkSweepGC was deprecated in version 9.0 and will likely be removed in a future release.
   [junit4] <<< JVM J2: EOF ----

[...truncated 9 lines...]
   [junit4] JVM J1: stderr was not empty, see: /home/jenkins/workspace/Lucene-Solr-SOLR-13661-Linux/lucene/build/backward-codecs/test/temp/junit4-J1-20191008_191743_8627325338972958996747.syserr
   [junit4] >>> JVM J1 emitted unexpected output (verbatim) ----
   [junit4] OpenJDK 64-Bit Server VM warning: Option UseConcMarkSweepGC was deprecated in version 9.0 and will likely be removed in a future release.
   [junit4] <<< JVM J1: EOF ----

[...truncated 1440 lines...]
   [junit4] JVM J1: stderr was not empty, see: /home/jenkins/workspace/Lucene-Solr-SOLR-13661-Linux/lucene/build/benchmark/test/temp/junit4-J1-20191008_192033_19916683536510577412619.syserr
   [junit4] >>> JVM J1 emitted unexpected output (verbatim) ----
   [junit4] OpenJDK 64-Bit Server VM warning: Option UseConcMarkSweepGC was deprecated in version 9.0 and will likely be removed in a future release.
   [junit4] <<< JVM J1: EOF ----

[...truncated 3 lines...]
   [junit4] JVM J0: stderr was not empty, see: /home/jenkins/workspace/Lucene-Solr-SOLR-13661-Linux/lucene/build/benchmark/test/temp/junit4-J0-20191008_192033_1995595085369843285561.syserr
   [junit4] >>> JVM J0 emitted unexpected output (verbatim) ----
   [junit4] OpenJDK 64-Bit Server VM warning: Option UseConcMarkSweepGC was deprecated in version 9.0 and will likely be removed in a future release.
   [junit4] <<< JVM J0: EOF ----

[...truncated 3 lines...]
   [junit4] JVM J2: stderr was not empty, see: /home/jenkins/workspace/Lucene-Solr-SOLR-13661-Linux/lucene/build/benchmark/test/temp/junit4-J2-20191008_192033_2021453828938519263894.syserr
   [junit4] >>> JVM J2 emitted unexpected output (verbatim) ----
   [junit4] OpenJDK 64-Bit Server VM warning: Option UseConcMarkSweepGC was deprecated in version 9.0 and will likely be removed in a future release.
   [junit4] <<< JVM J2: EOF ----

[...truncated 235 lines...]
   [junit4] JVM J2: stderr was not empty, see: /home/jenkins/workspace/Lucene-Solr-SOLR-13661-Linux/lucene/build/classification/test/temp/junit4-J2-20191008_192044_15914877664921045193978.syserr
   [junit4] >>> JVM J2 emitted unexpected output (verbatim) ----
   [junit4] OpenJDK 64-Bit Server VM warning: Option UseConcMarkSweepGC was deprecated in version 9.0 and will likely be removed in a future release.
   [junit4] <<< JVM J2: EOF ----

[...truncated 3 lines...]
   [junit4] JVM J0: stderr was not empty, see: /home/jenkins/workspace/Lucene-Solr-SOLR-13661-Linux/lucene/build/classification/test/temp/junit4-J0-20191008_192044_1594194056739737979848.syserr
   [junit4] >>> JVM J0 emitted unexpected output (verbatim) ----
   [junit4] OpenJDK 64-Bit Server VM warning: Option UseConcMarkSweepGC was deprecated in version 9.0 and will likely be removed in a future release.
   [junit4] <<< JVM J0: EOF ----

[...truncated 3 lines...]
   [junit4] JVM J1: stderr was not empty, see: /home/jenkins/workspace/Lucene-Solr-SOLR-13661-Linux/lucene/build/classification/test/temp/junit4-J1-20191008_192044_15918359590647277179182.syserr
   [junit4] >>> JVM J1 emitted unexpected output (verbatim) ----
   [junit4] OpenJDK 64-Bit Server VM warning: Option UseConcMarkSweepGC was deprecated in version 9.0 and will likely be removed in a future release.
   [junit4] <<< JVM J1: EOF ----

[...truncated 218 lines...]
   [junit4] JVM J1: stderr was not empty, see: /home/jenkins/workspace/Lucene-Solr-SOLR-13661-Linux/lucene/build/codecs/test/temp/junit4-J1-20191008_192103_13016483015928816989268.syserr
   [junit4] >>> JVM J1 emitted unexpected output (verbatim) ----
   [junit4] OpenJDK 64-Bit Server VM warning: Option UseConcMarkSweepGC was deprecated in version 9.0 and will likely be removed in a future release.
   [junit4] <<< JVM J1: EOF ----

[...truncated 62 lines...]
   [junit4] JVM J2: stderr was not empty, see: /home/jenkins/workspace/Lucene-Solr-SOLR-13661-Linux/lucene/build/codecs/test/temp/junit4-J2-20191008_192103_1305144465761454859918.syserr
   [junit4] >>> JVM J2 emitted unexpected output (verbatim) ----
   [junit4] OpenJDK 64-Bit Server VM warning: Option UseConcMarkSweepGC was deprecated in version 9.0 and will likely be removed in a future release.
   [junit4] <<< JVM J2: EOF ----

[...truncated 3 lines...]
   [junit4] JVM J0: stderr was not empty, see: /home/jenkins/workspace/Lucene-Solr-SOLR-13661-Linux/lucene/build/codecs/test/temp/junit4-J0-20191008_192103_1301306704031802273895.syserr
   [junit4] >>> JVM J0 emitted unexpected output (verbatim) ----
   [junit4] OpenJDK 64-Bit Server VM warning: Option UseConcMarkSweepGC was deprecated in version 9.0 and will likely be removed in a future release.
   [junit4] <<< JVM J0: EOF ----

[...truncated 209 lines...]
   [junit4] JVM J2: stderr was not empty, see: /home/jenkins/workspace/Lucene-Solr-SOLR-13661-Linux/lucene/build/demo/test/temp/junit4-J2-20191008_192340_95514250510347841720965.syserr
   [junit4] >>> JVM J2 emitted unexpected output (verbatim) ----
   [junit4] OpenJDK 64-Bit Server VM warning: Option UseConcMarkSweepGC was deprecated in version 9.0 and will likely be removed in a future release.
   [junit4] <<< JVM J2: EOF ----

[...truncated 3 lines...]
   [junit4] JVM J1: stderr was not empty, see: /home/jenkins/workspace/Lucene-Solr-SOLR-13661-Linux/lucene/build/demo/test/temp/junit4-J1-20191008_192340_95515212002569751095030.syserr
   [junit4] >>> JVM J1 emitted unexpected output (verbatim) ----
   [junit4] OpenJDK 64-Bit Server VM warning: Option UseConcMarkSweepGC was deprecated in version 9.0 and will likely be removed in a future release.
   [junit4] <<< JVM J1: EOF ----

   [junit4] JVM J0: stderr was not empty, see: /home/jenkins/workspace/Lucene-Solr-SOLR-13661-Linux/lucene/build/demo/test/temp/junit4-J0-20191008_192340_9571751499691766503044.syserr
   [junit4] >>> JVM J0 emitted unexpected output (verbatim) ----
   [junit4] OpenJDK 64-Bit Server VM warning: Option UseConcMarkSweepGC was deprecated in version 9.0 and will likely be removed in a future release.
   [junit4] <<< JVM J0: EOF ----

[...truncated 167 lines...]
   [junit4] JVM J2: stderr was not empty, see: /home/jenkins/workspace/Lucene-Solr-SOLR-13661-Linux/lucene/build/expressions/test/temp/junit4-J2-20191008_192345_18610863844694467432479.syserr
   [junit4] >>> JVM J2 emitted unexpected output (verbatim) ----
   [junit4] OpenJDK 64-Bit Server VM warning: Option UseConcMarkSweepGC was deprecated in version 9.0 and will likely be removed in a future release.
   [junit4] <<< JVM J2: EOF ----

[...truncated 3 lines...]
   [junit4] JVM J1: stderr was not empty, see: /home/jenkins/workspace/Lucene-Solr-SOLR-13661-Linux/lucene/build/expressions/test/temp/junit4-J1-20191008_192345_1855151515359690536462.syserr
   [junit4] >>> JVM J1 emitted unexpected output (verbatim) ----
   [junit4] OpenJDK 64-Bit Server VM warning: Option UseConcMarkSweepGC was deprecated in version 9.0 and will likely be removed in a future release.
   [junit4] <<< JVM J1: EOF ----

[...truncated 6 lines...]
   [junit4] JVM J0: stderr was not empty, see: /home/jenkins/workspace/Lucene-Solr-SOLR-13661-Linux/lucene/build/expressions/test/temp/junit4-J0-20191008_192345_18515291496700266887146.syserr
   [junit4] >>> JVM J0 emitted unexpected output (verbatim) ----
   [junit4] OpenJDK 64-Bit Server VM warning: Option UseConcMarkSweepGC was deprecated in version 9.0 and will likely be removed in a future release.
   [junit4] <<< JVM J0: EOF ----

[...truncated 229 lines...]
   [junit4] JVM J0: stderr was not empty, see: /home/jenkins/workspace/Lucene-Solr-SOLR-13661-Linux/lucene/build/facet/test/temp/junit4-J0-20191008_192353_8103009895512127998287.syserr
   [junit4] >>> JVM J0 emitted unexpected output (verbatim) ----
   [junit4] OpenJDK 64-Bit Server VM warning: Option UseConcMarkSweepGC was deprecated in version 9.0 and will likely be removed in a future release.
   [junit4] <<< JVM J0: EOF ----

   [junit4] JVM J1: stderr was not empty, see: /home/jenkins/workspace/Lucene-Solr-SOLR-13661-Linux/lucene/build/facet/test/temp/junit4-J1-20191008_192353_810597390696440028240.syserr
   [junit4] >>> JVM J1 emitted unexpected output (verbatim) ----
   [junit4] OpenJDK 64-Bit Server VM warning: Option UseConcMarkSweepGC was deprecated in version 9.0 and will likely be removed in a future release.
   [junit4] <<< JVM J1: EOF ----

[...truncated 3 lines...]
   [junit4] JVM J2: stderr was not empty, see: /home/jenkins/workspace/Lucene-Solr-SOLR-13661-Linux/lucene/build/facet/test/temp/junit4-J2-20191008_192353_81013498886513758484937.syserr
   [junit4] >>> JVM J2 emitted unexpected output (verbatim) ----
   [junit4] OpenJDK 64-Bit Server VM warning: Option UseConcMarkSweepGC was deprecated in version 9.0 and will likely be removed in a future release.
   [junit4] <<< JVM J2: EOF ----

[...truncated 179 lines...]
   [junit4] JVM J1: stderr was not empty, see: /home/jenkins/workspace/Lucene-Solr-SOLR-13661-Linux/lucene/build/grouping/test/temp/junit4-J1-20191008_192443_29612259362096288834769.syserr
   [junit4] >>> JVM J1 emitted unexpected output (verbatim) ----
   [junit4] OpenJDK 64-Bit Server VM warning: Option UseConcMarkSweepGC was deprecated in version 9.0 and will likely be removed in a future release.
   [junit4] <<< JVM J1: EOF ----

[...truncated 3 lines...]
   [junit4] JVM J0: stderr was not empty, see: /home/jenkins/workspace/Lucene-Solr-SOLR-13661-Linux/lucene/build/grouping/test/temp/junit4-J0-20191008_192443_2963038101451257033365.syserr
   [junit4] >>> JVM J0 emitted unexpected output (verbatim) ----
   [junit4] OpenJDK 64-Bit Server VM warning: Option UseConcMarkSweepGC was deprecated in version 9.0 and will likely be removed in a future release.
   [junit4] <<< JVM J0: EOF ----

[...truncated 3 lines...]
   [junit4] JVM J2: stderr was not empty, see: /home/jenkins/workspace/Lucene-Solr-SOLR-13661-Linux/lucene/build/grouping/test/temp/junit4-J2-20191008_192443_2966893168707962985236.syserr
   [junit4] >>> JVM J2 emitted unexpected output (verbatim) ----
   [junit4] OpenJDK 64-Bit Server VM warning: Option UseConcMarkSweepGC was deprecated in version 9.0 and will likely be removed in a future release.
   [junit4] <<< JVM J2: EOF ----

[...truncated 246 lines...]
   [junit4] JVM J1: stderr was not empty, see: /home/jenkins/workspace/Lucene-Solr-SOLR-13661-Linux/lucene/build/highlighter/test/temp/junit4-J1-20191008_192459_3868858807723842741223.syserr
   [junit4] >>> JVM J1 emitted unexpected output (verbatim) ----
   [junit4] OpenJDK 64-Bit Server VM warning: Option UseConcMarkSweepGC was deprecated in version 9.0 and will likely be removed in a future release.
   [junit4] <<< JVM J1: EOF ----

   [junit4] JVM J0: stderr was not empty, see: /home/jenkins/workspace/Lucene-Solr-SOLR-13661-Linux/lucene/build/highlighter/test/temp/junit4-J0-20191008_192459_3867015161603931443206.syserr
   [junit4] >>> JVM J0 emitted unexpected output (verbatim) ----
   [junit4] OpenJDK 64-Bit Server VM warning: Option UseConcMarkSweepGC was deprecated in version 9.0 and will likely be removed in a future release.
   [junit4] <<< JVM J0: EOF ----

[...truncated 3 lines...]
   [junit4] JVM J2: stderr was not empty, see: /home/jenkins/workspace/Lucene-Solr-SOLR-13661-Linux/lucene/build/highlighter/test/temp/junit4-J2-20191008_192459_38613498270175559325982.syserr
   [junit4] >>> JVM J2 emitted unexpected output (verbatim) ----
   [junit4] OpenJDK 64-Bit Server VM warning: Option UseConcMarkSweepGC was deprecated in version 9.0 and will likely be removed in a future release.
   [junit4] <<< JVM J2: EOF ----

[...truncated 163 lines...]
   [junit4] JVM J1: stderr was not empty, see: /home/jenkins/workspace/Lucene-Solr-SOLR-13661-Linux/lucene/build/join/test/temp/junit4-J1-20191008_192526_87218065665651299684687.syserr
   [junit4] >>> JVM J1 emitted unexpected output (verbatim) ----
   [junit4] OpenJDK 64-Bit Server VM warning: Option UseConcMarkSweepGC was deprecated in version 9.0 and will likely be removed in a future release.
   [junit4] <<< JVM J1: EOF ----

[...truncated 6 lines...]
   [junit4] JVM J0: stderr was not empty, see: /home/jenkins/workspace/Lucene-Solr-SOLR-13661-Linux/lucene/build/join/test/temp/junit4-J0-20191008_192526_8725549097927273236251.syserr
   [junit4] >>> JVM J0 emitted unexpected output (verbatim) ----
   [junit4] OpenJDK 64-Bit Server VM warning: Option UseConcMarkSweepGC was deprecated in version 9.0 and will likely be removed in a future release.
   [junit4] <<< JVM J0: EOF ----

[...truncated 3 lines...]
   [junit4] JVM J2: stderr was not empty, see: /home/jenkins/workspace/Lucene-Solr-SOLR-13661-Linux/lucene/build/join/test/temp/junit4-J2-20191008_192526_87212897025524719623643.syserr
   [junit4] >>> JVM J2 emitted unexpected output (verbatim) ----
   [junit4] OpenJDK 64-Bit Server VM warning: Option UseConcMarkSweepGC was deprecated in version 9.0 and will likely be removed in a future release.
   [junit4] <<< JVM J2: EOF ----

[...truncated 268 lines...]
   [junit4] JVM J0: stderr was not empty, see: /home/jenkins/workspace/Lucene-Solr-SOLR-13661-Linux/lucene/build/luke/test/temp/junit4-J0-20191008_192549_1615965120194635718479.syserr
   [junit4] >>> JVM J0 emitted unexpected output (verbatim) ----
   [junit4] OpenJDK 64-Bit Server VM warning: Option UseConcMarkSweepGC was deprecated in version 9.0 and will likely be removed in a future release.
   [junit4] <<< JVM J0: EOF ----

[...truncated 3 lines...]
   [junit4] JVM J2: stderr was not empty, see: /home/jenkins/workspace/Lucene-Solr-SOLR-13661-Linux/lucene/build/luke/test/temp/junit4-J2-20191008_192549_16116924601635227546039.syserr
   [junit4] >>> JVM J2 emitted unexpected output (verbatim) ----
   [junit4] OpenJDK 64-Bit Server VM warning: Option UseConcMarkSweepGC was deprecated in version 9.0 and will likely be removed in a future release.
   [junit4] <<< JVM J2: EOF ----

[...truncated 3 lines...]
   [junit4] JVM J1: stderr was not empty, see: /home/jenkins/workspace/Lucene-Solr-SOLR-13661-Linux/lucene/build/luke/test/temp/junit4-J1-20191008_192549_1613636069928904958595.syserr
   [junit4] >>> JVM J1 emitted unexpected output (verbatim) ----
   [junit4] OpenJDK 64-Bit Server VM warning: Option UseConcMarkSweepGC was deprecated in version 9.0 and will likely be removed in a future release.
   [junit4] <<< JVM J1: EOF ----

[...truncated 149 lines...]
   [junit4] JVM J0: stderr was not empty, see: /home/jenkins/workspace/Lucene-Solr-SOLR-13661-Linux/lucene/build/memory/test/temp/junit4-J0-20191008_192555_5816057192701507018802.syserr
   [junit4] >>> JVM J0 emitted unexpected output (verbatim) ----
   [junit4] OpenJDK 64-Bit Server VM warning: Option UseConcMarkSweepGC was deprecated in version 9.0 and will likely be removed in a future release.
   [junit4] <<< JVM J0: EOF ----

[...truncated 3 lines...]
   [junit4] JVM J1: stderr was not empty, see: /home/jenkins/workspace/Lucene-Solr-SOLR-13661-Linux/lucene/build/memory/test/temp/junit4-J1-20191008_192555_58116260338579747641153.syserr
   [junit4] >>> JVM J1 emitted unexpected output (verbatim) ----
   [junit4] OpenJDK 64-Bit Server VM warning: Option UseConcMarkSweepGC was deprecated in version 9.0 and will likely be removed in a future release.
   [junit4] <<< JVM J1: EOF ----

[...truncated 180 lines...]
   [junit4] JVM J1: stderr was not empty, see: /home/jenkins/workspace/Lucene-Solr-SOLR-13661-Linux/lucene/build/misc/test/temp/junit4-J1-20191008_192606_3576889278616241225902.syserr
   [junit4] >>> JVM J1 emitted unexpected output (verbatim) ----
   [junit4] OpenJDK 64-Bit Server VM warning: Option UseConcMarkSweepGC was deprecated in version 9.0 and will likely be removed in a future release.
   [junit4] <<< JVM J1: EOF ----

[...truncated 5 lines...]
   [junit4] JVM J0: stderr was not empty, see: /home/jenkins/workspace/Lucene-Solr-SOLR-13661-Linux/lucene/build/misc/test/temp/junit4-J0-20191008_192606_35710936847079677782543.syserr
   [junit4] >>> JVM J0 emitted unexpected output (verbatim) ----
   [junit4] OpenJDK 64-Bit Server VM warning: Option UseConcMarkSweepGC was deprecated in version 9.0 and will likely be removed in a future release.
   [junit4] <<< JVM J0: EOF ----

[...truncated 9 lines...]
   [junit4] JVM J2: stderr was not empty, see: /home/jenkins/workspace/Lucene-Solr-SOLR-13661-Linux/lucene/build/misc/test/temp/junit4-J2-20191008_192606_3579244453786238028375.syserr
   [junit4] >>> JVM J2 emitted unexpected output (verbatim) ----
   [junit4] OpenJDK 64-Bit Server VM warning: Option UseConcMarkSweepGC was deprecated in version 9.0 and will likely be removed in a future release.
   [junit4] <<< JVM J2: EOF ----

[...truncated 248 lines...]
   [junit4] JVM J0: stderr was not empty, see: /home/jenkins/workspace/Lucene-Solr-SOLR-13661-Linux/lucene/build/monitor/test/temp/junit4-J0-20191008_192637_7547464595181114164138.syserr
   [junit4] >>> JVM J0 emitted unexpected output (verbatim) ----
   [junit4] OpenJDK 64-Bit Server VM warning: Option UseConcMarkSweepGC was deprecated in version 9.0 and will likely be removed in a future release.
   [junit4] <<< JVM J0: EOF ----

   [junit4] JVM J1: stderr was not empty, see: /home/jenkins/workspace/Lucene-Solr-SOLR-13661-Linux/lucene/build/monitor/test/temp/junit4-J1-20191008_192637_7546306999392128194888.syserr
   [junit4] >>> JVM J1 emitted unexpected output (verbatim) ----
   [junit4] OpenJDK 64-Bit Server VM warning: Option UseConcMarkSweepGC was deprecated in version 9.0 and will likely be removed in a future release.
   [junit4] <<< JVM J1: EOF ----

[...truncated 9 lines...]
   [junit4] JVM J2: stderr was not empty, see: /home/jenkins/workspace/Lucene-Solr-SOLR-13661-Linux/lucene/build/monitor/test/temp/junit4-J2-20191008_192637_7587662160974178484452.syserr
   [junit4] >>> JVM J2 emitted unexpected output (verbatim) ----
   [junit4] OpenJDK 64-Bit Server VM warning: Option UseConcMarkSweepGC was deprecated in version 9.0 and will likely be removed in a future release.
   [junit4] <<< JVM J2: EOF ----

[...truncated 313 lines...]
   [junit4] JVM J0: stderr was not empty, see: /home/jenkins/workspace/Lucene-Solr-SOLR-13661-Linux/lucene/build/queries/test/temp/junit4-J0-20191008_192648_260884803744813894048.syserr
   [junit4] >>> JVM J0 emitted unexpected output (verbatim) ----
   [junit4] OpenJDK 64-Bit Server VM warning: Option UseConcMarkSweepGC was deprecated in version 9.0 and will likely be removed in a future release.
   [junit4] <<< JVM J0: EOF ----

[...truncated 3 lines...]
   [junit4] JVM J2: stderr was not empty, see: /home/jenkins/workspace/Lucene-Solr-SOLR-13661-Linux/lucene/build/queries/test/temp/junit4-J2-20191008_192648_2608768336648772156096.syserr
   [junit4] >>> JVM J2 emitted unexpected output (verbatim) ----
   [junit4] OpenJDK 64-Bit Server VM warning: Option UseConcMarkSweepGC was deprecated in version 9.0 and will likely be removed in a future release.
   [junit4] <<< JVM J2: EOF ----

[...truncated 3 lines...]
   [junit4] JVM J1: stderr was not empty, see: /home/jenkins/workspace/Lucene-Solr-SOLR-13661-Linux/lucene/build/queries/test/temp/junit4-J1-20191008_192648_2608773386079517041345.syserr
   [junit4] >>> JVM J1 emitted unexpected output (verbatim) ----
   [junit4] OpenJDK 64-Bit Server VM warning: Option UseConcMarkSweepGC was deprecated in version 9.0 and will likely be removed in a future release.
   [junit4] <<< JVM J1: EOF ----

[...truncated 223 lines...]
   [junit4] JVM J2: stderr was not empty, see: /home/jenkins/workspace/Lucene-Solr-SOLR-13661-Linux/lucene/build/queryparser/test/temp/junit4-J2-20191008_192658_6748871516052332501581.syserr
   [junit4] >>> JVM J2 emitted unexpected output (verbatim) ----
   [junit4] OpenJDK 64-Bit Server VM warning: Option UseConcMarkSweepGC was deprecated in version 9.0 and will likely be removed in a future release.
   [junit4] <<< JVM J2: EOF ----

[...truncated 6 lines...]
   [junit4] JVM J0: stderr was not empty, see: /home/jenkins/workspace/Lucene-Solr-SOLR-13661-Linux/lucene/build/queryparser/test/temp/junit4-J0-20191008_192658_6743878597347530663751.syserr
   [junit4] >>> JVM J0 emitted unexpected output (verbatim) ----
   [junit4] OpenJDK 64-Bit Server VM warning: Option UseConcMarkSweepGC was deprecated in version 9.0 and will likely be removed in a future release.
   [junit4] <<< JVM J0: EOF ----

   [junit4] JVM J1: stderr was not empty, see: /home/jenkins/workspace/Lucene-Solr-SOLR-13661-Linux/lucene/build/queryparser/test/temp/junit4-J1-20191008_192658_674956918626518770152.syserr
   [junit4] >>> JVM J1 emitted unexpected output (verbatim) ----
   [junit4] OpenJDK 64-Bit Server VM warning: Option UseConcMarkSweepGC was deprecated in version 9.0 and will likely be removed in a future release.
   [junit4] <<< JVM J1: EOF ----

[...truncated 209 lines...]
   [junit4] JVM J1: stderr was not empty, see: /home/jenkins/workspace/Lucene-Solr-SOLR-13661-Linux/lucene/build/replicator/test/temp/junit4-J1-20191008_192707_6263826864077694655574.syserr
   [junit4] >>> JVM J1 emitted unexpected output (verbatim) ----
   [junit4] OpenJDK 64-Bit Server VM warning: Option UseConcMarkSweepGC was deprecated in version 9.0 and will likely be removed in a future release.
   [junit4] <<< JVM J1: EOF ----

[...truncated 3 lines...]
   [junit4] JVM J0: stderr was not empty, see: /home/jenkins/workspace/Lucene-Solr-SOLR-13661-Linux/lucene/build/replicator/test/temp/junit4-J0-20191008_192707_62616894231735362632998.syserr
   [junit4] >>> JVM J0 emitted unexpected output (verbatim) ----
   [junit4] OpenJDK 64-Bit Server VM warning: Option UseConcMarkSweepGC was deprecated in version 9.0 and will likely be removed in a future release.
   [junit4] <<< JVM J0: EOF ----

[...truncated 3 lines...]
   [junit4] JVM J2: stderr was not empty, see: /home/jenkins/workspace/Lucene-Solr-SOLR-13661-Linux/lucene/build/replicator/test/temp/junit4-J2-20191008_192707_6264672998492597872203.syserr
   [junit4] >>> JVM J2 emitted unexpected output (verbatim) ----
   [junit4] OpenJDK 64-Bit Server VM warning: Option UseConcMarkSweepGC was deprecated in version 9.0 and will likely be removed in a future release.
   [junit4] <<< JVM J2: EOF ----

[...truncated 273 lines...]
   [junit4] JVM J1: stderr was not empty, see: /home/jenkins/workspace/Lucene-Solr-SOLR-13661-Linux/lucene/build/sandbox/test/temp/junit4-J1-20191008_192720_3528003737503279608786.syserr
   [junit4] >>> JVM J1 emitted unexpected output (verbatim) ----
   [junit4] OpenJDK 64-Bit Server VM warning: Option UseConcMarkSweepGC was deprecated in version 9.0 and will likely be removed in a future release.
   [junit4] <<< JVM J1: EOF ----

[...truncated 5 lines...]
   [junit4] JVM J0: stderr was not empty, see: /home/jenkins/workspace/Lucene-Solr-SOLR-13661-Linux/lucene/build/sandbox/test/temp/junit4-J0-20191008_192720_35218395296756631727627.syserr
   [junit4] >>> JVM J0 emitted unexpected output (verbatim) ----
   [junit4] OpenJDK 64-Bit Server VM warning: Option UseConcMarkSweepGC was deprecated in version 9.0 and will likely be removed in a future release.
   [junit4] <<< JVM J0: EOF ----

[...truncated 5 lines...]
   [junit4] JVM J2: stderr was not empty, see: /home/jenkins/workspace/Lucene-Solr-SOLR-13661-Linux/lucene/build/sandbox/test/temp/junit4-J2-20191008_192720_3528040014828627373961.syserr
   [junit4] >>> JVM J2 emitted unexpected output (verbatim) ----
   [junit4] OpenJDK 64-Bit Server VM warning: Option UseConcMarkSweepGC was deprecated in version 9.0 and will likely be removed in a future release.
   [junit4] <<< JVM J2: EOF ----

[...truncated 288 lines...]
   [junit4] JVM J2: stderr was not empty, see: /home/jenkins/workspace/Lucene-Solr-SOLR-13661-Linux/lucene/build/spatial-extras/test/temp/junit4-J2-20191008_193005_78418151557701591837321.syserr
   [junit4] >>> JVM J2 emitted unexpected output (verbatim) ----
   [junit4] OpenJDK 64-Bit Server VM warning: Option UseConcMarkSweepGC was deprecated in version 9.0 and will likely be removed in a future release.
   [junit4] <<< JVM J2: EOF ----

[...truncated 3 lines...]
   [junit4] JVM J0: stderr was not empty, see: /home/jenkins/workspace/Lucene-Solr-SOLR-13661-Linux/lucene/build/spatial-extras/test/temp/junit4-J0-20191008_193005_78416225569482502962927.syserr
   [junit4] >>> JVM J0 emitted unexpected output (verbatim) ----
   [junit4] OpenJDK 64-Bit Server VM warning: Option UseConcMarkSweepGC was deprecated in version 9.0 and will likely be removed in a future release.
   [junit4] <<< JVM J0: EOF ----

[...truncated 12 lines...]
   [junit4] JVM J1: stderr was not empty, see: /home/jenkins/workspace/Lucene-Solr-SOLR-13661-Linux/lucene/build/spatial-extras/test/temp/junit4-J1-20191008_193005_7849110745905046614424.syserr
   [junit4] >>> JVM J1 emitted unexpected output (verbatim) ----
   [junit4] OpenJDK 64-Bit Server VM warning: Option UseConcMarkSweepGC was deprecated in version 9.0 and will likely be removed in a future release.
   [junit4] <<< JVM J1: EOF ----

[...truncated 148 lines...]
   [junit4] JVM J0: stderr was not empty, see: /home/jenkins/workspace/Lucene-Solr-SOLR-13661-Linux/lucene/build/spatial/test/temp/junit4-J0-20191008_193039_36312426665939120698646.syserr
   [junit4] >>> JVM J0 emitted unexpected output (verbatim) ----
   [junit4] OpenJDK 64-Bit Server VM warning: Option UseConcMarkSweepGC was deprecated in version 9.0 and will likely be removed in a future release.
   [junit4] <<< JVM J0: EOF ----

[...truncated 181 lines...]
   [junit4] JVM J2: stderr was not empty, see: /home/jenkins/workspace/Lucene-Solr-SOLR-13661-Linux/lucene/build/spatial3d/test/temp/junit4-J2-20191008_193041_3413527861208607602774.syserr
   [junit4] >>> JVM J2 emitted unexpected output (verbatim) ----
   [junit4] OpenJDK 64-Bit Server VM warning: Option UseConcMarkSweepGC was deprecated in version 9.0 and will likely be removed in a future release.
   [junit4] <<< JVM J2: EOF ----

[...truncated 3 lines...]
   [junit4] JVM J0: stderr was not empty, see: /home/jenkins/workspace/Lucene-Solr-SOLR-13661-Linux/lucene/build/spatial3d/test/temp/junit4-J0-20191008_193041_3416516615493526297530.syserr
   [junit4] >>> JVM J0 emitted unexpected output (verbatim) ----
   [junit4] OpenJDK 64-Bit Server VM warning: Option UseConcMarkSweepGC was deprecated in version 9.0 and will likely be removed in a future release.
   [junit4] <<< JVM J0: EOF ----

[...truncated 6 lines...]
   [junit4] JVM J1: stderr was not empty, see: /home/jenkins/workspace/Lucene-Solr-SOLR-13661-Linux/lucene/build/spatial3d/test/temp/junit4-J1-20191008_193041_34116664847228221676469.syserr
   [junit4] >>> JVM J1 emitted unexpected output (verbatim) ----
   [junit4] OpenJDK 64-Bit Server VM warning: Option UseConcMarkSweepGC was deprecated in version 9.0 and will likely be removed in a future release.
   [junit4] <<< JVM J1: EOF ----

[...truncated 245 lines...]
   [junit4] JVM J2: stderr was not empty, see: /home/jenkins/workspace/Lucene-Solr-SOLR-13661-Linux/lucene/build/suggest/test/temp/junit4-J2-20191008_193211_6135002037320264556439.syserr
   [junit4] >>> JVM J2 emitted unexpected output (verbatim) ----
   [junit4] OpenJDK 64-Bit Server VM warning: Option UseConcMarkSweepGC was deprecated in version 9.0 and will likely be removed in a future release.
   [junit4] <<< JVM J2: EOF ----

[...truncated 9 lines...]
   [junit4] JVM J1: stderr was not empty, see: /home/jenkins/workspace/Lucene-Solr-SOLR-13661-Linux/lucene/build/suggest/test/temp/junit4-J1-20191008_193211_61311587332970299226872.syserr
   [junit4] >>> JVM J1 emitted unexpected output (verbatim) ----
   [junit4] OpenJDK 64-Bit Server VM warning: Option UseConcMarkSweepGC was deprecated in version 9.0 and will likely be removed in a future release.
   [junit4] <<< JVM J1: EOF ----

[...truncated 3 lines...]
   [junit4] JVM J0: stderr was not empty, see: /home/jenkins/workspace/Lucene-Solr-SOLR-13661-Linux/lucene/build/suggest/test/temp/junit4-J0-20191008_193211_61313420434656705248710.syserr
   [junit4] >>> JVM J0 emitted unexpected output (verbatim) ----
   [junit4] OpenJDK 64-Bit Server VM warning: Option UseConcMarkSweepGC was deprecated in version 9.0 and will likely be removed in a future release.
   [junit4] <<< JVM J0: EOF ----

[...truncated 2637 lines...]
   [junit4] Suite: org.apache.solr.handler.TestPackages
   [junit4]   2> 831583 INFO  (SUITE-TestPackages-seed#[5DF91F058ABC2679]-worker) [     ] o.a.s.SolrTestCaseJ4 SecureRandom sanity checks: test.solr.allowed.securerandom=null & java.security.egd=file:/dev/./urandom
   [junit4]   2> 831584 INFO  (SUITE-TestPackages-seed#[5DF91F058ABC2679]-worker) [     ] o.a.s.SolrTestCaseJ4 Created dataDir: /home/jenkins/workspace/Lucene-Solr-SOLR-13661-Linux/solr/build/solr-core/test/J1/temp/solr.handler.TestPackages_5DF91F058ABC2679-001/data-dir-83-001
   [junit4]   2> 831584 WARN  (SUITE-TestPackages-seed#[5DF91F058ABC2679]-worker) [     ] o.a.s.SolrTestCaseJ4 startTrackingSearchers: numOpens=35 numCloses=35
   [junit4]   2> 831584 INFO  (SUITE-TestPackages-seed#[5DF91F058ABC2679]-worker) [     ] o.a.s.SolrTestCaseJ4 Using PointFields (NUMERIC_POINTS_SYSPROP=true) w/NUMERIC_DOCVALUES_SYSPROP=false
   [junit4]   2> 831585 INFO  (SUITE-TestPackages-seed#[5DF91F058ABC2679]-worker) [     ] o.a.s.SolrTestCaseJ4 Randomized ssl (false) and clientAuth (false) via: @org.apache.solr.SolrTestCaseJ4$SuppressSSL(bugUrl="None")
   [junit4]   2> 831587 INFO  (TEST-TestPackages.testSetClusterReqHandler-seed#[5DF91F058ABC2679]) [     ] o.a.s.SolrTestCaseJ4 ###Starting testSetClusterReqHandler
   [junit4]   2> 831588 INFO  (TEST-TestPackages.testSetClusterReqHandler-seed#[5DF91F058ABC2679]) [     ] o.a.s.c.MiniSolrCloudCluster Starting cluster of 4 servers in /home/jenkins/workspace/Lucene-Solr-SOLR-13661-Linux/solr/build/solr-core/test/J1/temp/solr.handler.TestPackages_5DF91F058ABC2679-001/tempDir-001
   [junit4]   2> 831588 INFO  (TEST-TestPackages.testSetClusterReqHandler-seed#[5DF91F058ABC2679]) [     ] o.a.s.c.ZkTestServer STARTING ZK TEST SERVER
   [junit4]   2> 831588 INFO  (ZkTestServer Run Thread) [     ] o.a.s.c.ZkTestServer client port:0.0.0.0/0.0.0.0:0
   [junit4]   2> 831588 INFO  (ZkTestServer Run Thread) [     ] o.a.s.c.ZkTestServer Starting server
   [junit4]   2> 831688 INFO  (TEST-TestPackages.testSetClusterReqHandler-seed#[5DF91F058ABC2679]) [     ] o.a.s.c.ZkTestServer start zk server on port:42737
   [junit4]   2> 831688 INFO  (TEST-TestPackages.testSetClusterReqHandler-seed#[5DF91F058ABC2679]) [     ] o.a.s.c.ZkTestServer waitForServerUp: 127.0.0.1:42737
   [junit4]   2> 831688 INFO  (TEST-TestPackages.testSetClusterReqHandler-seed#[5DF91F058ABC2679]) [     ] o.a.s.c.ZkTestServer parse host and port list: 127.0.0.1:42737
   [junit4]   2> 831688 INFO  (TEST-TestPackages.testSetClusterReqHandler-seed#[5DF91F058ABC2679]) [     ] o.a.s.c.ZkTestServer connecting to 127.0.0.1 42737
   [junit4]   2> 831691 INFO  (TEST-TestPackages.testSetClusterReqHandler-seed#[5DF91F058ABC2679]) [     ] o.a.s.c.c.ConnectionManager Waiting for client to connect to ZooKeeper
   [junit4]   2> 831692 INFO  (zkConnectionManagerCallback-5654-thread-1) [     ] o.a.s.c.c.ConnectionManager zkClient has connected
   [junit4]   2> 831692 INFO  (TEST-TestPackages.testSetClusterReqHandler-seed#[5DF91F058ABC2679]) [     ] o.a.s.c.c.ConnectionManager Client is connected to ZooKeeper
   [junit4]   2> 831697 INFO  (TEST-TestPackages.testSetClusterReqHandler-seed#[5DF91F058ABC2679]) [     ] o.a.s.c.c.ConnectionManager Waiting for client to connect to ZooKeeper
   [junit4]   2> 831699 INFO  (zkConnectionManagerCallback-5656-thread-1) [     ] o.a.s.c.c.ConnectionManager zkClient has connected
   [junit4]   2> 831699 INFO  (TEST-TestPackages.testSetClusterReqHandler-seed#[5DF91F058ABC2679]) [     ] o.a.s.c.c.ConnectionManager Client is connected to ZooKeeper
   [junit4]   2> 831700 INFO  (TEST-TestPackages.testSetClusterReqHandler-seed#[5DF91F058ABC2679]) [     ] o.a.s.c.c.ConnectionManager Waiting for client to connect to ZooKeeper
   [junit4]   2> 831701 INFO  (zkConnectionManagerCallback-5658-thread-1) [     ] o.a.s.c.c.ConnectionManager zkClient has connected
   [junit4]   2> 831701 INFO  (TEST-TestPackages.testSetClusterReqHandler-seed#[5DF91F058ABC2679]) [     ] o.a.s.c.c.ConnectionManager Client is connected to ZooKeeper
   [junit4]   2> 831804 WARN  (jetty-launcher-5659-thread-2) [     ] o.e.j.s.AbstractConnector Ignoring deprecated socket close linger time
   [junit4]   2> 831804 WARN  (jetty-launcher-5659-thread-3) [     ] o.e.j.s.AbstractConnector Ignoring deprecated socket close linger time
   [junit4]   2> 831804 WARN  (jetty-launcher-5659-thread-1) [     ] o.e.j.s.AbstractConnector Ignoring deprecated socket close linger time
   [junit4]   2> 831804 WARN  (jetty-launcher-5659-thread-4) [     ] o.e.j.s.AbstractConnector Ignoring deprecated socket close linger time
   [junit4]   2> 831804 INFO  (jetty-launcher-5659-thread-2) [     ] o.a.s.c.s.e.JettySolrRunner Start Jetty (original configured port=0)
   [junit4]   2> 831804 INFO  (jetty-launcher-5659-thread-2) [     ] o.a.s.c.s.e.JettySolrRunner Trying to start Jetty on port 0 try number 1 ...
   [junit4]   2> 831804 INFO  (jetty-launcher-5659-thread-3) [     ] o.a.s.c.s.e.JettySolrRunner Start Jetty (original configured port=0)
   [junit4]   2> 831804 INFO  (jetty-launcher-5659-thread-1) [     ] o.a.s.c.s.e.JettySolrRunner Start Jetty (original configured port=0)
   [junit4]   2> 831804 INFO  (jetty-launcher-5659-thread-4) [     ] o.a.s.c.s.e.JettySolrRunner Start Jetty (original configured port=0)
   [junit4]   2> 831804 INFO  (jetty-launcher-5659-thread-1) [     ] o.a.s.c.s.e.JettySolrRunner Trying to start Jetty on port 0 try number 1 ...
   [junit4]   2> 831804 INFO  (jetty-launcher-5659-thread-3) [     ] o.a.s.c.s.e.JettySolrRunner Trying to start Jetty on port 0 try number 1 ...
   [junit4]   2> 831804 INFO  (jetty-launcher-5659-thread-4) [     ] o.a.s.c.s.e.JettySolrRunner Trying to start Jetty on port 0 try number 1 ...
   [junit4]   2> 831804 INFO  (jetty-launcher-5659-thread-1) [     ] o.e.j.s.Server jetty-9.4.19.v20190610; built: 2019-06-10T16:30:51.723Z; git: afcf563148970e98786327af5e07c261fda175d3; jvm 14-ea+14-570
   [junit4]   2> 831804 INFO  (jetty-launcher-5659-thread-2) [     ] o.e.j.s.Server jetty-9.4.19.v20190610; built: 2019-06-10T16:30:51.723Z; git: afcf563148970e98786327af5e07c261fda175d3; jvm 14-ea+14-570
   [junit4]   2> 831804 INFO  (jetty-launcher-5659-thread-3) [     ] o.e.j.s.Server jetty-9.4.19.v20190610; built: 2019-06-10T16:30:51.723Z; git: afcf563148970e98786327af5e07c261fda175d3; jvm 14-ea+14-570
   [junit4]   2> 831804 INFO  (jetty-launcher-5659-thread-4) [     ] o.e.j.s.Server jetty-9.4.19.v20190610; built: 2019-06-10T16:30:51.723Z; git: afcf563148970e98786327af5e07c261fda175d3; jvm 14-ea+14-570
   [junit4]   2> 831822 INFO  (jetty-launcher-5659-thread-2) [     ] o.e.j.s.session DefaultSessionIdManager workerName=node0
   [junit4]   2> 831822 INFO  (jetty-launcher-5659-thread-2) [     ] o.e.j.s.session No SessionScavenger set, using defaults
   [junit4]   2> 831822 INFO  (jetty-launcher-5659-thread-3) [     ] o.e.j.s.session DefaultSessionIdManager workerName=node0
   [junit4]   2> 831822 INFO  (jetty-launcher-5659-thread-3) [     ] o.e.j.s.session No SessionScavenger set, using defaults
   [junit4]   2> 831822 INFO  (jetty-launcher-5659-thread-2) [     ] o.e.j.s.session node0 Scavenging every 660000ms
   [junit4]   2> 831822 INFO  (jetty-launcher-5659-thread-3) [     ] o.e.j.s.session node0 Scavenging every 660000ms
   [junit4]   2> 831826 INFO  (jetty-launcher-5659-thread-1) [     ] o.e.j.s.session DefaultSessionIdManager workerName=node0
   [junit4]   2> 831826 INFO  (jetty-launcher-5659-thread-1) [     ] o.e.j.s.session No SessionScavenger set, using defaults
   [junit4]   2> 831826 INFO  (jetty-launcher-5659-thread-1) [     ] o.e.j.s.session node0 Scavenging every 660000ms
   [junit4]   2> 831826 INFO  (jetty-launcher-5659-thread-2) [     ] o.e.j.s.h.ContextHandler Started o.e.j.s.ServletContextHandler@5c979e96{/solr,null,AVAILABLE}
   [junit4]   2> 831826 INFO  (jetty-launcher-5659-thread-3) [     ] o.e.j.s.h.ContextHandler Started o.e.j.s.ServletContextHandler@34aaca46{/solr,null,AVAILABLE}
   [junit4]   2> 831827 INFO  (jetty-launcher-5659-thread-2) [     ] o.e.j.s.AbstractConnector Started ServerConnector@3e4c609e{HTTP/1.1,[http/1.1, h2c]}{127.0.0.1:45683}
   [junit4]   2> 831827 INFO  (jetty-launcher-5659-thread-3) [     ] o.e.j.s.AbstractConnector Started ServerConnector@50307caa{HTTP/1.1,[http/1.1, h2c]}{127.0.0.1:36677}
   [junit4]   2> 831827 INFO  (jetty-launcher-5659-thread-3) [     ] o.e.j.s.Server Started @831857ms
   [junit4]   2> 831827 INFO  (jetty-launcher-5659-thread-3) [     ] o.a.s.c.s.e.JettySolrRunner Jetty properties: {hostContext=/solr, hostPort=36677}
   [junit4]   2> 831827 INFO  (jetty-launcher-5659-thread-2) [     ] o.e.j.s.Server Started @831857ms
   [junit4]   2> 831827 INFO  (jetty-launcher-5659-thread-2) [     ] o.a.s.c.s.e.JettySolrRunner Jetty properties: {hostContext=/solr, hostPort=45683}
   [junit4]   2> 831827 ERROR (jetty-launcher-5659-thread-3) [     ] o.a.s.u.StartupLoggingUtils Missing Java Option solr.log.dir. Logging may be missing or incomplete.
   [junit4]   2> 831827 INFO  (jetty-launcher-5659-thread-3) [     ] o.a.s.s.SolrDispatchFilter Using logger factory org.apache.logging.slf4j.Log4jLoggerFactory
   [junit4]   2> 831827 INFO  (jetty-launcher-5659-thread-3) [     ] o.a.s.s.SolrDispatchFilter  ___      _       Welcome to Apache Solr™ version 9.0.0
   [junit4]   2> 831827 INFO  (jetty-launcher-5659-thread-3) [     ] o.a.s.s.SolrDispatchFilter / __| ___| |_ _   Starting in cloud mode on port null
   [junit4]   2> 831827 INFO  (jetty-launcher-5659-thread-3) [     ] o.a.s.s.SolrDispatchFilter \__ \/ _ \ | '_|  Install dir: null
   [junit4]   2> 831827 INFO  (jetty-launcher-5659-thread-3) [     ] o.a.s.s.SolrDispatchFilter |___/\___/_|_|    Start time: 2019-10-08T19:47:13.079624Z
   [junit4]   2> 831827 ERROR (jetty-launcher-5659-thread-2) [     ] o.a.s.u.StartupLoggingUtils Missing Java Option solr.log.dir. Logging may be missing or incomplete.
   [junit4]   2> 831827 INFO  (jetty-launcher-5659-thread-2) [     ] o.a.s.s.SolrDispatchFilter Using logger factory org.apache.logging.slf4j.Log4jLoggerFactory
   [junit4]   2> 831827 INFO  (jetty-launcher-5659-thread-2) [     ] o.a.s.s.SolrDispatchFilter  ___      _       Welcome to Apache Solr™ version 9.0.0
   [junit4]   2> 831827 INFO  (jetty-launcher-5659-thread-2) [     ] o.a.s.s.SolrDispatchFilter / __| ___| |_ _   Starting in cloud mode on port null
   [junit4]   2> 831827 INFO  (jetty-launcher-5659-thread-2) [     ] o.a.s.s.SolrDispatchFilter \__ \/ _ \ | '_|  Install dir: null
   [junit4]   2> 831827 INFO  (jetty-launcher-5659-thread-2) [     ] o.a.s.s.SolrDispatchFilter |___/\___/_|_|    Start time: 2019-10-08T19:47:13.079749Z
   [junit4]   2> 831830 INFO  (jetty-launcher-5659-thread-1) [     ] o.e.j.s.h.ContextHandler Started o.e.j.s.ServletContextHandler@4a0f539e{/solr,null,AVAILABLE}
   [junit4]   2> 831831 INFO  (jetty-launcher-5659-thread-1) [     ] o.e.j.s.AbstractConnector Started ServerConnector@7e74af55{HTTP/1.1,[http/1.1, h2c]}{127.0.0.1:38461}
   [junit4]   2> 831831 INFO  (jetty-launcher-5659-thread-1) [     ] o.e.j.s.Server Started @831861ms
   [junit4]   2> 831831 INFO  (jetty-launcher-5659-thread-3) [     ] o.a.s.c.c.ConnectionManager Waiting for client to connect to ZooKeeper
   [junit4]   2> 831831 INFO  (jetty-launcher-5659-thread-2) [     ] o.a.s.c.c.ConnectionManager Waiting for client to connect to ZooKeeper
   [junit4]   2> 831831 INFO  (jetty-launcher-5659-thread-1) [     ] o.a.s.c.s.e.JettySolrRunner Jetty properties: {hostContext=/solr, hostPort=38461}
   [junit4]   2> 831835 INFO  (jetty-launcher-5659-thread-4) [     ] o.e.j.s.session DefaultSessionIdManager workerName=node0
   [junit4]   2> 831835 INFO  (jetty-launcher-5659-thread-4) [     ] o.e.j.s.session No SessionScavenger set, using defaults
   [junit4]   2> 831835 INFO  (jetty-launcher-5659-thread-4) [     ] o.e.j.s.session node0 Scavenging every 600000ms
   [junit4]   2> 831835 ERROR (jetty-launcher-5659-thread-1) [     ] o.a.s.u.StartupLoggingUtils Missing Java Option solr.log.dir. Logging may be missing or incomplete.
   [junit4]   2> 831835 INFO  (jetty-launcher-5659-thread-1) [     ] o.a.s.s.SolrDispatchFilter Using logger factory org.apache.logging.slf4j.Log4jLoggerFactory
   [junit4]   2> 831835 INFO  (jetty-launcher-5659-thread-1) [     ] o.a.s.s.SolrDispatchFilter  ___      _       Welcome to Apache Solr™ version 9.0.0
   [junit4]   2> 831835 INFO  (jetty-launcher-5659-thread-1) [     ] o.a.s.s.SolrDispatchFilter / __| ___| |_ _   Starting in cloud mode on port null
   [junit4]   2> 831835 INFO  (jetty-launcher-5659-thread-1) [     ] o.a.s.s.SolrDispatchFilter \__ \/ _ \ | '_|  Install dir: null
   [junit4]   2> 831835 INFO  (jetty-launcher-5659-thread-1) [     ] o.a.s.s.SolrDispatchFilter |___/\___/_|_|    Start time: 2019-10-08T19:47:13.087734Z
   [junit4]   2> 831836 INFO  (zkConnectionManagerCallback-5661-thread-1) [     ] o.a.s.c.c.ConnectionManager zkClient has connected
   [junit4]   2> 831836 INFO  (jetty-launcher-5659-thread-3) [     ] o.a.s.c.c.ConnectionManager Client is connected to ZooKeeper
   [junit4]   2> 831836 INFO  (zkConnectionManagerCallback-5663-thread-1) [     ] o.a.s.c.c.ConnectionManager zkClient has connected
   [junit4]   2> 831836 INFO  (jetty-launcher-5659-thread-2) [     ] o.a.s.c.c.ConnectionManager Client is connected to ZooKeeper
   [junit4]   2> 831836 INFO  (jetty-launcher-5659-thread-1) [     ] o.a.s.c.c.ConnectionManager Waiting for client to connect to ZooKeeper
   [junit4]   2> 831836 INFO  (jetty-launcher-5659-thread-4) [     ] o.e.j.s.h.ContextHandler Started o.e.j.s.ServletContextHandler@1de84bc3{/solr,null,AVAILABLE}
   [junit4]   2> 831836 INFO  (jetty-launcher-5659-thread-3) [     ] o.a.s.s.SolrDispatchFilter solr.xml found in ZooKeeper. Loading...
   [junit4]   2> 831836 INFO  (jetty-launcher-5659-thread-2) [     ] o.a.s.s.SolrDispatchFilter solr.xml found in ZooKeeper. Loading...
   [junit4]   2> 831838 INFO  (zkConnectionManagerCallback-5665-thread-1) [     ] o.a.s.c.c.ConnectionManager zkClient has connected
   [junit4]   2> 831838 INFO  (jetty-launcher-5659-thread-4) [     ] o.e.j.s.AbstractConnector Started ServerConnector@5a56075f{HTTP/1.1,[http/1.1, h2c]}{127.0.0.1:33551}
   [junit4]   2> 831838 INFO  (jetty-launcher-5659-thread-4) [     ] o.e.j.s.Server Started @831869ms
   [junit4]   2> 831838 INFO  (jetty-launcher-5659-thread-4) [     ] o.a.s.c.s.e.JettySolrRunner Jetty properties: {hostContext=/solr, hostPort=33551}
   [junit4]   2> 831838 INFO  (jetty-launcher-5659-thread-1) [     ] o.a.s.c.c.ConnectionManager Client is connected to ZooKeeper
   [junit4]   2> 831838 ERROR (jetty-launcher-5659-thread-4) [     ] o.a.s.u.StartupLoggingUtils Missing Java Option solr.log.dir. Logging may be missing or incomplete.
   [junit4]   2> 831838 INFO  (jetty-launcher-5659-thread-4) [     ] o.a.s.s.SolrDispatchFilter Using logger factory org.apache.logging.slf4j.Log4jLoggerFactory
   [junit4]   2> 831838 INFO  (jetty-launcher-5659-thread-4) [     ] o.a.s.s.SolrDispatchFilter  ___      _       Welcome to Apache Solr™ version 9.0.0
   [junit4]   2> 831839 INFO  (jetty-launcher-5659-thread-1) [     ] o.a.s.s.SolrDispatchFilter solr.xml found in ZooKeeper. Loading...
   [junit4]   2> 831838 INFO  (jetty-launcher-5659-thread-4) [     ] o.a.s.s.SolrDispatchFilter / __| ___| |_ _   Starting in cloud mode on port null
   [junit4]   2> 831839 INFO  (jetty-launcher-5659-thread-4) [     ] o.a.s.s.SolrDispatchFilter \__ \/ _ \ | '_|  Install dir: null
   [junit4]   2> 831839 INFO  (jetty-launcher-5659-thread-4) [     ] o.a.s.s.SolrDispatchFilter |___/\___/_|_|    Start time: 2019-10-08T19:47:13.091111Z
   [junit4]   2> 831839 INFO  (jetty-launcher-5659-thread-4) [     ] o.a.s.c.c.ConnectionManager Waiting for client to connect to ZooKeeper
   [junit4]   2> 831840 INFO  (zkConne

[...truncated too long message...]

t4]   2> 47981 INFO  (jetty-closer-1053-thread-4) [     ] o.e.j.s.h.ContextHandler Stopped o.e.j.s.ServletContextHandler@68c22ab9{/solr,null,UNAVAILABLE}
   [junit4]   2> 47981 INFO  (jetty-closer-1053-thread-4) [     ] o.e.j.s.session node0 Stopped scavenging
   [junit4]   2> 48081 INFO  (jetty-closer-1053-thread-2) [     ] o.e.j.s.AbstractConnector Stopped ServerConnector@636224b7{HTTP/1.1,[http/1.1, h2c]}{127.0.0.1:0}
   [junit4]   2> 48081 INFO  (jetty-closer-1053-thread-2) [     ] o.e.j.s.h.ContextHandler Stopped o.e.j.s.ServletContextHandler@5a790267{/solr,null,UNAVAILABLE}
   [junit4]   2> 48081 INFO  (jetty-closer-1053-thread-2) [     ] o.e.j.s.session node0 Stopped scavenging
   [junit4]   2> 48181 INFO  (jetty-closer-1053-thread-3) [     ] o.e.j.s.AbstractConnector Stopped ServerConnector@7f064e37{HTTP/1.1,[http/1.1, h2c]}{127.0.0.1:0}
   [junit4]   2> 48181 INFO  (jetty-closer-1053-thread-3) [     ] o.e.j.s.h.ContextHandler Stopped o.e.j.s.ServletContextHandler@3adabbb4{/solr,null,UNAVAILABLE}
   [junit4]   2> 48181 INFO  (jetty-closer-1053-thread-3) [     ] o.e.j.s.session node0 Stopped scavenging
   [junit4]   2> 48380 INFO  (jetty-closer-1053-thread-1) [     ] o.a.s.c.Overseer Overseer (id=72274113008631818-127.0.0.1:42075_solr-n_0000000000) closing
   [junit4]   2> 48381 INFO  (jetty-closer-1053-thread-1) [     ] o.e.j.s.AbstractConnector Stopped ServerConnector@5d8a215a{HTTP/1.1,[http/1.1, h2c]}{127.0.0.1:0}
   [junit4]   2> 48381 INFO  (jetty-closer-1053-thread-1) [     ] o.e.j.s.h.ContextHandler Stopped o.e.j.s.ServletContextHandler@6319d5d4{/solr,null,UNAVAILABLE}
   [junit4]   2> 48381 INFO  (jetty-closer-1053-thread-1) [     ] o.e.j.s.session node0 Stopped scavenging
   [junit4]   2> 48381 INFO  (TEST-TestPackages.testPluginFrompackage-seed#[5DF91F058ABC2679]) [     ] o.a.s.c.ZkTestServer Shutting down ZkTestServer.
   [junit4]   2> 48584 WARN  (ZkTestServer Run Thread) [     ] o.a.s.c.ZkTestServer Watch limit violations: 
   [junit4]   2> Maximum concurrent create/delete watches above limit:
   [junit4]   2> 
   [junit4]   2> 	10	/solr/aliases.json
   [junit4]   2> 	9	/solr/clusterprops.json
   [junit4]   2> 	6	/solr/collections/globalLoaderColl/state.json
   [junit4]   2> 	4	/solr/security.json
   [junit4]   2> 	4	/solr/configs/conf
   [junit4]   2> 	3	/solr/collections/globalLoaderColl/terms/shard2
   [junit4]   2> 	3	/solr/collections/globalLoaderColl/terms/shard1
   [junit4]   2> 
   [junit4]   2> Maximum concurrent data watches above limit:
   [junit4]   2> 
   [junit4]   2> 	19	/solr/collections/globalLoaderColl/state.json
   [junit4]   2> 	10	/solr/aliases.json
   [junit4]   2> 	10	/solr/clusterstate.json
   [junit4]   2> 	10	/solr/clusterprops.json
   [junit4]   2> 
   [junit4]   2> Maximum concurrent children watches above limit:
   [junit4]   2> 
   [junit4]   2> 	33	/solr/live_nodes
   [junit4]   2> 	29	/solr/collections
   [junit4]   2> 	24	/solr/overseer/queue
   [junit4]   2> 	8	/solr/overseer/collection-queue-work
   [junit4]   2> 
   [junit4]   2> 48585 INFO  (TEST-TestPackages.testPluginFrompackage-seed#[5DF91F058ABC2679]) [     ] o.a.s.c.ZkTestServer waitForServerDown: 127.0.0.1:44683
   [junit4]   2> 48585 INFO  (TEST-TestPackages.testPluginFrompackage-seed#[5DF91F058ABC2679]) [     ] o.a.s.c.ZkTestServer parse host and port list: 127.0.0.1:44683
   [junit4]   2> 48585 INFO  (TEST-TestPackages.testPluginFrompackage-seed#[5DF91F058ABC2679]) [     ] o.a.s.c.ZkTestServer connecting to 127.0.0.1 44683
   [junit4]   2> 48585 INFO  (TEST-TestPackages.testPluginFrompackage-seed#[5DF91F058ABC2679]) [     ] o.a.s.SolrTestCaseJ4 ###Ending testPluginFrompackage
   [junit4]   2> NOTE: reproduce with: ant test  -Dtestcase=TestPackages -Dtests.method=testPluginFrompackage -Dtests.seed=5DF91F058ABC2679 -Dtests.multiplier=3 -Dtests.slow=true -Dtests.badapples=true -Dtests.locale=ii -Dtests.timezone=PST8PDT -Dtests.asserts=true -Dtests.file.encoding=UTF-8
   [junit4] FAILURE 5.30s J0 | TestPackages.testPluginFrompackage <<<
   [junit4]    > Throwable #1: java.lang.AssertionError: req: org.apache.solr.handler.TestPackages$$Lambda$543/0x0000000800fa8c40@28715206 . attempt: 9 Mismatch for value : '[config, queryResponseWriter, json1, _packageinfo_, file, id]' in response , {
   [junit4]    >   "responseHeader":{
   [junit4]    >     "status":0,
   [junit4]    >     "QTime":0},
   [junit4]    >   "config":{"queryResponseWriter":{"json1":{
   [junit4]    >         "name":"json1",
   [junit4]    >         "class":"org.apache.solr.core.RuntimeLibResponseWriter",
   [junit4]    >         "package":"global"}}}}
   [junit4]    > 	at __randomizedtesting.SeedInfo.seed([5DF91F058ABC2679:88A3F8711D136487]:0)
   [junit4]    > 	at org.apache.solr.handler.TestPackages.assertResponseValues(TestPackages.java:130)
   [junit4]    > 	at org.apache.solr.handler.TestPackages.assertResponseValues(TestPackages.java:101)
   [junit4]    > 	at org.apache.solr.handler.TestPackages.testPluginFrompackage(TestPackages.java:489)
   [junit4]    > 	at java.base/jdk.internal.reflect.NativeMethodAccessorImpl.invoke0(Native Method)
   [junit4]    > 	at java.base/jdk.internal.reflect.NativeMethodAccessorImpl.invoke(NativeMethodAccessorImpl.java:62)
   [junit4]    > 	at java.base/jdk.internal.reflect.DelegatingMethodAccessorImpl.invoke(DelegatingMethodAccessorImpl.java:43)
   [junit4]    > 	at java.base/java.lang.reflect.Method.invoke(Method.java:564)
   [junit4]    > 	at java.base/java.lang.Thread.run(Thread.java:830)
   [junit4]   2> 48586 INFO  (SUITE-TestPackages-seed#[5DF91F058ABC2679]-worker) [     ] o.a.s.c.ZkTestServer Shutting down ZkTestServer.
   [junit4]   2> 48586 INFO  (SUITE-TestPackages-seed#[5DF91F058ABC2679]-worker) [     ] o.a.s.c.ZkTestServer waitForServerDown: 127.0.0.1:44683
   [junit4]   2> 48586 INFO  (SUITE-TestPackages-seed#[5DF91F058ABC2679]-worker) [     ] o.a.s.c.ZkTestServer parse host and port list: 127.0.0.1:44683
   [junit4]   2> 48586 INFO  (SUITE-TestPackages-seed#[5DF91F058ABC2679]-worker) [     ] o.a.s.c.ZkTestServer connecting to 127.0.0.1 44683
   [junit4]   2> NOTE: leaving temporary files on disk at: /home/jenkins/workspace/Lucene-Solr-SOLR-13661-Linux/solr/build/solr-core/test/J0/temp/solr.handler.TestPackages_5DF91F058ABC2679-002
   [junit4]   2> Oct 08, 2019 8:28:01 PM com.carrotsearch.randomizedtesting.ThreadLeakControl checkThreadLeaks
   [junit4]   2> WARNING: Will linger awaiting termination of 8 leaked thread(s).
   [junit4]   2> NOTE: test params are: codec=Asserting(Lucene80), sim=Asserting(org.apache.lucene.search.similarities.AssertingSimilarity@71316e20), locale=ii, timezone=PST8PDT
   [junit4]   2> NOTE: Linux 5.0.0-25-generic amd64/Oracle Corporation 14-ea (64-bit)/cpus=8,threads=1,free=400909560,total=518979584
   [junit4]   2> NOTE: All tests run in this JVM: [TestPackages, TestPackages]
   [junit4] Completed [5/5 (4!)] on J0 in 23.29s, 6 tests, 1 failure, 1 skipped <<< FAILURES!

[...truncated 1 lines...]
   [junit4] JVM J1: stderr was not empty, see: /home/jenkins/workspace/Lucene-Solr-SOLR-13661-Linux/solr/build/solr-core/test/temp/junit4-J1-20191008_202711_84015875251841654830898.syserr
   [junit4] >>> JVM J1 emitted unexpected output (verbatim) ----
   [junit4] OpenJDK 64-Bit Server VM warning: Option UseConcMarkSweepGC was deprecated in version 9.0 and will likely be removed in a future release.
   [junit4] <<< JVM J1: EOF ----

   [junit4] JVM J0: stderr was not empty, see: /home/jenkins/workspace/Lucene-Solr-SOLR-13661-Linux/solr/build/solr-core/test/temp/junit4-J0-20191008_202711_8403366001026235485878.syserr
   [junit4] >>> JVM J0 emitted unexpected output (verbatim) ----
   [junit4] OpenJDK 64-Bit Server VM warning: Option UseConcMarkSweepGC was deprecated in version 9.0 and will likely be removed in a future release.
   [junit4] <<< JVM J0: EOF ----

[...truncated 13 lines...]
BUILD FAILED
/home/jenkins/workspace/Lucene-Solr-SOLR-13661-Linux/lucene/common-build.xml:1492: The following error occurred while executing this line:
/home/jenkins/workspace/Lucene-Solr-SOLR-13661-Linux/lucene/common-build.xml:1019: There were test failures: 5 suites, 30 tests, 4 failures, 5 ignored (5 assumptions) [seed: 5DF91F058ABC2679]

Total time: 57 seconds

[repro] Setting last failure code to 256

[repro] Failures:
[repro]   4/5 failed: org.apache.solr.handler.TestPackages
[repro] Exiting with code 256
+ mv lucene/build lucene/build.repro
+ mv solr/build solr/build.repro
+ mv lucene/build.orig lucene/build
+ mv solr/build.orig solr/build
Archiving artifacts
Setting ANT_1_8_2_HOME=/home/jenkins/tools/hudson.tasks.Ant_AntInstallation/ANT_1.8.2
[WARNINGS] Parsing warnings in console log with parser Java Compiler (javac)
Setting ANT_1_8_2_HOME=/home/jenkins/tools/hudson.tasks.Ant_AntInstallation/ANT_1.8.2
No credentials specified
Setting ANT_1_8_2_HOME=/home/jenkins/tools/hudson.tasks.Ant_AntInstallation/ANT_1.8.2
<Git Blamer> Using GitBlamer to create author and commit information for all warnings.
<Git Blamer> GIT_COMMIT=f664c92e1d47ca99c8b161eba7519d7fcab0402c, workspace=/home/jenkins/workspace/Lucene-Solr-SOLR-13661-Linux
[WARNINGS] Computing warning deltas based on reference build #4
Recording test results
Setting ANT_1_8_2_HOME=/home/jenkins/tools/hudson.tasks.Ant_AntInstallation/ANT_1.8.2
Build step 'Publish JUnit test result report' changed build result to UNSTABLE
Email was triggered for: Unstable (Test Failures)
Sending email for trigger: Unstable (Test Failures)
Setting ANT_1_8_2_HOME=/home/jenkins/tools/hudson.tasks.Ant_AntInstallation/ANT_1.8.2
Setting ANT_1_8_2_HOME=/home/jenkins/tools/hudson.tasks.Ant_AntInstallation/ANT_1.8.2
Setting ANT_1_8_2_HOME=/home/jenkins/tools/hudson.tasks.Ant_AntInstallation/ANT_1.8.2
Setting ANT_1_8_2_HOME=/home/jenkins/tools/hudson.tasks.Ant_AntInstallation/ANT_1.8.2
Setting ANT_1_8_2_HOME=/home/jenkins/tools/hudson.tasks.Ant_AntInstallation/ANT_1.8.2
Setting ANT_1_8_2_HOME=/home/jenkins/tools/hudson.tasks.Ant_AntInstallation/ANT_1.8.2