You are viewing a plain text version of this content. The canonical link for it is here.
Posted to commits@beam.apache.org by Apache Jenkins Server <je...@builds.apache.org> on 2018/06/22 12:05:10 UTC
Build failed in Jenkins: beam_PerformanceTests_HadoopInputFormat
#425
See <https://builds.apache.org/job/beam_PerformanceTests_HadoopInputFormat/425/display/redirect>
------------------------------------------
[...truncated 61.59 KB...]
:spotlessCheck (Thread[Task worker for ':buildSrc' Thread 5,5,main]) completed. Took 0.0 secs.
:compileTestJava (Thread[Task worker for ':buildSrc' Thread 5,5,main]) started.
> Task :buildSrc:compileTestJava NO-SOURCE
file or directory '<https://builds.apache.org/job/beam_PerformanceTests_HadoopInputFormat/ws/src/buildSrc/src/test/java',> not found
Skipping task ':buildSrc:compileTestJava' as it has no source files and no previous output files.
:compileTestJava (Thread[Task worker for ':buildSrc' Thread 5,5,main]) completed. Took 0.001 secs.
:compileTestGroovy (Thread[Task worker for ':buildSrc' Thread 5,5,main]) started.
> Task :buildSrc:compileTestGroovy NO-SOURCE
file or directory '<https://builds.apache.org/job/beam_PerformanceTests_HadoopInputFormat/ws/src/buildSrc/src/test/groovy',> not found
Skipping task ':buildSrc:compileTestGroovy' as it has no source files and no previous output files.
:compileTestGroovy (Thread[Task worker for ':buildSrc' Thread 5,5,main]) completed. Took 0.001 secs.
:processTestResources (Thread[Task worker for ':buildSrc' Thread 5,5,main]) started.
> Task :buildSrc:processTestResources NO-SOURCE
file or directory '<https://builds.apache.org/job/beam_PerformanceTests_HadoopInputFormat/ws/src/buildSrc/src/test/resources',> not found
Skipping task ':buildSrc:processTestResources' as it has no source files and no previous output files.
:processTestResources (Thread[Task worker for ':buildSrc' Thread 5,5,main]) completed. Took 0.0 secs.
:testClasses (Thread[Task worker for ':buildSrc' Thread 9,5,main]) started.
> Task :buildSrc:testClasses UP-TO-DATE
Skipping task ':buildSrc:testClasses' as it has no actions.
:testClasses (Thread[Task worker for ':buildSrc' Thread 9,5,main]) completed. Took 0.0 secs.
:test (Thread[Task worker for ':buildSrc' Thread 9,5,main]) started.
> Task :buildSrc:test NO-SOURCE
Skipping task ':buildSrc:test' as it has no source files and no previous output files.
:test (Thread[Task worker for ':buildSrc' Thread 9,5,main]) completed. Took 0.001 secs.
:check (Thread[Task worker for ':buildSrc' Thread 9,5,main]) started.
> Task :buildSrc:check UP-TO-DATE
Skipping task ':buildSrc:check' as it has no actions.
:check (Thread[Task worker for ':buildSrc' Thread 9,5,main]) completed. Took 0.0 secs.
:build (Thread[Task worker for ':buildSrc' Thread 9,5,main]) started.
> Task :buildSrc:build UP-TO-DATE
Skipping task ':buildSrc:build' as it has no actions.
:build (Thread[Task worker for ':buildSrc' Thread 9,5,main]) completed. Took 0.0 secs.
Settings evaluated using settings file '<https://builds.apache.org/job/beam_PerformanceTests_HadoopInputFormat/ws/src/settings.gradle'.>
Using local directory build cache for the root build (location = /home/jenkins/.gradle/caches/build-cache-1, removeUnusedEntriesAfter = 7 days).
Projects loaded. Root project using build file '<https://builds.apache.org/job/beam_PerformanceTests_HadoopInputFormat/ws/src/build.gradle'.>
Included projects: [root project 'beam', project ':beam-examples-java', project ':beam-model-fn-execution', project ':beam-model-job-management', project ':beam-model-pipeline', project ':beam-runners-apex', project ':beam-runners-core-construction-java', project ':beam-runners-core-java', project ':beam-runners-direct-java', project ':beam-runners-extensions-java-metrics', project ':beam-runners-flink_2.11', project ':beam-runners-gcp-gcemd', project ':beam-runners-gcp-gcsproxy', project ':beam-runners-gearpump', project ':beam-runners-google-cloud-dataflow-java', project ':beam-runners-java-fn-execution', project ':beam-runners-local-java-core', project ':beam-runners-reference-java', project ':beam-runners-spark', project ':beam-sdks-go', project ':beam-sdks-go-container', project ':beam-sdks-go-examples', project ':beam-sdks-go-test', project ':beam-sdks-java-build-tools', project ':beam-sdks-java-container', project ':beam-sdks-java-core', project ':beam-sdks-java-extensions-google-cloud-platform-core', project ':beam-sdks-java-extensions-join-library', project ':beam-sdks-java-extensions-json-jackson', project ':beam-sdks-java-extensions-protobuf', project ':beam-sdks-java-extensions-sketching', project ':beam-sdks-java-extensions-sorter', project ':beam-sdks-java-extensions-sql', project ':beam-sdks-java-extensions-sql-jdbc', project ':beam-sdks-java-fn-execution', project ':beam-sdks-java-harness', project ':beam-sdks-java-io-amazon-web-services', project ':beam-sdks-java-io-amqp', project ':beam-sdks-java-io-cassandra', project ':beam-sdks-java-io-common', project ':beam-sdks-java-io-elasticsearch', project ':beam-sdks-java-io-elasticsearch-tests-2', project ':beam-sdks-java-io-elasticsearch-tests-5', project ':beam-sdks-java-io-elasticsearch-tests-common', project ':beam-sdks-java-io-file-based-io-tests', project ':beam-sdks-java-io-google-cloud-platform', project ':beam-sdks-java-io-hadoop-common', project ':beam-sdks-java-io-hadoop-file-system', project ':beam-sdks-java-io-hadoop-input-format', project ':beam-sdks-java-io-hbase', project ':beam-sdks-java-io-hcatalog', project ':beam-sdks-java-io-jdbc', project ':beam-sdks-java-io-jms', project ':beam-sdks-java-io-kafka', project ':beam-sdks-java-io-kinesis', project ':beam-sdks-java-io-mongodb', project ':beam-sdks-java-io-mqtt', project ':beam-sdks-java-io-parquet', project ':beam-sdks-java-io-redis', project ':beam-sdks-java-io-solr', project ':beam-sdks-java-io-tika', project ':beam-sdks-java-io-xml', project ':beam-sdks-java-javadoc', project ':beam-sdks-java-maven-archetypes-examples', project ':beam-sdks-java-maven-archetypes-starter', project ':beam-sdks-java-nexmark', project ':beam-sdks-python', project ':beam-sdks-python-container', project ':release']
Parallel execution with configuration on demand is an incubating feature.
> Configure project :
Evaluating root project 'beam' using build file '<https://builds.apache.org/job/beam_PerformanceTests_HadoopInputFormat/ws/src/build.gradle'.>
Applying BeamModulePlugin to beam
Offline dependencies root configured at 'offline-repository'
createPerformanceTestHarness with default configuration for project beam
Adding 48 .gitignore exclusions to Apache Rat
> Configure project :beam-sdks-java-io-hadoop-input-format
Evaluating project ':beam-sdks-java-io-hadoop-input-format' using build file '<https://builds.apache.org/job/beam_PerformanceTests_HadoopInputFormat/ws/src/sdks/java/io/hadoop-input-format/build.gradle'.>
Applying BeamModulePlugin to beam-sdks-java-io-hadoop-input-format
Offline dependencies root configured at 'offline-repository'
applyJavaNature with [failOnWarning:true] for project beam-sdks-java-io-hadoop-input-format
provideIntegrationTestingDependencies with default configurationfor project beam-sdks-java-io-hadoop-input-format
Deprecated Gradle features were used in this build, making it incompatible with Gradle 5.0.
See https://docs.gradle.org/4.8/userguide/command_line_interface.html#sec:command_line_warnings
Publishing build scan...
https://gradle.com/s/uylrudltss7li
STDERR:
FAILURE: Build failed with an exception.
* Where:
Build file '<https://builds.apache.org/job/beam_PerformanceTests_HadoopInputFormat/ws/src/sdks/java/io/hadoop-input-format/build.gradle'> line: 21
* What went wrong:
A problem occurred evaluating project ':beam-sdks-java-io-hadoop-input-format'.
> Could not find method call() for arguments [{path=:beam-runners-google-cloud-dataflow-java, configuration=shadowTest}] on project ':beam-sdks-java-io-hadoop-input-format' of type org.gradle.api.Project.
* Try:
Run with --debug option to get more log output. Run with --scan to get full insights.
* Exception is:
org.gradle.api.GradleScriptException: A problem occurred evaluating project ':beam-sdks-java-io-hadoop-input-format'.
at org.gradle.groovy.scripts.internal.DefaultScriptRunnerFactory$ScriptRunnerImpl.run(DefaultScriptRunnerFactory.java:92)
at org.gradle.configuration.DefaultScriptPluginFactory$ScriptPluginImpl$2.run(DefaultScriptPluginFactory.java:204)
at org.gradle.configuration.ProjectScriptTarget.addConfiguration(ProjectScriptTarget.java:77)
at org.gradle.configuration.DefaultScriptPluginFactory$ScriptPluginImpl.apply(DefaultScriptPluginFactory.java:209)
at org.gradle.configuration.BuildOperationScriptPlugin$1.run(BuildOperationScriptPlugin.java:61)
at org.gradle.internal.operations.DefaultBuildOperationExecutor$RunnableBuildOperationWorker.execute(DefaultBuildOperationExecutor.java:317)
at org.gradle.internal.operations.DefaultBuildOperationExecutor$RunnableBuildOperationWorker.execute(DefaultBuildOperationExecutor.java:309)
at org.gradle.internal.operations.DefaultBuildOperationExecutor.execute(DefaultBuildOperationExecutor.java:185)
at org.gradle.internal.operations.DefaultBuildOperationExecutor.run(DefaultBuildOperationExecutor.java:97)
at org.gradle.internal.operations.DelegatingBuildOperationExecutor.run(DelegatingBuildOperationExecutor.java:31)
at org.gradle.configuration.BuildOperationScriptPlugin.apply(BuildOperationScriptPlugin.java:58)
at org.gradle.configuration.project.BuildScriptProcessor.execute(BuildScriptProcessor.java:41)
at org.gradle.configuration.project.BuildScriptProcessor.execute(BuildScriptProcessor.java:26)
at org.gradle.configuration.project.ConfigureActionsProjectEvaluator.evaluate(ConfigureActionsProjectEvaluator.java:34)
at org.gradle.configuration.project.LifecycleProjectEvaluator.doConfigure(LifecycleProjectEvaluator.java:66)
at org.gradle.configuration.project.LifecycleProjectEvaluator.access$100(LifecycleProjectEvaluator.java:37)
at org.gradle.configuration.project.LifecycleProjectEvaluator$ConfigureProject.run(LifecycleProjectEvaluator.java:125)
at org.gradle.internal.operations.DefaultBuildOperationExecutor$RunnableBuildOperationWorker.execute(DefaultBuildOperationExecutor.java:317)
at org.gradle.internal.operations.DefaultBuildOperationExecutor$RunnableBuildOperationWorker.execute(DefaultBuildOperationExecutor.java:309)
at org.gradle.internal.operations.DefaultBuildOperationExecutor.execute(DefaultBuildOperationExecutor.java:185)
at org.gradle.internal.operations.DefaultBuildOperationExecutor.run(DefaultBuildOperationExecutor.java:97)
at org.gradle.internal.operations.DelegatingBuildOperationExecutor.run(DelegatingBuildOperationExecutor.java:31)
at org.gradle.configuration.project.LifecycleProjectEvaluator.evaluate(LifecycleProjectEvaluator.java:52)
at org.gradle.api.internal.project.DefaultProject.evaluate(DefaultProject.java:677)
at org.gradle.api.internal.project.DefaultProject.evaluate(DefaultProject.java:138)
at org.gradle.execution.TaskPathProjectEvaluator.configure(TaskPathProjectEvaluator.java:35)
at org.gradle.execution.TaskPathProjectEvaluator.configureHierarchy(TaskPathProjectEvaluator.java:60)
at org.gradle.execution.TaskSelector.getSelection(TaskSelector.java:100)
at org.gradle.execution.TaskSelector.getSelection(TaskSelector.java:81)
at org.gradle.execution.commandline.CommandLineTaskParser.parseTasks(CommandLineTaskParser.java:42)
at org.gradle.execution.TaskNameResolvingBuildConfigurationAction.configure(TaskNameResolvingBuildConfigurationAction.java:44)
at org.gradle.execution.DefaultBuildConfigurationActionExecuter.configure(DefaultBuildConfigurationActionExecuter.java:48)
at org.gradle.execution.DefaultBuildConfigurationActionExecuter.access$000(DefaultBuildConfigurationActionExecuter.java:25)
at org.gradle.execution.DefaultBuildConfigurationActionExecuter$1.proceed(DefaultBuildConfigurationActionExecuter.java:54)
at org.gradle.execution.DefaultTasksBuildExecutionAction.configure(DefaultTasksBuildExecutionAction.java:44)
at org.gradle.execution.DefaultBuildConfigurationActionExecuter.configure(DefaultBuildConfigurationActionExecuter.java:48)
at org.gradle.execution.DefaultBuildConfigurationActionExecuter.access$000(DefaultBuildConfigurationActionExecuter.java:25)
at org.gradle.execution.DefaultBuildConfigurationActionExecuter$1.proceed(DefaultBuildConfigurationActionExecuter.java:54)
at org.gradle.execution.ExcludedTaskFilteringBuildConfigurationAction.configure(ExcludedTaskFilteringBuildConfigurationAction.java:47)
at org.gradle.execution.DefaultBuildConfigurationActionExecuter.configure(DefaultBuildConfigurationActionExecuter.java:48)
at org.gradle.execution.DefaultBuildConfigurationActionExecuter.select(DefaultBuildConfigurationActionExecuter.java:36)
at org.gradle.initialization.DefaultGradleLauncher$CalculateTaskGraph.run(DefaultGradleLauncher.java:287)
at org.gradle.internal.operations.DefaultBuildOperationExecutor$RunnableBuildOperationWorker.execute(DefaultBuildOperationExecutor.java:317)
at org.gradle.internal.operations.DefaultBuildOperationExecutor$RunnableBuildOperationWorker.execute(DefaultBuildOperationExecutor.java:309)
at org.gradle.internal.operations.DefaultBuildOperationExecutor.execute(DefaultBuildOperationExecutor.java:185)
at org.gradle.internal.operations.DefaultBuildOperationExecutor.run(DefaultBuildOperationExecutor.java:97)
at org.gradle.internal.operations.DelegatingBuildOperationExecutor.run(DelegatingBuildOperationExecutor.java:31)
at org.gradle.initialization.DefaultGradleLauncher.constructTaskGraph(DefaultGradleLauncher.java:183)
at org.gradle.initialization.DefaultGradleLauncher.doBuildStages(DefaultGradleLauncher.java:136)
at org.gradle.initialization.DefaultGradleLauncher.executeTasks(DefaultGradleLauncher.java:115)
at org.gradle.internal.invocation.GradleBuildController$1.call(GradleBuildController.java:77)
at org.gradle.internal.invocation.GradleBuildController$1.call(GradleBuildController.java:74)
at org.gradle.internal.work.DefaultWorkerLeaseService.withLocks(DefaultWorkerLeaseService.java:152)
at org.gradle.internal.work.StopShieldingWorkerLeaseService.withLocks(StopShieldingWorkerLeaseService.java:38)
at org.gradle.internal.invocation.GradleBuildController.doBuild(GradleBuildController.java:96)
at org.gradle.internal.invocation.GradleBuildController.run(GradleBuildController.java:74)
at org.gradle.tooling.internal.provider.ExecuteBuildActionRunner.run(ExecuteBuildActionRunner.java:28)
at org.gradle.launcher.exec.ChainingBuildActionRunner.run(ChainingBuildActionRunner.java:35)
at org.gradle.tooling.internal.provider.ValidatingBuildActionRunner.run(ValidatingBuildActionRunner.java:32)
at org.gradle.launcher.exec.RunAsBuildOperationBuildActionRunner$3.run(RunAsBuildOperationBuildActionRunner.java:47)
at org.gradle.internal.operations.DefaultBuildOperationExecutor$RunnableBuildOperationWorker.execute(DefaultBuildOperationExecutor.java:317)
at org.gradle.internal.operations.DefaultBuildOperationExecutor$RunnableBuildOperationWorker.execute(DefaultBuildOperationExecutor.java:309)
at org.gradle.internal.operations.DefaultBuildOperationExecutor.execute(DefaultBuildOperationExecutor.java:185)
at org.gradle.internal.operations.DefaultBuildOperationExecutor.run(DefaultBuildOperationExecutor.java:97)
at org.gradle.internal.operations.DelegatingBuildOperationExecutor.run(DelegatingBuildOperationExecutor.java:31)
at org.gradle.launcher.exec.RunAsBuildOperationBuildActionRunner.run(RunAsBuildOperationBuildActionRunner.java:43)
at org.gradle.tooling.internal.provider.SubscribableBuildActionRunner.run(SubscribableBuildActionRunner.java:51)
at org.gradle.launcher.exec.InProcessBuildActionExecuter$1.transform(InProcessBuildActionExecuter.java:50)
at org.gradle.launcher.exec.InProcessBuildActionExecuter$1.transform(InProcessBuildActionExecuter.java:46)
at org.gradle.composite.internal.DefaultRootBuildState.run(DefaultRootBuildState.java:65)
at org.gradle.launcher.exec.InProcessBuildActionExecuter.execute(InProcessBuildActionExecuter.java:46)
at org.gradle.launcher.exec.InProcessBuildActionExecuter.execute(InProcessBuildActionExecuter.java:32)
at org.gradle.launcher.exec.BuildTreeScopeBuildActionExecuter.execute(BuildTreeScopeBuildActionExecuter.java:39)
at org.gradle.launcher.exec.BuildTreeScopeBuildActionExecuter.execute(BuildTreeScopeBuildActionExecuter.java:25)
at org.gradle.tooling.internal.provider.ContinuousBuildActionExecuter.execute(ContinuousBuildActionExecuter.java:80)
at org.gradle.tooling.internal.provider.ContinuousBuildActionExecuter.execute(ContinuousBuildActionExecuter.java:53)
at org.gradle.tooling.internal.provider.ServicesSetupBuildActionExecuter.execute(ServicesSetupBuildActionExecuter.java:62)
at org.gradle.tooling.internal.provider.ServicesSetupBuildActionExecuter.execute(ServicesSetupBuildActionExecuter.java:34)
at org.gradle.tooling.internal.provider.GradleThreadBuildActionExecuter.execute(GradleThreadBuildActionExecuter.java:36)
at org.gradle.tooling.internal.provider.GradleThreadBuildActionExecuter.execute(GradleThreadBuildActionExecuter.java:25)
at org.gradle.tooling.internal.provider.ParallelismConfigurationBuildActionExecuter.execute(ParallelismConfigurationBuildActionExecuter.java:43)
at org.gradle.tooling.internal.provider.ParallelismConfigurationBuildActionExecuter.execute(ParallelismConfigurationBuildActionExecuter.java:29)
at org.gradle.tooling.internal.provider.StartParamsValidatingActionExecuter.execute(StartParamsValidatingActionExecuter.java:59)
at org.gradle.tooling.internal.provider.StartParamsValidatingActionExecuter.execute(StartParamsValidatingActionExecuter.java:31)
at org.gradle.tooling.internal.provider.SessionFailureReportingActionExecuter.execute(SessionFailureReportingActionExecuter.java:59)
at org.gradle.tooling.internal.provider.SessionFailureReportingActionExecuter.execute(SessionFailureReportingActionExecuter.java:44)
at org.gradle.tooling.internal.provider.SetupLoggingActionExecuter.execute(SetupLoggingActionExecuter.java:46)
at org.gradle.tooling.internal.provider.SetupLoggingActionExecuter.execute(SetupLoggingActionExecuter.java:30)
at org.gradle.launcher.cli.RunBuildAction.run(RunBuildAction.java:52)
at org.gradle.internal.Actions$RunnableActionAdapter.execute(Actions.java:173)
at org.gradle.launcher.cli.CommandLineActionFactory$ParseAndBuildAction.execute(CommandLineActionFactory.java:379)
at org.gradle.launcher.cli.CommandLineActionFactory$ParseAndBuildAction.execute(CommandLineActionFactory.java:352)
at org.gradle.launcher.cli.ExceptionReportingAction.execute(ExceptionReportingAction.java:37)
at org.gradle.launcher.cli.ExceptionReportingAction.execute(ExceptionReportingAction.java:23)
at org.gradle.launcher.cli.CommandLineActionFactory$WithLogging.execute(CommandLineActionFactory.java:345)
at org.gradle.launcher.cli.CommandLineActionFactory$WithLogging.execute(CommandLineActionFactory.java:275)
at org.gradle.launcher.Main.doAction(Main.java:36)
at org.gradle.launcher.bootstrap.EntryPoint.run(EntryPoint.java:45)
at org.gradle.launcher.bootstrap.ProcessBootstrap.runNoExit(ProcessBootstrap.java:60)
at org.gradle.launcher.bootstrap.ProcessBootstrap.run(ProcessBootstrap.java:37)
at org.gradle.launcher.GradleMain.main(GradleMain.java:23)
at org.gradle.wrapper.BootstrapMainStarter.start(BootstrapMainStarter.java:31)
at org.gradle.wrapper.WrapperExecutor.execute(WrapperExecutor.java:108)
at org.gradle.wrapper.GradleWrapperMain.main(GradleWrapperMain.java:61)
Caused by: org.gradle.internal.metaobject.AbstractDynamicObject$CustomMessageMissingMethodException: Could not find method call() for arguments [{path=:beam-runners-google-cloud-dataflow-java, configuration=shadowTest}] on project ':beam-sdks-java-io-hadoop-input-format' of type org.gradle.api.Project.
at org.gradle.internal.metaobject.AbstractDynamicObject.methodMissingException(AbstractDynamicObject.java:179)
at org.gradle.internal.metaobject.AbstractDynamicObject.invokeMethod(AbstractDynamicObject.java:164)
at org.gradle.api.internal.project.DefaultProject_Decorated.invokeMethod(Unknown Source)
at org.apache.beam.gradle.BeamModulePlugin$_apply_closure8$_closure108.doCall(BeamModulePlugin.groovy:1080)
at org.gradle.api.internal.ClosureBackedAction.execute(ClosureBackedAction.java:71)
at org.gradle.util.ConfigureUtil.configureTarget(ConfigureUtil.java:155)
at org.gradle.util.ConfigureUtil.configure(ConfigureUtil.java:106)
at org.gradle.api.internal.project.DefaultProject.dependencies(DefaultProject.java:1172)
at org.gradle.api.Project$dependencies$4.call(Unknown Source)
at org.apache.beam.gradle.BeamModulePlugin$_apply_closure8.doCall(BeamModulePlugin.groovy:1073)
at org.apache.beam.gradle.BeamModulePlugin$_apply_closure8.doCall(BeamModulePlugin.groovy)
at org.gradle.internal.metaobject.BeanDynamicObject$MetaClassAdapter.invokeMethod(BeanDynamicObject.java:479)
at org.gradle.internal.metaobject.BeanDynamicObject.tryInvokeMethod(BeanDynamicObject.java:191)
at org.gradle.internal.metaobject.MixInClosurePropertiesAsMethodsDynamicObject.tryInvokeMethod(MixInClosurePropertiesAsMethodsDynamicObject.java:42)
at org.gradle.groovy.scripts.BasicScript$ScriptDynamicObject.tryInvokeMethod(BasicScript.java:134)
at org.gradle.internal.metaobject.AbstractDynamicObject.invokeMethod(AbstractDynamicObject.java:160)
at org.gradle.groovy.scripts.BasicScript.invokeMethod(BasicScript.java:83)
at build_4ctihzzyeexfq4mnhkzmammw8.run(<https://builds.apache.org/job/beam_PerformanceTests_HadoopInputFormat/ws/src/sdks/java/io/hadoop-input-format/build.gradle>:21)
at org.gradle.groovy.scripts.internal.DefaultScriptRunnerFactory$ScriptRunnerImpl.run(DefaultScriptRunnerFactory.java:90)
... 103 more
* Get more help at https://help.gradle.org
BUILD FAILED in 5s
2018-06-22 12:05:08,640 e6b4435e MainThread beam_integration_benchmark(1/1) ERROR Error during benchmark beam_integration_benchmark
Traceback (most recent call last):
File "<https://builds.apache.org/job/beam_PerformanceTests_HadoopInputFormat/ws/PerfKitBenchmarker/perfkitbenchmarker/pkb.py",> line 667, in RunBenchmark
DoRunPhase(spec, collector, detailed_timer)
File "<https://builds.apache.org/job/beam_PerformanceTests_HadoopInputFormat/ws/PerfKitBenchmarker/perfkitbenchmarker/pkb.py",> line 547, in DoRunPhase
samples = spec.BenchmarkRun(spec)
File "<https://builds.apache.org/job/beam_PerformanceTests_HadoopInputFormat/ws/PerfKitBenchmarker/perfkitbenchmarker/linux_benchmarks/beam_integration_benchmark.py",> line 159, in Run
job_type=job_type)
File "<https://builds.apache.org/job/beam_PerformanceTests_HadoopInputFormat/ws/PerfKitBenchmarker/perfkitbenchmarker/providers/gcp/gcp_dpb_dataflow.py",> line 90, in SubmitJob
assert retcode == 0, "Integration Test Failed."
AssertionError: Integration Test Failed.
2018-06-22 12:05:08,641 e6b4435e MainThread beam_integration_benchmark(1/1) INFO Cleaning up benchmark beam_integration_benchmark
2018-06-22 12:05:08,642 e6b4435e MainThread beam_integration_benchmark(1/1) INFO Running: kubectl --kubeconfig=<https://builds.apache.org/job/beam_PerformanceTests_HadoopInputFormat/ws/config-beam-performancetests-hadoopinputformat-425> delete -f <https://builds.apache.org/job/beam_PerformanceTests_HadoopInputFormat/ws/src/.test-infra/kubernetes/postgres/postgres-service-for-local-dev.yml> --ignore-not-found
2018-06-22 12:05:08,999 e6b4435e MainThread beam_integration_benchmark(1/1) ERROR Exception running benchmark
Traceback (most recent call last):
File "<https://builds.apache.org/job/beam_PerformanceTests_HadoopInputFormat/ws/PerfKitBenchmarker/perfkitbenchmarker/pkb.py",> line 801, in RunBenchmarkTask
RunBenchmark(spec, collector)
File "<https://builds.apache.org/job/beam_PerformanceTests_HadoopInputFormat/ws/PerfKitBenchmarker/perfkitbenchmarker/pkb.py",> line 667, in RunBenchmark
DoRunPhase(spec, collector, detailed_timer)
File "<https://builds.apache.org/job/beam_PerformanceTests_HadoopInputFormat/ws/PerfKitBenchmarker/perfkitbenchmarker/pkb.py",> line 547, in DoRunPhase
samples = spec.BenchmarkRun(spec)
File "<https://builds.apache.org/job/beam_PerformanceTests_HadoopInputFormat/ws/PerfKitBenchmarker/perfkitbenchmarker/linux_benchmarks/beam_integration_benchmark.py",> line 159, in Run
job_type=job_type)
File "<https://builds.apache.org/job/beam_PerformanceTests_HadoopInputFormat/ws/PerfKitBenchmarker/perfkitbenchmarker/providers/gcp/gcp_dpb_dataflow.py",> line 90, in SubmitJob
assert retcode == 0, "Integration Test Failed."
AssertionError: Integration Test Failed.
2018-06-22 12:05:08,999 e6b4435e MainThread beam_integration_benchmark(1/1) ERROR Benchmark 1/1 beam_integration_benchmark (UID: beam_integration_benchmark0) failed. Execution will continue.
2018-06-22 12:05:09,009 e6b4435e MainThread INFO Benchmark run statuses:
---------------------------------------------------------------------------------
Name UID Status Failed Substatus
---------------------------------------------------------------------------------
beam_integration_benchmark beam_integration_benchmark0 FAILED
---------------------------------------------------------------------------------
Success rate: 0.00% (0/1)
2018-06-22 12:05:09,010 e6b4435e MainThread INFO Complete logs can be found at: <https://builds.apache.org/job/beam_PerformanceTests_HadoopInputFormat/ws/runs/e6b4435e/pkb.log>
2018-06-22 12:05:09,010 e6b4435e MainThread INFO Completion statuses can be found at: <https://builds.apache.org/job/beam_PerformanceTests_HadoopInputFormat/ws/runs/e6b4435e/completion_statuses.json>
Build step 'Execute shell' marked build as failure
Jenkins build is back to normal :
beam_PerformanceTests_HadoopInputFormat #426
Posted by Apache Jenkins Server <je...@builds.apache.org>.
See <https://builds.apache.org/job/beam_PerformanceTests_HadoopInputFormat/426/display/redirect?page=changes>