You are viewing a plain text version of this content. The canonical link for it is here.
Posted to builds@hbase.apache.org by Apache Jenkins Server <je...@builds.apache.org> on 2014/03/14 03:43:42 UTC
Build failed in Jenkins: HBase-0.94-security #440
See <https://builds.apache.org/job/HBase-0.94-security/440/changes>
Changes:
[larsh] HBASE-10722 [0.94] HRegion.computeHDFSBlocksDistribution does not account for links and reference files.
------------------------------------------
[...truncated 20698 lines...]
Running org.apache.hadoop.hbase.rest.TestStatusResource
Tests run: 2, Failures: 0, Errors: 0, Skipped: 0, Time elapsed: 23.488 sec
Forking command line: /bin/sh -c cd <https://builds.apache.org/job/HBase-0.94-security/ws/trunk> && /home/jenkins/tools/java/jdk1.6.0_45-32/jre/bin/java -enableassertions -Xmx1900m -Djava.security.egd=file:/dev/./urandom -jar <https://builds.apache.org/job/HBase-0.94-security/ws/trunk/target/surefire/surefirebooter4547726448958474996.jar> <https://builds.apache.org/job/HBase-0.94-security/ws/trunk/target/surefire/surefire4386002344658110665tmp> <https://builds.apache.org/job/HBase-0.94-security/ws/trunk/target/surefire/surefire_1006125892036750604296tmp>
Running org.apache.hadoop.hbase.backup.TestHFileArchiving
Tests run: 5, Failures: 0, Errors: 0, Skipped: 0, Time elapsed: 258.088 sec
Forking command line: /bin/sh -c cd <https://builds.apache.org/job/HBase-0.94-security/ws/trunk> && /home/jenkins/tools/java/jdk1.6.0_45-32/jre/bin/java -enableassertions -Xmx1900m -Djava.security.egd=file:/dev/./urandom -jar <https://builds.apache.org/job/HBase-0.94-security/ws/trunk/target/surefire/surefirebooter6320584941547396702.jar> <https://builds.apache.org/job/HBase-0.94-security/ws/trunk/target/surefire/surefire7440762177431156021tmp> <https://builds.apache.org/job/HBase-0.94-security/ws/trunk/target/surefire/surefire_1018921897762349493200tmp>
Running org.apache.hadoop.hbase.rest.TestScannerResource
Tests run: 5, Failures: 0, Errors: 0, Skipped: 0, Time elapsed: 43.234 sec
Forking command line: /bin/sh -c cd <https://builds.apache.org/job/HBase-0.94-security/ws/trunk> && /home/jenkins/tools/java/jdk1.6.0_45-32/jre/bin/java -enableassertions -Xmx1900m -Djava.security.egd=file:/dev/./urandom -jar <https://builds.apache.org/job/HBase-0.94-security/ws/trunk/target/surefire/surefirebooter5941276677915015132.jar> <https://builds.apache.org/job/HBase-0.94-security/ws/trunk/target/surefire/surefire2071769363882277402tmp> <https://builds.apache.org/job/HBase-0.94-security/ws/trunk/target/surefire/surefire_102463270625464685682tmp>
Running org.apache.hadoop.hbase.rest.client.TestRemoteAdmin
Tests run: 5, Failures: 0, Errors: 0, Skipped: 0, Time elapsed: 56.36 sec
Forking command line: /bin/sh -c cd <https://builds.apache.org/job/HBase-0.94-security/ws/trunk> && /home/jenkins/tools/java/jdk1.6.0_45-32/jre/bin/java -enableassertions -Xmx1900m -Djava.security.egd=file:/dev/./urandom -jar <https://builds.apache.org/job/HBase-0.94-security/ws/trunk/target/surefire/surefirebooter1852916253656860328.jar> <https://builds.apache.org/job/HBase-0.94-security/ws/trunk/target/surefire/surefire6527426792239798131tmp> <https://builds.apache.org/job/HBase-0.94-security/ws/trunk/target/surefire/surefire_1038628866679753834701tmp>
Running org.apache.hadoop.hbase.rest.client.TestRemoteTable
Tests run: 9, Failures: 0, Errors: 0, Skipped: 0, Time elapsed: 107.536 sec
Forking command line: /bin/sh -c cd <https://builds.apache.org/job/HBase-0.94-security/ws/trunk> && /home/jenkins/tools/java/jdk1.6.0_45-32/jre/bin/java -enableassertions -Xmx1900m -Djava.security.egd=file:/dev/./urandom -jar <https://builds.apache.org/job/HBase-0.94-security/ws/trunk/target/surefire/surefirebooter1645244500134538157.jar> <https://builds.apache.org/job/HBase-0.94-security/ws/trunk/target/surefire/surefire7370588705195287655tmp> <https://builds.apache.org/job/HBase-0.94-security/ws/trunk/target/surefire/surefire_1041794884369354468565tmp>
Running org.apache.hadoop.hbase.rest.TestVersionResource
Tests run: 7, Failures: 0, Errors: 0, Skipped: 0, Time elapsed: 40.543 sec
Forking command line: /bin/sh -c cd <https://builds.apache.org/job/HBase-0.94-security/ws/trunk> && /home/jenkins/tools/java/jdk1.6.0_45-32/jre/bin/java -enableassertions -Xmx1900m -Djava.security.egd=file:/dev/./urandom -jar <https://builds.apache.org/job/HBase-0.94-security/ws/trunk/target/surefire/surefirebooter2745563549261014867.jar> <https://builds.apache.org/job/HBase-0.94-security/ws/trunk/target/surefire/surefire3479034685213855065tmp> <https://builds.apache.org/job/HBase-0.94-security/ws/trunk/target/surefire/surefire_1056178356533316948714tmp>
Running org.apache.hadoop.hbase.rest.TestScannersWithFilters
Tests run: 10, Failures: 0, Errors: 0, Skipped: 0, Time elapsed: 67.176 sec
Forking command line: /bin/sh -c cd <https://builds.apache.org/job/HBase-0.94-security/ws/trunk> && /home/jenkins/tools/java/jdk1.6.0_45-32/jre/bin/java -enableassertions -Xmx1900m -Djava.security.egd=file:/dev/./urandom -jar <https://builds.apache.org/job/HBase-0.94-security/ws/trunk/target/surefire/surefirebooter5086301633711517327.jar> <https://builds.apache.org/job/HBase-0.94-security/ws/trunk/target/surefire/surefire3098722493061406123tmp> <https://builds.apache.org/job/HBase-0.94-security/ws/trunk/target/surefire/surefire_1063100125098189770787tmp>
Running org.apache.hadoop.hbase.rest.TestTableResource
Tests run: 8, Failures: 0, Errors: 0, Skipped: 0, Time elapsed: 74.551 sec
Forking command line: /bin/sh -c cd <https://builds.apache.org/job/HBase-0.94-security/ws/trunk> && /home/jenkins/tools/java/jdk1.6.0_45-32/jre/bin/java -enableassertions -Xmx1900m -Djava.security.egd=file:/dev/./urandom -jar <https://builds.apache.org/job/HBase-0.94-security/ws/trunk/target/surefire/surefirebooter6556910078136088672.jar> <https://builds.apache.org/job/HBase-0.94-security/ws/trunk/target/surefire/surefire2872509504615352610tmp> <https://builds.apache.org/job/HBase-0.94-security/ws/trunk/target/surefire/surefire_1075207025262081175675tmp>
Running org.apache.hadoop.hbase.rest.TestRowResource
Tests run: 12, Failures: 0, Errors: 0, Skipped: 0, Time elapsed: 46.276 sec
Forking command line: /bin/sh -c cd <https://builds.apache.org/job/HBase-0.94-security/ws/trunk> && /home/jenkins/tools/java/jdk1.6.0_45-32/jre/bin/java -enableassertions -Xmx1900m -Djava.security.egd=file:/dev/./urandom -jar <https://builds.apache.org/job/HBase-0.94-security/ws/trunk/target/surefire/surefirebooter3253230558965847844.jar> <https://builds.apache.org/job/HBase-0.94-security/ws/trunk/target/surefire/surefire4390936179950439526tmp> <https://builds.apache.org/job/HBase-0.94-security/ws/trunk/target/surefire/surefire_1082732843792182928171tmp>
Running org.apache.hadoop.hbase.rest.TestMultiRowResource
Tests run: 3, Failures: 0, Errors: 0, Skipped: 0, Time elapsed: 28.085 sec
Forking command line: /bin/sh -c cd <https://builds.apache.org/job/HBase-0.94-security/ws/trunk> && /home/jenkins/tools/java/jdk1.6.0_45-32/jre/bin/java -enableassertions -Xmx1900m -Djava.security.egd=file:/dev/./urandom -jar <https://builds.apache.org/job/HBase-0.94-security/ws/trunk/target/surefire/surefirebooter7402708754079950249.jar> <https://builds.apache.org/job/HBase-0.94-security/ws/trunk/target/surefire/surefire4102450032700435327tmp> <https://builds.apache.org/job/HBase-0.94-security/ws/trunk/target/surefire/surefire_1098754283817747593799tmp>
Running org.apache.hadoop.hbase.coprocessor.TestWALObserver
Tests run: 3, Failures: 0, Errors: 0, Skipped: 0, Time elapsed: 34.592 sec
Forking command line: /bin/sh -c cd <https://builds.apache.org/job/HBase-0.94-security/ws/trunk> && /home/jenkins/tools/java/jdk1.6.0_45-32/jre/bin/java -enableassertions -Xmx1900m -Djava.security.egd=file:/dev/./urandom -jar <https://builds.apache.org/job/HBase-0.94-security/ws/trunk/target/surefire/surefirebooter3390200106588502362.jar> <https://builds.apache.org/job/HBase-0.94-security/ws/trunk/target/surefire/surefire6598035582296473354tmp> <https://builds.apache.org/job/HBase-0.94-security/ws/trunk/target/surefire/surefire_1102134294135814579409tmp>
Running org.apache.hadoop.hbase.coprocessor.TestOpenTableInCoprocessor
Tests run: 2, Failures: 0, Errors: 0, Skipped: 0, Time elapsed: 40.732 sec
Forking command line: /bin/sh -c cd <https://builds.apache.org/job/HBase-0.94-security/ws/trunk> && /home/jenkins/tools/java/jdk1.6.0_45-32/jre/bin/java -enableassertions -Xmx1900m -Djava.security.egd=file:/dev/./urandom -jar <https://builds.apache.org/job/HBase-0.94-security/ws/trunk/target/surefire/surefirebooter2461165844448213915.jar> <https://builds.apache.org/job/HBase-0.94-security/ws/trunk/target/surefire/surefire3356941819650787353tmp> <https://builds.apache.org/job/HBase-0.94-security/ws/trunk/target/surefire/surefire_1113956854484015448178tmp>
Running org.apache.hadoop.hbase.coprocessor.TestClassLoading
Tests run: 8, Failures: 0, Errors: 0, Skipped: 0, Time elapsed: 55.387 sec
Forking command line: /bin/sh -c cd <https://builds.apache.org/job/HBase-0.94-security/ws/trunk> && /home/jenkins/tools/java/jdk1.6.0_45-32/jre/bin/java -enableassertions -Xmx1900m -Djava.security.egd=file:/dev/./urandom -jar <https://builds.apache.org/job/HBase-0.94-security/ws/trunk/target/surefire/surefirebooter4875298408721399432.jar> <https://builds.apache.org/job/HBase-0.94-security/ws/trunk/target/surefire/surefire1743528815668732090tmp> <https://builds.apache.org/job/HBase-0.94-security/ws/trunk/target/surefire/surefire_1121484838175373016017tmp>
Running org.apache.hadoop.hbase.coprocessor.TestAggregateProtocol
Tests run: 45, Failures: 0, Errors: 0, Skipped: 0, Time elapsed: 31.504 sec
Forking command line: /bin/sh -c cd <https://builds.apache.org/job/HBase-0.94-security/ws/trunk> && /home/jenkins/tools/java/jdk1.6.0_45-32/jre/bin/java -enableassertions -Xmx1900m -Djava.security.egd=file:/dev/./urandom -jar <https://builds.apache.org/job/HBase-0.94-security/ws/trunk/target/surefire/surefirebooter7503701880565353879.jar> <https://builds.apache.org/job/HBase-0.94-security/ws/trunk/target/surefire/surefire3585205648741813547tmp> <https://builds.apache.org/job/HBase-0.94-security/ws/trunk/target/surefire/surefire_1132452177941466270975tmp>
Running org.apache.hadoop.hbase.coprocessor.example.TestZooKeeperScanPolicyObserver
Tests run: 1, Failures: 0, Errors: 0, Skipped: 0, Time elapsed: 29.347 sec
Forking command line: /bin/sh -c cd <https://builds.apache.org/job/HBase-0.94-security/ws/trunk> && /home/jenkins/tools/java/jdk1.6.0_45-32/jre/bin/java -enableassertions -Xmx1900m -Djava.security.egd=file:/dev/./urandom -jar <https://builds.apache.org/job/HBase-0.94-security/ws/trunk/target/surefire/surefirebooter6614837809477288974.jar> <https://builds.apache.org/job/HBase-0.94-security/ws/trunk/target/surefire/surefire2354851927247746959tmp> <https://builds.apache.org/job/HBase-0.94-security/ws/trunk/target/surefire/surefire_1141427622972341001366tmp>
Running org.apache.hadoop.hbase.coprocessor.TestCoprocessorEndpoint
Tests run: 4, Failures: 0, Errors: 0, Skipped: 1, Time elapsed: 44.432 sec
Forking command line: /bin/sh -c cd <https://builds.apache.org/job/HBase-0.94-security/ws/trunk> && /home/jenkins/tools/java/jdk1.6.0_45-32/jre/bin/java -enableassertions -Xmx1900m -Djava.security.egd=file:/dev/./urandom -jar <https://builds.apache.org/job/HBase-0.94-security/ws/trunk/target/surefire/surefirebooter6416645954070203880.jar> <https://builds.apache.org/job/HBase-0.94-security/ws/trunk/target/surefire/surefire2747827345196986956tmp> <https://builds.apache.org/job/HBase-0.94-security/ws/trunk/target/surefire/surefire_1155281396123843496511tmp>
Running org.apache.hadoop.hbase.coprocessor.example.TestBulkDeleteProtocol
Tests run: 8, Failures: 0, Errors: 0, Skipped: 0, Time elapsed: 76.387 sec
Forking command line: /bin/sh -c cd <https://builds.apache.org/job/HBase-0.94-security/ws/trunk> && /home/jenkins/tools/java/jdk1.6.0_45-32/jre/bin/java -enableassertions -Xmx1900m -Djava.security.egd=file:/dev/./urandom -jar <https://builds.apache.org/job/HBase-0.94-security/ws/trunk/target/surefire/surefirebooter3228684785722630831.jar> <https://builds.apache.org/job/HBase-0.94-security/ws/trunk/target/surefire/surefire796986145311554629tmp> <https://builds.apache.org/job/HBase-0.94-security/ws/trunk/target/surefire/surefire_1167800203844022582214tmp>
Running org.apache.hadoop.hbase.coprocessor.TestRegionObserverInterface
Tests run: 7, Failures: 0, Errors: 0, Skipped: 0, Time elapsed: 81.38 sec
Forking command line: /bin/sh -c cd <https://builds.apache.org/job/HBase-0.94-security/ws/trunk> && /home/jenkins/tools/java/jdk1.6.0_45-32/jre/bin/java -enableassertions -Xmx1900m -Djava.security.egd=file:/dev/./urandom -jar <https://builds.apache.org/job/HBase-0.94-security/ws/trunk/target/surefire/surefirebooter4814290723541326379.jar> <https://builds.apache.org/job/HBase-0.94-security/ws/trunk/target/surefire/surefire2901377594220103606tmp> <https://builds.apache.org/job/HBase-0.94-security/ws/trunk/target/surefire/surefire_1175147700641142453294tmp>
Running org.apache.hadoop.hbase.coprocessor.TestHTableWrapper
Tests run: 1, Failures: 0, Errors: 0, Skipped: 0, Time elapsed: 35.5 sec
Forking command line: /bin/sh -c cd <https://builds.apache.org/job/HBase-0.94-security/ws/trunk> && /home/jenkins/tools/java/jdk1.6.0_45-32/jre/bin/java -enableassertions -Xmx1900m -Djava.security.egd=file:/dev/./urandom -jar <https://builds.apache.org/job/HBase-0.94-security/ws/trunk/target/surefire/surefirebooter6105200653157892254.jar> <https://builds.apache.org/job/HBase-0.94-security/ws/trunk/target/surefire/surefire1970283482064771706tmp> <https://builds.apache.org/job/HBase-0.94-security/ws/trunk/target/surefire/surefire_1183876042732755849265tmp>
Running org.apache.hadoop.hbase.coprocessor.TestBigDecimalColumnInterpreter
Tests run: 38, Failures: 0, Errors: 0, Skipped: 0, Time elapsed: 39.094 sec
Forking command line: /bin/sh -c cd <https://builds.apache.org/job/HBase-0.94-security/ws/trunk> && /home/jenkins/tools/java/jdk1.6.0_45-32/jre/bin/java -enableassertions -Xmx1900m -Djava.security.egd=file:/dev/./urandom -jar <https://builds.apache.org/job/HBase-0.94-security/ws/trunk/target/surefire/surefirebooter8180740443415275966.jar> <https://builds.apache.org/job/HBase-0.94-security/ws/trunk/target/surefire/surefire465919403668230531tmp> <https://builds.apache.org/job/HBase-0.94-security/ws/trunk/target/surefire/surefire_1193389342778595605583tmp>
Running org.apache.hadoop.hbase.coprocessor.TestRegionObserverBypass
Tests run: 2, Failures: 0, Errors: 0, Skipped: 0, Time elapsed: 26.354 sec
Forking command line: /bin/sh -c cd <https://builds.apache.org/job/HBase-0.94-security/ws/trunk> && /home/jenkins/tools/java/jdk1.6.0_45-32/jre/bin/java -enableassertions -Xmx1900m -Djava.security.egd=file:/dev/./urandom -jar <https://builds.apache.org/job/HBase-0.94-security/ws/trunk/target/surefire/surefirebooter4914605885852664806.jar> <https://builds.apache.org/job/HBase-0.94-security/ws/trunk/target/surefire/surefire3469198125257508494tmp> <https://builds.apache.org/job/HBase-0.94-security/ws/trunk/target/surefire/surefire_1204196213938737711659tmp>
Running org.apache.hadoop.hbase.coprocessor.TestRegionServerCoprocessorExceptionWithRemove
Tests run: 1, Failures: 0, Errors: 0, Skipped: 0, Time elapsed: 41.986 sec
Forking command line: /bin/sh -c cd <https://builds.apache.org/job/HBase-0.94-security/ws/trunk> && /home/jenkins/tools/java/jdk1.6.0_45-32/jre/bin/java -enableassertions -Xmx1900m -Djava.security.egd=file:/dev/./urandom -jar <https://builds.apache.org/job/HBase-0.94-security/ws/trunk/target/surefire/surefirebooter7160826430556768554.jar> <https://builds.apache.org/job/HBase-0.94-security/ws/trunk/target/surefire/surefire7051790760803759676tmp> <https://builds.apache.org/job/HBase-0.94-security/ws/trunk/target/surefire/surefire_1212872133559944946526tmp>
Running org.apache.hadoop.hbase.coprocessor.TestRegionObserverScannerOpenHook
Tests run: 1, Failures: 0, Errors: 0, Skipped: 0, Time elapsed: 32.991 sec
Forking command line: /bin/sh -c cd <https://builds.apache.org/job/HBase-0.94-security/ws/trunk> && /home/jenkins/tools/java/jdk1.6.0_45-32/jre/bin/java -enableassertions -Xmx1900m -Djava.security.egd=file:/dev/./urandom -jar <https://builds.apache.org/job/HBase-0.94-security/ws/trunk/target/surefire/surefirebooter4919794603962884263.jar> <https://builds.apache.org/job/HBase-0.94-security/ws/trunk/target/surefire/surefire4557240723126873458tmp> <https://builds.apache.org/job/HBase-0.94-security/ws/trunk/target/surefire/surefire_1226577084610741051906tmp>
Running org.apache.hadoop.hbase.coprocessor.TestMasterObserver
Tests run: 5, Failures: 0, Errors: 0, Skipped: 0, Time elapsed: 97.116 sec
Forking command line: /bin/sh -c cd <https://builds.apache.org/job/HBase-0.94-security/ws/trunk> && /home/jenkins/tools/java/jdk1.6.0_45-32/jre/bin/java -enableassertions -Xmx1900m -Djava.security.egd=file:/dev/./urandom -jar <https://builds.apache.org/job/HBase-0.94-security/ws/trunk/target/surefire/surefirebooter8376415923103589012.jar> <https://builds.apache.org/job/HBase-0.94-security/ws/trunk/target/surefire/surefire8858250216012400414tmp> <https://builds.apache.org/job/HBase-0.94-security/ws/trunk/target/surefire/surefire_1232975667589148596094tmp>
Running org.apache.hadoop.hbase.coprocessor.TestMasterCoprocessorExceptionWithRemove
Tests run: 1, Failures: 0, Errors: 0, Skipped: 0, Time elapsed: 31.095 sec
Forking command line: /bin/sh -c cd <https://builds.apache.org/job/HBase-0.94-security/ws/trunk> && /home/jenkins/tools/java/jdk1.6.0_45-32/jre/bin/java -enableassertions -Xmx1900m -Djava.security.egd=file:/dev/./urandom -jar <https://builds.apache.org/job/HBase-0.94-security/ws/trunk/target/surefire/surefirebooter5550894029945642391.jar> <https://builds.apache.org/job/HBase-0.94-security/ws/trunk/target/surefire/surefire7923497050893327010tmp> <https://builds.apache.org/job/HBase-0.94-security/ws/trunk/target/surefire/surefire_1248631849954310364824tmp>
Running org.apache.hadoop.hbase.coprocessor.TestRegionServerCoprocessorExceptionWithAbort
Tests run: 1, Failures: 0, Errors: 0, Skipped: 0, Time elapsed: 52.042 sec
Forking command line: /bin/sh -c cd <https://builds.apache.org/job/HBase-0.94-security/ws/trunk> && /home/jenkins/tools/java/jdk1.6.0_45-32/jre/bin/java -enableassertions -Xmx1900m -Djava.security.egd=file:/dev/./urandom -jar <https://builds.apache.org/job/HBase-0.94-security/ws/trunk/target/surefire/surefirebooter1235475521833521174.jar> <https://builds.apache.org/job/HBase-0.94-security/ws/trunk/target/surefire/surefire3905402555454842795tmp> <https://builds.apache.org/job/HBase-0.94-security/ws/trunk/target/surefire/surefire_1257299276170014711419tmp>
Running org.apache.hadoop.hbase.coprocessor.TestMasterCoprocessorExceptionWithAbort
Tests run: 1, Failures: 0, Errors: 0, Skipped: 0, Time elapsed: 38.149 sec
Forking command line: /bin/sh -c cd <https://builds.apache.org/job/HBase-0.94-security/ws/trunk> && /home/jenkins/tools/java/jdk1.6.0_45-32/jre/bin/java -enableassertions -Xmx1900m -Djava.security.egd=file:/dev/./urandom -jar <https://builds.apache.org/job/HBase-0.94-security/ws/trunk/target/surefire/surefirebooter7278379752618265166.jar> <https://builds.apache.org/job/HBase-0.94-security/ws/trunk/target/surefire/surefire593414477033764809tmp> <https://builds.apache.org/job/HBase-0.94-security/ws/trunk/target/surefire/surefire_1261470808574209270222tmp>
Running org.apache.hadoop.hbase.catalog.TestMetaReaderEditorNoCluster
Tests run: 1, Failures: 0, Errors: 0, Skipped: 0, Time elapsed: 5.315 sec
Forking command line: /bin/sh -c cd <https://builds.apache.org/job/HBase-0.94-security/ws/trunk> && /home/jenkins/tools/java/jdk1.6.0_45-32/jre/bin/java -enableassertions -Xmx1900m -Djava.security.egd=file:/dev/./urandom -jar <https://builds.apache.org/job/HBase-0.94-security/ws/trunk/target/surefire/surefirebooter3002070737414674586.jar> <https://builds.apache.org/job/HBase-0.94-security/ws/trunk/target/surefire/surefire3079119816705759402tmp> <https://builds.apache.org/job/HBase-0.94-security/ws/trunk/target/surefire/surefire_1273075932870069413464tmp>
Running org.apache.hadoop.hbase.TestGlobalMemStoreSize
Tests run: 1, Failures: 0, Errors: 0, Skipped: 0, Time elapsed: 40.359 sec
Forking command line: /bin/sh -c cd <https://builds.apache.org/job/HBase-0.94-security/ws/trunk> && /home/jenkins/tools/java/jdk1.6.0_45-32/jre/bin/java -enableassertions -Xmx1900m -Djava.security.egd=file:/dev/./urandom -jar <https://builds.apache.org/job/HBase-0.94-security/ws/trunk/target/surefire/surefirebooter4251618809144162532.jar> <https://builds.apache.org/job/HBase-0.94-security/ws/trunk/target/surefire/surefire8340886744838342280tmp> <https://builds.apache.org/job/HBase-0.94-security/ws/trunk/target/surefire/surefire_128707369282638802425tmp>
Running org.apache.hadoop.hbase.catalog.TestCatalogTracker
Tests run: 10, Failures: 0, Errors: 0, Skipped: 1, Time elapsed: 11.528 sec
Forking command line: /bin/sh -c cd <https://builds.apache.org/job/HBase-0.94-security/ws/trunk> && /home/jenkins/tools/java/jdk1.6.0_45-32/jre/bin/java -enableassertions -Xmx1900m -Djava.security.egd=file:/dev/./urandom -jar <https://builds.apache.org/job/HBase-0.94-security/ws/trunk/target/surefire/surefirebooter3206828914407916359.jar> <https://builds.apache.org/job/HBase-0.94-security/ws/trunk/target/surefire/surefire646413724343225973tmp> <https://builds.apache.org/job/HBase-0.94-security/ws/trunk/target/surefire/surefire_1291490625772975659484tmp>
Running org.apache.hadoop.hbase.regionserver.TestMXBean
Tests run: 1, Failures: 0, Errors: 0, Skipped: 0, Time elapsed: 31.453 sec
Forking command line: /bin/sh -c cd <https://builds.apache.org/job/HBase-0.94-security/ws/trunk> && /home/jenkins/tools/java/jdk1.6.0_45-32/jre/bin/java -enableassertions -Xmx1900m -Djava.security.egd=file:/dev/./urandom -jar <https://builds.apache.org/job/HBase-0.94-security/ws/trunk/target/surefire/surefirebooter7849300451108036569.jar> <https://builds.apache.org/job/HBase-0.94-security/ws/trunk/target/surefire/surefire5207660336596373857tmp> <https://builds.apache.org/job/HBase-0.94-security/ws/trunk/target/surefire/surefire_1302346342201096462040tmp>
Running org.apache.hadoop.hbase.regionserver.TestStoreScanner
Tests run: 16, Failures: 0, Errors: 0, Skipped: 0, Time elapsed: 0.048 sec
Forking command line: /bin/sh -c cd <https://builds.apache.org/job/HBase-0.94-security/ws/trunk> && /home/jenkins/tools/java/jdk1.6.0_45-32/jre/bin/java -enableassertions -Xmx1900m -Djava.security.egd=file:/dev/./urandom -jar <https://builds.apache.org/job/HBase-0.94-security/ws/trunk/target/surefire/surefirebooter7811280437240843298.jar> <https://builds.apache.org/job/HBase-0.94-security/ws/trunk/target/surefire/surefire7777163046301861810tmp> <https://builds.apache.org/job/HBase-0.94-security/ws/trunk/target/surefire/surefire_1312390094634677853982tmp>
Running org.apache.hadoop.hbase.catalog.TestMetaReaderEditor
Tests run: 5, Failures: 0, Errors: 0, Skipped: 0, Time elapsed: 54.022 sec
Forking command line: /bin/sh -c cd <https://builds.apache.org/job/HBase-0.94-security/ws/trunk> && /home/jenkins/tools/java/jdk1.6.0_45-32/jre/bin/java -enableassertions -Xmx1900m -Djava.security.egd=file:/dev/./urandom -jar <https://builds.apache.org/job/HBase-0.94-security/ws/trunk/target/surefire/surefirebooter5709879418986545343.jar> <https://builds.apache.org/job/HBase-0.94-security/ws/trunk/target/surefire/surefire6931892360992651469tmp> <https://builds.apache.org/job/HBase-0.94-security/ws/trunk/target/surefire/surefire_1323806743478135167719tmp>
Running org.apache.hadoop.hbase.regionserver.TestParallelPut
Tests run: 2, Failures: 0, Errors: 0, Skipped: 0, Time elapsed: 5.363 sec
Forking command line: /bin/sh -c cd <https://builds.apache.org/job/HBase-0.94-security/ws/trunk> && /home/jenkins/tools/java/jdk1.6.0_45-32/jre/bin/java -enableassertions -Xmx1900m -Djava.security.egd=file:/dev/./urandom -jar <https://builds.apache.org/job/HBase-0.94-security/ws/trunk/target/surefire/surefirebooter7765812656748611164.jar> <https://builds.apache.org/job/HBase-0.94-security/ws/trunk/target/surefire/surefire3858488422025375397tmp> <https://builds.apache.org/job/HBase-0.94-security/ws/trunk/target/surefire/surefire_1336417392765205775157tmp>
Running org.apache.hadoop.hbase.regionserver.metrics.TestSchemaMetrics
Tests run: 6, Failures: 0, Errors: 0, Skipped: 0, Time elapsed: 15.275 sec
Forking command line: /bin/sh -c cd <https://builds.apache.org/job/HBase-0.94-security/ws/trunk> && /home/jenkins/tools/java/jdk1.6.0_45-32/jre/bin/java -enableassertions -Xmx1900m -Djava.security.egd=file:/dev/./urandom -jar <https://builds.apache.org/job/HBase-0.94-security/ws/trunk/target/surefire/surefirebooter6630834946413808179.jar> <https://builds.apache.org/job/HBase-0.94-security/ws/trunk/target/surefire/surefire1369234195933920056tmp> <https://builds.apache.org/job/HBase-0.94-security/ws/trunk/target/surefire/surefire_134126392590933349835tmp>
Running org.apache.hadoop.hbase.regionserver.TestStore
Tests run: 12, Failures: 0, Errors: 0, Skipped: 0, Time elapsed: 10.817 sec
Forking command line: /bin/sh -c cd <https://builds.apache.org/job/HBase-0.94-security/ws/trunk> && /home/jenkins/tools/java/jdk1.6.0_45-32/jre/bin/java -enableassertions -Xmx1900m -Djava.security.egd=file:/dev/./urandom -jar <https://builds.apache.org/job/HBase-0.94-security/ws/trunk/target/surefire/surefirebooter4304901927707309751.jar> <https://builds.apache.org/job/HBase-0.94-security/ws/trunk/target/surefire/surefire5419588716173738352tmp> <https://builds.apache.org/job/HBase-0.94-security/ws/trunk/target/surefire/surefire_1352747680948100438500tmp>
Running org.apache.hadoop.hbase.regionserver.TestCacheOnWriteInSchema
Tests run: 3, Failures: 0, Errors: 0, Skipped: 0, Time elapsed: 1.688 sec
Forking command line: /bin/sh -c cd <https://builds.apache.org/job/HBase-0.94-security/ws/trunk> && /home/jenkins/tools/java/jdk1.6.0_45-32/jre/bin/java -enableassertions -Xmx1900m -Djava.security.egd=file:/dev/./urandom -jar <https://builds.apache.org/job/HBase-0.94-security/ws/trunk/target/surefire/surefirebooter1845211213113428591.jar> <https://builds.apache.org/job/HBase-0.94-security/ws/trunk/target/surefire/surefire6549202207010668574tmp> <https://builds.apache.org/job/HBase-0.94-security/ws/trunk/target/surefire/surefire_1366760981876253248295tmp>
Running org.apache.hadoop.hbase.regionserver.TestServerCustomProtocol
Tests run: 7, Failures: 0, Errors: 0, Skipped: 0, Time elapsed: 34.931 sec
Forking command line: /bin/sh -c cd <https://builds.apache.org/job/HBase-0.94-security/ws/trunk> && /home/jenkins/tools/java/jdk1.6.0_45-32/jre/bin/java -enableassertions -Xmx1900m -Djava.security.egd=file:/dev/./urandom -jar <https://builds.apache.org/job/HBase-0.94-security/ws/trunk/target/surefire/surefirebooter6637781480737198247.jar> <https://builds.apache.org/job/HBase-0.94-security/ws/trunk/target/surefire/surefire8594679697916601162tmp> <https://builds.apache.org/job/HBase-0.94-security/ws/trunk/target/surefire/surefire_1375112032465279940383tmp>
Running org.apache.hadoop.hbase.regionserver.TestHRegionBusyWait
Tests run: 75, Failures: 0, Errors: 0, Skipped: 0, Time elapsed: 73.692 sec
Forking command line: /bin/sh -c cd <https://builds.apache.org/job/HBase-0.94-security/ws/trunk> && /home/jenkins/tools/java/jdk1.6.0_45-32/jre/bin/java -enableassertions -Xmx1900m -Djava.security.egd=file:/dev/./urandom -jar <https://builds.apache.org/job/HBase-0.94-security/ws/trunk/target/surefire/surefirebooter3811619049495238063.jar> <https://builds.apache.org/job/HBase-0.94-security/ws/trunk/target/surefire/surefire5334349698296268709tmp> <https://builds.apache.org/job/HBase-0.94-security/ws/trunk/target/surefire/surefire_1381296708606513538288tmp>
Running org.apache.hadoop.hbase.regionserver.wal.TestLogRollPeriod
Tests run: 2, Failures: 0, Errors: 0, Skipped: 0, Time elapsed: 89.374 sec
Forking command line: /bin/sh -c cd <https://builds.apache.org/job/HBase-0.94-security/ws/trunk> && /home/jenkins/tools/java/jdk1.6.0_45-32/jre/bin/java -enableassertions -Xmx1900m -Djava.security.egd=file:/dev/./urandom -jar <https://builds.apache.org/job/HBase-0.94-security/ws/trunk/target/surefire/surefirebooter2773860347750018819.jar> <https://builds.apache.org/job/HBase-0.94-security/ws/trunk/target/surefire/surefire5461817324076814286tmp> <https://builds.apache.org/job/HBase-0.94-security/ws/trunk/target/surefire/surefire_1395710688238419323872tmp>
Running org.apache.hadoop.hbase.regionserver.wal.TestDurability
Tests run: 1, Failures: 0, Errors: 0, Skipped: 0, Time elapsed: 9.913 sec
Forking command line: /bin/sh -c cd <https://builds.apache.org/job/HBase-0.94-security/ws/trunk> && /home/jenkins/tools/java/jdk1.6.0_45-32/jre/bin/java -enableassertions -Xmx1900m -Djava.security.egd=file:/dev/./urandom -jar <https://builds.apache.org/job/HBase-0.94-security/ws/trunk/target/surefire/surefirebooter7708119646892078123.jar> <https://builds.apache.org/job/HBase-0.94-security/ws/trunk/target/surefire/surefire5069309044794663409tmp> <https://builds.apache.org/job/HBase-0.94-security/ws/trunk/target/surefire/surefire_1401631737536044250898tmp>
Running org.apache.hadoop.hbase.regionserver.wal.TestWALReplay
Tests run: 8, Failures: 0, Errors: 0, Skipped: 0, Time elapsed: 118.557 sec
Forking command line: /bin/sh -c cd <https://builds.apache.org/job/HBase-0.94-security/ws/trunk> && /home/jenkins/tools/java/jdk1.6.0_45-32/jre/bin/java -enableassertions -Xmx1900m -Djava.security.egd=file:/dev/./urandom -jar <https://builds.apache.org/job/HBase-0.94-security/ws/trunk/target/surefire/surefirebooter7056945839489960102.jar> <https://builds.apache.org/job/HBase-0.94-security/ws/trunk/target/surefire/surefire6956815701783889120tmp> <https://builds.apache.org/job/HBase-0.94-security/ws/trunk/target/surefire/surefire_1418519384014015267825tmp>
Running org.apache.hadoop.hbase.regionserver.wal.TestLogRollingNoCluster
Tests run: 1, Failures: 0, Errors: 0, Skipped: 0, Time elapsed: 2.314 sec
Forking command line: /bin/sh -c cd <https://builds.apache.org/job/HBase-0.94-security/ws/trunk> && /home/jenkins/tools/java/jdk1.6.0_45-32/jre/bin/java -enableassertions -Xmx1900m -Djava.security.egd=file:/dev/./urandom -jar <https://builds.apache.org/job/HBase-0.94-security/ws/trunk/target/surefire/surefirebooter3176143408511281750.jar> <https://builds.apache.org/job/HBase-0.94-security/ws/trunk/target/surefire/surefire1633551834049200583tmp> <https://builds.apache.org/job/HBase-0.94-security/ws/trunk/target/surefire/surefire_142942302533187877014tmp>
Running org.apache.hadoop.hbase.regionserver.wal.TestHLogBench
Tests run: 1, Failures: 0, Errors: 0, Skipped: 0, Time elapsed: 1.254 sec
Forking command line: /bin/sh -c cd <https://builds.apache.org/job/HBase-0.94-security/ws/trunk> && /home/jenkins/tools/java/jdk1.6.0_45-32/jre/bin/java -enableassertions -Xmx1900m -Djava.security.egd=file:/dev/./urandom -jar <https://builds.apache.org/job/HBase-0.94-security/ws/trunk/target/surefire/surefirebooter3973836900398757083.jar> <https://builds.apache.org/job/HBase-0.94-security/ws/trunk/target/surefire/surefire6660880209967062771tmp> <https://builds.apache.org/job/HBase-0.94-security/ws/trunk/target/surefire/surefire_1438606649439815608465tmp>
Running org.apache.hadoop.hbase.regionserver.wal.TestLogRollAbort
Tests run: 1, Failures: 0, Errors: 0, Skipped: 0, Time elapsed: 171.758 sec
Forking command line: /bin/sh -c cd <https://builds.apache.org/job/HBase-0.94-security/ws/trunk> && /home/jenkins/tools/java/jdk1.6.0_45-32/jre/bin/java -enableassertions -Xmx1900m -Djava.security.egd=file:/dev/./urandom -jar <https://builds.apache.org/job/HBase-0.94-security/ws/trunk/target/surefire/surefirebooter4043702344016743433.jar> <https://builds.apache.org/job/HBase-0.94-security/ws/trunk/target/surefire/surefire1997759122685087839tmp> <https://builds.apache.org/job/HBase-0.94-security/ws/trunk/target/surefire/surefire_1444182975472357356366tmp>
Running org.apache.hadoop.hbase.regionserver.TestRpcMetrics
Tests run: 1, Failures: 0, Errors: 0, Skipped: 0, Time elapsed: 1.404 sec
Forking command line: /bin/sh -c cd <https://builds.apache.org/job/HBase-0.94-security/ws/trunk> && /home/jenkins/tools/java/jdk1.6.0_45-32/jre/bin/java -enableassertions -Xmx1900m -Djava.security.egd=file:/dev/./urandom -jar <https://builds.apache.org/job/HBase-0.94-security/ws/trunk/target/surefire/surefirebooter285982309118570965.jar> <https://builds.apache.org/job/HBase-0.94-security/ws/trunk/target/surefire/surefire8912296696441689555tmp> <https://builds.apache.org/job/HBase-0.94-security/ws/trunk/target/surefire/surefire_1451089927418674510214tmp>
Running org.apache.hadoop.hbase.regionserver.wal.TestWALReplayCompressed
Tests run: 8, Failures: 0, Errors: 0, Skipped: 0, Time elapsed: 82.356 sec
Running org.apache.hadoop.hbase.regionserver.TestHRegionOnCluster
Tests run: 1, Failures: 0, Errors: 0, Skipped: 0, Time elapsed: 101.795 sec
Forking command line: /bin/sh -c cd <https://builds.apache.org/job/HBase-0.94-security/ws/trunk> && /home/jenkins/tools/java/jdk1.6.0_45-32/jre/bin/java -enableassertions -Xmx1900m -Djava.security.egd=file:/dev/./urandom -jar <https://builds.apache.org/job/HBase-0.94-security/ws/trunk/target/surefire/surefirebooter6905954592533914817.jar> <https://builds.apache.org/job/HBase-0.94-security/ws/trunk/target/surefire/surefire6142929099822731330tmp> <https://builds.apache.org/job/HBase-0.94-security/ws/trunk/target/surefire/surefire_146923362005152634704tmp>
Running org.apache.hadoop.hbase.regionserver.handler.TestCloseRegionHandler
Tests run: 3, Failures: 0, Errors: 0, Skipped: 0, Time elapsed: 2.476 sec
Forking command line: /bin/sh -c cd <https://builds.apache.org/job/HBase-0.94-security/ws/trunk> && /home/jenkins/tools/java/jdk1.6.0_45-32/jre/bin/java -enableassertions -Xmx1900m -Djava.security.egd=file:/dev/./urandom -jar <https://builds.apache.org/job/HBase-0.94-security/ws/trunk/target/surefire/surefirebooter5032787415051597113.jar> <https://builds.apache.org/job/HBase-0.94-security/ws/trunk/target/surefire/surefire2051294446675974791tmp> <https://builds.apache.org/job/HBase-0.94-security/ws/trunk/target/surefire/surefire_1475259726077753773480tmp>
Forking command line: /bin/sh -c cd <https://builds.apache.org/job/HBase-0.94-security/ws/trunk> && /home/jenkins/tools/java/jdk1.6.0_45-32/jre/bin/java -enableassertions -Xmx1900m -Djava.security.egd=file:/dev/./urandom -jar <https://builds.apache.org/job/HBase-0.94-security/ws/trunk/target/surefire/surefirebooter7160609028744436616.jar> <https://builds.apache.org/job/HBase-0.94-security/ws/trunk/target/surefire/surefire7207096616140407060tmp> <https://builds.apache.org/job/HBase-0.94-security/ws/trunk/target/surefire/surefire_1486488019263285624408tmp>
Running org.apache.hadoop.hbase.regionserver.handler.TestOpenRegionHandler
Tests run: 4, Failures: 0, Errors: 0, Skipped: 0, Time elapsed: 31.174 sec
Forking command line: /bin/sh -c cd <https://builds.apache.org/job/HBase-0.94-security/ws/trunk> && /home/jenkins/tools/java/jdk1.6.0_45-32/jre/bin/java -enableassertions -Xmx1900m -Djava.security.egd=file:/dev/./urandom -jar <https://builds.apache.org/job/HBase-0.94-security/ws/trunk/target/surefire/surefirebooter6763783148396660681.jar> <https://builds.apache.org/job/HBase-0.94-security/ws/trunk/target/surefire/surefire400711518971458042tmp> <https://builds.apache.org/job/HBase-0.94-security/ws/trunk/target/surefire/surefire_1492718751594510663263tmp>
Running org.apache.hadoop.hbase.regionserver.TestBlocksRead
Tests run: 4, Failures: 0, Errors: 0, Skipped: 0, Time elapsed: 1.019 sec
Forking command line: /bin/sh -c cd <https://builds.apache.org/job/HBase-0.94-security/ws/trunk> && /home/jenkins/tools/java/jdk1.6.0_45-32/jre/bin/java -enableassertions -Xmx1900m -Djava.security.egd=file:/dev/./urandom -jar <https://builds.apache.org/job/HBase-0.94-security/ws/trunk/target/surefire/surefirebooter2921302467155841817.jar> <https://builds.apache.org/job/HBase-0.94-security/ws/trunk/target/surefire/surefire287904457694365673tmp> <https://builds.apache.org/job/HBase-0.94-security/ws/trunk/target/surefire/surefire_1504797016248102991829tmp>
Running org.apache.hadoop.hbase.regionserver.TestStoreFileBlockCacheSummary
Tests run: 1, Failures: 0, Errors: 0, Skipped: 0, Time elapsed: 32.73 sec
Forking command line: /bin/sh -c cd <https://builds.apache.org/job/HBase-0.94-security/ws/trunk> && /home/jenkins/tools/java/jdk1.6.0_45-32/jre/bin/java -enableassertions -Xmx1900m -Djava.security.egd=file:/dev/./urandom -jar <https://builds.apache.org/job/HBase-0.94-security/ws/trunk/target/surefire/surefirebooter2923004102017571520.jar> <https://builds.apache.org/job/HBase-0.94-security/ws/trunk/target/surefire/surefire5117576036816412783tmp> <https://builds.apache.org/job/HBase-0.94-security/ws/trunk/target/surefire/surefire_1513256329295527125582tmp>
Running org.apache.hadoop.hbase.regionserver.TestMultiColumnScanner
Tests run: 12, Failures: 0, Errors: 0, Skipped: 0, Time elapsed: 38.921 sec
Forking command line: /bin/sh -c cd <https://builds.apache.org/job/HBase-0.94-security/ws/trunk> && /home/jenkins/tools/java/jdk1.6.0_45-32/jre/bin/java -enableassertions -Xmx1900m -Djava.security.egd=file:/dev/./urandom -jar <https://builds.apache.org/job/HBase-0.94-security/ws/trunk/target/surefire/surefirebooter5978335579524344145.jar> <https://builds.apache.org/job/HBase-0.94-security/ws/trunk/target/surefire/surefire3872205578516602484tmp> <https://builds.apache.org/job/HBase-0.94-security/ws/trunk/target/surefire/surefire_1522083054834351843684tmp>
Running org.apache.hadoop.hbase.regionserver.TestHRegion
Tests run: 74, Failures: 0, Errors: 0, Skipped: 0, Time elapsed: 76.808 sec
Forking command line: /bin/sh -c cd <https://builds.apache.org/job/HBase-0.94-security/ws/trunk> && /home/jenkins/tools/java/jdk1.6.0_45-32/jre/bin/java -enableassertions -Xmx1900m -Djava.security.egd=file:/dev/./urandom -jar <https://builds.apache.org/job/HBase-0.94-security/ws/trunk/target/surefire/surefirebooter1394816606352649722.jar> <https://builds.apache.org/job/HBase-0.94-security/ws/trunk/target/surefire/surefire5594804955711275795tmp> <https://builds.apache.org/job/HBase-0.94-security/ws/trunk/target/surefire/surefire_1532509515181759735088tmp>
Running org.apache.hadoop.hbase.regionserver.TestRegionServerMetrics
Tests run: 4, Failures: 0, Errors: 0, Skipped: 0, Time elapsed: 136.046 sec
Forking command line: /bin/sh -c cd <https://builds.apache.org/job/HBase-0.94-security/ws/trunk> && /home/jenkins/tools/java/jdk1.6.0_45-32/jre/bin/java -enableassertions -Xmx1900m -Djava.security.egd=file:/dev/./urandom -jar <https://builds.apache.org/job/HBase-0.94-security/ws/trunk/target/surefire/surefirebooter3791983161475283702.jar> <https://builds.apache.org/job/HBase-0.94-security/ws/trunk/target/surefire/surefire3132336659775599479tmp> <https://builds.apache.org/job/HBase-0.94-security/ws/trunk/target/surefire/surefire_1548958003836795541036tmp>
Running org.apache.hadoop.hbase.regionserver.TestFSErrorsExposed
Tests run: 3, Failures: 0, Errors: 0, Skipped: 0, Time elapsed: 37.514 sec
Forking command line: /bin/sh -c cd <https://builds.apache.org/job/HBase-0.94-security/ws/trunk> && /home/jenkins/tools/java/jdk1.6.0_45-32/jre/bin/java -enableassertions -Xmx1900m -Djava.security.egd=file:/dev/./urandom -jar <https://builds.apache.org/job/HBase-0.94-security/ws/trunk/target/surefire/surefirebooter1160131544881373862.jar> <https://builds.apache.org/job/HBase-0.94-security/ws/trunk/target/surefire/surefire2398520337821013252tmp> <https://builds.apache.org/job/HBase-0.94-security/ws/trunk/target/surefire/surefire_1553252560153454774275tmp>
Running org.apache.hadoop.hbase.regionserver.TestSplitLogWorker
Tests run: 5, Failures: 0, Errors: 0, Skipped: 0, Time elapsed: 18.303 sec
Forking command line: /bin/sh -c cd <https://builds.apache.org/job/HBase-0.94-security/ws/trunk> && /home/jenkins/tools/java/jdk1.6.0_45-32/jre/bin/java -enableassertions -Xmx1900m -Djava.security.egd=file:/dev/./urandom -jar <https://builds.apache.org/job/HBase-0.94-security/ws/trunk/target/surefire/surefirebooter1910194461696662375.jar> <https://builds.apache.org/job/HBase-0.94-security/ws/trunk/target/surefire/surefire6396529850029059432tmp> <https://builds.apache.org/job/HBase-0.94-security/ws/trunk/target/surefire/surefire_1566046891273791751052tmp>
Running org.apache.hadoop.hbase.regionserver.TestCompactionWithCoprocessor
Tests run: 17, Failures: 0, Errors: 0, Skipped: 0, Time elapsed: 44.942 sec
Forking command line: /bin/sh -c cd <https://builds.apache.org/job/HBase-0.94-security/ws/trunk> && /home/jenkins/tools/java/jdk1.6.0_45-32/jre/bin/java -enableassertions -Xmx1900m -Djava.security.egd=file:/dev/./urandom -jar <https://builds.apache.org/job/HBase-0.94-security/ws/trunk/target/surefire/surefirebooter5890797024873760539.jar> <https://builds.apache.org/job/HBase-0.94-security/ws/trunk/target/surefire/surefire7033623435473956681tmp> <https://builds.apache.org/job/HBase-0.94-security/ws/trunk/target/surefire/surefire_1572158306896142107077tmp>
Running org.apache.hadoop.hbase.regionserver.TestSeekOptimizations
Tests run: 6, Failures: 0, Errors: 0, Skipped: 0, Time elapsed: 2.93 sec
Forking command line: /bin/sh -c cd <https://builds.apache.org/job/HBase-0.94-security/ws/trunk> && /home/jenkins/tools/java/jdk1.6.0_45-32/jre/bin/java -enableassertions -Xmx1900m -Djava.security.egd=file:/dev/./urandom -jar <https://builds.apache.org/job/HBase-0.94-security/ws/trunk/target/surefire/surefirebooter3357386730999355266.jar> <https://builds.apache.org/job/HBase-0.94-security/ws/trunk/target/surefire/surefire388099768595271451tmp> <https://builds.apache.org/job/HBase-0.94-security/ws/trunk/target/surefire/surefire_158131539152015665613tmp>
Running org.apache.hadoop.hbase.regionserver.TestMasterAddressManager
Tests run: 1, Failures: 0, Errors: 0, Skipped: 0, Time elapsed: 1.04 sec
Forking command line: /bin/sh -c cd <https://builds.apache.org/job/HBase-0.94-security/ws/trunk> && /home/jenkins/tools/java/jdk1.6.0_45-32/jre/bin/java -enableassertions -Xmx1900m -Djava.security.egd=file:/dev/./urandom -jar <https://builds.apache.org/job/HBase-0.94-security/ws/trunk/target/surefire/surefirebooter490974834113895446.jar> <https://builds.apache.org/job/HBase-0.94-security/ws/trunk/target/surefire/surefire6043603048948534676tmp> <https://builds.apache.org/job/HBase-0.94-security/ws/trunk/target/surefire/surefire_1597365854528583753206tmp>
Running org.apache.hadoop.hbase.regionserver.TestAtomicOperation
Tests run: 5, Failures: 0, Errors: 0, Skipped: 0, Time elapsed: 15.404 sec
Running org.apache.hadoop.hbase.TestClusterBootOrder
Tests run: 2, Failures: 0, Errors: 0, Skipped: 0, Time elapsed: 67.384 sec
Results :
Tests in error:
testBalanceSplit(org.apache.hadoop.hbase.snapshot.TestExportSnapshot): org.apache.hadoop.hbase.snapshot.HBaseSnapshotException: Snapshot { ss=snaptb0-1394762168566 table=testtb-1394762168566 type=FLUSH } had an error. Procedure snaptb0-1394762168566 { waiting=[] done=[quirinus.apache.org,49653,1394762155689, quirinus.apache.org,42602,1394762155729, quirinus.apache.org,43332,1394762155602] }(..)
Tests run: 917, Failures: 0, Errors: 1, Skipped: 2
[INFO] ------------------------------------------------------------------------
[INFO] BUILD FAILURE
[INFO] ------------------------------------------------------------------------
[INFO] Total time: 1:26:23.796s
[INFO] Finished at: Fri Mar 14 02:43:12 UTC 2014
[INFO] Final Memory: 42M/735M
[INFO] ------------------------------------------------------------------------
[ERROR] Failed to execute goal org.apache.maven.plugins:maven-surefire-plugin:2.12-TRUNK-HBASE-2:test (secondPartTestsExecution) on project hbase: There are test failures.
[ERROR]
[ERROR] Please refer to <https://builds.apache.org/job/HBase-0.94-security/ws/trunk/target/surefire-reports> for the individual test results.
[ERROR] -> [Help 1]
org.apache.maven.lifecycle.LifecycleExecutionException: Failed to execute goal org.apache.maven.plugins:maven-surefire-plugin:2.12-TRUNK-HBASE-2:test (secondPartTestsExecution) on project hbase: There are test failures.
Please refer to <https://builds.apache.org/job/HBase-0.94-security/ws/trunk/target/surefire-reports> for the individual test results.
at org.apache.maven.lifecycle.internal.MojoExecutor.execute(MojoExecutor.java:213)
at org.apache.maven.lifecycle.internal.MojoExecutor.execute(MojoExecutor.java:153)
at org.apache.maven.lifecycle.internal.MojoExecutor.execute(MojoExecutor.java:145)
at org.apache.maven.lifecycle.internal.MojoExecutor.executeForkedExecutions(MojoExecutor.java:365)
at org.apache.maven.lifecycle.internal.MojoExecutor.execute(MojoExecutor.java:199)
at org.apache.maven.lifecycle.internal.MojoExecutor.execute(MojoExecutor.java:153)
at org.apache.maven.lifecycle.internal.MojoExecutor.execute(MojoExecutor.java:145)
at org.apache.maven.lifecycle.internal.LifecycleModuleBuilder.buildProject(LifecycleModuleBuilder.java:84)
at org.apache.maven.lifecycle.internal.LifecycleModuleBuilder.buildProject(LifecycleModuleBuilder.java:59)
at org.apache.maven.lifecycle.internal.LifecycleStarter.singleThreadedBuild(LifecycleStarter.java:183)
at org.apache.maven.lifecycle.internal.LifecycleStarter.execute(LifecycleStarter.java:161)
at org.apache.maven.DefaultMaven.doExecute(DefaultMaven.java:320)
at org.apache.maven.DefaultMaven.execute(DefaultMaven.java:156)
at org.apache.maven.cli.MavenCli.execute(MavenCli.java:537)
at org.apache.maven.cli.MavenCli.doMain(MavenCli.java:196)
at org.apache.maven.cli.MavenCli.main(MavenCli.java:141)
at sun.reflect.NativeMethodAccessorImpl.invoke0(Native Method)
at sun.reflect.NativeMethodAccessorImpl.invoke(NativeMethodAccessorImpl.java:39)
at sun.reflect.DelegatingMethodAccessorImpl.invoke(DelegatingMethodAccessorImpl.java:25)
at java.lang.reflect.Method.invoke(Method.java:597)
at org.codehaus.plexus.classworlds.launcher.Launcher.launchEnhanced(Launcher.java:290)
at org.codehaus.plexus.classworlds.launcher.Launcher.launch(Launcher.java:230)
at org.codehaus.plexus.classworlds.launcher.Launcher.mainWithExitCode(Launcher.java:409)
at org.codehaus.plexus.classworlds.launcher.Launcher.main(Launcher.java:352)
Caused by: org.apache.maven.plugin.MojoFailureException: There are test failures.
Please refer to <https://builds.apache.org/job/HBase-0.94-security/ws/trunk/target/surefire-reports> for the individual test results.
at org.apache.maven.plugin.surefire.SurefireHelper.reportExecution(SurefireHelper.java:87)
at org.apache.maven.plugin.surefire.SurefirePlugin.writeSummary(SurefirePlugin.java:651)
at org.apache.maven.plugin.surefire.SurefirePlugin.handleSummary(SurefirePlugin.java:625)
at org.apache.maven.plugin.surefire.AbstractSurefireMojo.executeAfterPreconditionsChecked(AbstractSurefireMojo.java:137)
at org.apache.maven.plugin.surefire.AbstractSurefireMojo.execute(AbstractSurefireMojo.java:98)
at org.apache.maven.plugin.DefaultBuildPluginManager.executeMojo(DefaultBuildPluginManager.java:101)
at org.apache.maven.lifecycle.internal.MojoExecutor.execute(MojoExecutor.java:209)
... 23 more
[ERROR]
[ERROR]
[ERROR] For more information about the errors and possible solutions, please read the following articles:
[ERROR] [Help 1] http://cwiki.apache.org/confluence/display/MAVEN/MojoFailureException
Build step 'Invoke top-level Maven targets' marked build as failure
Archiving artifacts
Updating HBASE-10722
Recording test results
Jenkins build is back to normal : HBase-0.94-security #441
Posted by Apache Jenkins Server <je...@builds.apache.org>.
See <https://builds.apache.org/job/HBase-0.94-security/441/changes>