You are viewing a plain text version of this content. The canonical link for it is here.
Posted to builds@solr.apache.org by Apache Jenkins Server <je...@builds.apache.org> on 2023/12/21 00:45:57 UTC
[JENKINS] Lucene » Lucene-Solr-Tests-8.11 - Build # 364 - Unstable!
Build: https://ci-builds.apache.org/job/Lucene/job/Lucene-Solr-Tests-8.11/364/
3 tests failed.
FAILED: junit.framework.TestSuite.org.apache.solr.cloud.api.collections.HdfsCloudIncrementalBackupTest
Error Message:
1 thread leaked from SUITE scope at org.apache.solr.cloud.api.collections.HdfsCloudIncrementalBackupTest: 1) Thread[id=15483, name=Command processor, state=WAITING, group=TGRP-HdfsCloudIncrementalBackupTest] at sun.misc.Unsafe.park(Native Method) at java.util.concurrent.locks.LockSupport.park(LockSupport.java:175) at java.util.concurrent.locks.AbstractQueuedSynchronizer$ConditionObject.await(AbstractQueuedSynchronizer.java:2039) at java.util.concurrent.LinkedBlockingQueue.take(LinkedBlockingQueue.java:442) at org.apache.hadoop.hdfs.server.datanode.BPServiceActor$CommandProcessingThread.processQueue(BPServiceActor.java:1291) at org.apache.hadoop.hdfs.server.datanode.BPServiceActor$CommandProcessingThread.run(BPServiceActor.java:1275)
Stack Trace:
com.carrotsearch.randomizedtesting.ThreadLeakError: 1 thread leaked from SUITE scope at org.apache.solr.cloud.api.collections.HdfsCloudIncrementalBackupTest:
1) Thread[id=15483, name=Command processor, state=WAITING, group=TGRP-HdfsCloudIncrementalBackupTest]
at sun.misc.Unsafe.park(Native Method)
at java.util.concurrent.locks.LockSupport.park(LockSupport.java:175)
at java.util.concurrent.locks.AbstractQueuedSynchronizer$ConditionObject.await(AbstractQueuedSynchronizer.java:2039)
at java.util.concurrent.LinkedBlockingQueue.take(LinkedBlockingQueue.java:442)
at org.apache.hadoop.hdfs.server.datanode.BPServiceActor$CommandProcessingThread.processQueue(BPServiceActor.java:1291)
at org.apache.hadoop.hdfs.server.datanode.BPServiceActor$CommandProcessingThread.run(BPServiceActor.java:1275)
at __randomizedtesting.SeedInfo.seed([3DB45BF76357C8CC]:0)
FAILED: org.apache.solr.cloud.api.collections.ShardSplitTest.testSplitMixedReplicaTypesLink
Error Message:
Timeout occurred while waiting response from server at: http://127.0.0.1:38359/k_hfy/eg
Stack Trace:
org.apache.solr.client.solrj.SolrServerException: Timeout occurred while waiting response from server at: http://127.0.0.1:38359/k_hfy/eg
at __randomizedtesting.SeedInfo.seed([3DB45BF76357C8CC:1DA92AEC68F6355]:0)
at org.apache.solr.client.solrj.impl.HttpSolrClient.executeMethod(HttpSolrClient.java:692)
at org.apache.solr.client.solrj.impl.HttpSolrClient.request(HttpSolrClient.java:266)
at org.apache.solr.client.solrj.impl.HttpSolrClient.request(HttpSolrClient.java:248)
at org.apache.solr.client.solrj.impl.LBSolrClient.doRequest(LBSolrClient.java:369)
at org.apache.solr.client.solrj.impl.LBSolrClient.request(LBSolrClient.java:297)
at org.apache.solr.client.solrj.impl.BaseCloudSolrClient.sendRequest(BaseCloudSolrClient.java:1188)
at org.apache.solr.client.solrj.impl.BaseCloudSolrClient.requestWithRetryOnStaleState(BaseCloudSolrClient.java:934)
at org.apache.solr.client.solrj.impl.BaseCloudSolrClient.request(BaseCloudSolrClient.java:866)
at org.apache.solr.client.solrj.SolrRequest.process(SolrRequest.java:225)
at org.apache.solr.client.solrj.SolrRequest.process(SolrRequest.java:242)
at org.apache.solr.cloud.api.collections.ShardSplitTest.doSplitMixedReplicaTypes(ShardSplitTest.java:365)
at org.apache.solr.cloud.api.collections.ShardSplitTest.testSplitMixedReplicaTypesLink(ShardSplitTest.java:356)
at sun.reflect.NativeMethodAccessorImpl.invoke0(Native Method)
at sun.reflect.NativeMethodAccessorImpl.invoke(NativeMethodAccessorImpl.java:62)
at sun.reflect.DelegatingMethodAccessorImpl.invoke(DelegatingMethodAccessorImpl.java:43)
at java.lang.reflect.Method.invoke(Method.java:498)
at com.carrotsearch.randomizedtesting.RandomizedRunner.invoke(RandomizedRunner.java:1758)
at com.carrotsearch.randomizedtesting.RandomizedRunner$8.evaluate(RandomizedRunner.java:946)
at com.carrotsearch.randomizedtesting.RandomizedRunner$9.evaluate(RandomizedRunner.java:982)
at com.carrotsearch.randomizedtesting.RandomizedRunner$10.evaluate(RandomizedRunner.java:996)
at org.apache.solr.BaseDistributedSearchTestCase$ShardsRepeatRule$ShardsFixedStatement.callStatement(BaseDistributedSearchTestCase.java:1084)
at org.apache.solr.BaseDistributedSearchTestCase$ShardsRepeatRule$ShardsStatement.evaluate(BaseDistributedSearchTestCase.java:1055)
at com.carrotsearch.randomizedtesting.rules.SystemPropertiesRestoreRule$1.evaluate(SystemPropertiesRestoreRule.java:80)
at org.junit.rules.RunRules.evaluate(RunRules.java:20)
at org.apache.lucene.util.TestRuleSetupTeardownChained$1.evaluate(TestRuleSetupTeardownChained.java:49)
at org.apache.lucene.util.AbstractBeforeAfterRule$1.evaluate(AbstractBeforeAfterRule.java:45)
at org.apache.lucene.util.TestRuleThreadAndTestName$1.evaluate(TestRuleThreadAndTestName.java:48)
at org.apache.lucene.util.TestRuleIgnoreAfterMaxFailures$1.evaluate(TestRuleIgnoreAfterMaxFailures.java:64)
at org.apache.lucene.util.TestRuleMarkFailure$1.evaluate(TestRuleMarkFailure.java:47)
at org.junit.rules.RunRules.evaluate(RunRules.java:20)
at com.carrotsearch.randomizedtesting.rules.StatementAdapter.evaluate(StatementAdapter.java:36)
at com.carrotsearch.randomizedtesting.ThreadLeakControl$StatementRunner.run(ThreadLeakControl.java:390)
at com.carrotsearch.randomizedtesting.ThreadLeakControl.forkTimeoutingTask(ThreadLeakControl.java:843)
at com.carrotsearch.randomizedtesting.ThreadLeakControl$3.evaluate(ThreadLeakControl.java:490)
at com.carrotsearch.randomizedtesting.RandomizedRunner.runSingleTest(RandomizedRunner.java:955)
at com.carrotsearch.randomizedtesting.RandomizedRunner$5.evaluate(RandomizedRunner.java:840)
at com.carrotsearch.randomizedtesting.RandomizedRunner$6.evaluate(RandomizedRunner.java:891)
at com.carrotsearch.randomizedtesting.RandomizedRunner$7.evaluate(RandomizedRunner.java:902)
at com.carrotsearch.randomizedtesting.rules.StatementAdapter.evaluate(StatementAdapter.java:36)
at com.carrotsearch.randomizedtesting.rules.SystemPropertiesRestoreRule$1.evaluate(SystemPropertiesRestoreRule.java:80)
at org.junit.rules.RunRules.evaluate(RunRules.java:20)
at org.apache.lucene.util.AbstractBeforeAfterRule$1.evaluate(AbstractBeforeAfterRule.java:45)
at com.carrotsearch.randomizedtesting.rules.StatementAdapter.evaluate(StatementAdapter.java:36)
at org.apache.lucene.util.TestRuleStoreClassName$1.evaluate(TestRuleStoreClassName.java:41)
at com.carrotsearch.randomizedtesting.rules.NoShadowingOrOverridesOnMethodsRule$1.evaluate(NoShadowingOrOverridesOnMethodsRule.java:40)
at com.carrotsearch.randomizedtesting.rules.NoShadowingOrOverridesOnMethodsRule$1.evaluate(NoShadowingOrOverridesOnMethodsRule.java:40)
at com.carrotsearch.randomizedtesting.rules.StatementAdapter.evaluate(StatementAdapter.java:36)
at com.carrotsearch.randomizedtesting.rules.StatementAdapter.evaluate(StatementAdapter.java:36)
at com.carrotsearch.randomizedtesting.rules.StatementAdapter.evaluate(StatementAdapter.java:36)
at org.apache.lucene.util.TestRuleAssertionsRequired$1.evaluate(TestRuleAssertionsRequired.java:53)
at org.apache.lucene.util.TestRuleMarkFailure$1.evaluate(TestRuleMarkFailure.java:47)
at org.apache.lucene.util.TestRuleIgnoreAfterMaxFailures$1.evaluate(TestRuleIgnoreAfterMaxFailures.java:64)
at org.apache.lucene.util.TestRuleIgnoreTestSuites$1.evaluate(TestRuleIgnoreTestSuites.java:54)
at org.junit.rules.RunRules.evaluate(RunRules.java:20)
at com.carrotsearch.randomizedtesting.rules.StatementAdapter.evaluate(StatementAdapter.java:36)
at com.carrotsearch.randomizedtesting.ThreadLeakControl$StatementRunner.run(ThreadLeakControl.java:390)
at com.carrotsearch.randomizedtesting.ThreadLeakControl.lambda$forkTimeoutingTask$0(ThreadLeakControl.java:850)
at java.lang.Thread.run(Thread.java:750)
Caused by: java.net.SocketTimeoutException: Read timed out
at java.net.SocketInputStream.socketRead0(Native Method)
at java.net.SocketInputStream.socketRead(SocketInputStream.java:116)
at java.net.SocketInputStream.read(SocketInputStream.java:171)
at java.net.SocketInputStream.read(SocketInputStream.java:141)
at org.apache.http.impl.io.SessionInputBufferImpl.streamRead(SessionInputBufferImpl.java:137)
at org.apache.http.impl.io.SessionInputBufferImpl.fillBuffer(SessionInputBufferImpl.java:153)
at org.apache.http.impl.io.SessionInputBufferImpl.readLine(SessionInputBufferImpl.java:280)
at org.apache.http.impl.conn.DefaultHttpResponseParser.parseHead(DefaultHttpResponseParser.java:138)
at org.apache.http.impl.conn.DefaultHttpResponseParser.parseHead(DefaultHttpResponseParser.java:56)
at org.apache.http.impl.io.AbstractMessageParser.parse(AbstractMessageParser.java:259)
at org.apache.http.impl.DefaultBHttpClientConnection.receiveResponseHeader(DefaultBHttpClientConnection.java:163)
at org.apache.http.impl.conn.CPoolProxy.receiveResponseHeader(CPoolProxy.java:157)
at org.apache.http.protocol.HttpRequestExecutor.doReceiveResponse(HttpRequestExecutor.java:273)
at org.apache.http.protocol.HttpRequestExecutor.execute(HttpRequestExecutor.java:125)
at org.apache.http.impl.execchain.MainClientExec.execute(MainClientExec.java:272)
at org.apache.http.impl.execchain.ProtocolExec.execute(ProtocolExec.java:186)
at org.apache.http.impl.execchain.RetryExec.execute(RetryExec.java:89)
at org.apache.http.impl.execchain.RedirectExec.execute(RedirectExec.java:110)
at org.apache.http.impl.client.InternalHttpClient.doExecute(InternalHttpClient.java:185)
at org.apache.http.impl.client.CloseableHttpClient.execute(CloseableHttpClient.java:83)
at org.apache.http.impl.client.CloseableHttpClient.execute(CloseableHttpClient.java:56)
at org.apache.solr.client.solrj.impl.HttpSolrClient.executeMethod(HttpSolrClient.java:571)
... 57 more
FAILED: org.apache.solr.cloud.api.collections.ShardSplitTest.testSplitMixedReplicaTypes
Error Message:
Timeout occurred while waiting response from server at: http://127.0.0.1:43557/k_hfy/eg
Stack Trace:
org.apache.solr.client.solrj.SolrServerException: Timeout occurred while waiting response from server at: http://127.0.0.1:43557/k_hfy/eg
at __randomizedtesting.SeedInfo.seed([3DB45BF76357C8CC:85770F579F8C1DB9]:0)
at org.apache.solr.client.solrj.impl.HttpSolrClient.executeMethod(HttpSolrClient.java:692)
at org.apache.solr.client.solrj.impl.HttpSolrClient.request(HttpSolrClient.java:266)
at org.apache.solr.client.solrj.impl.HttpSolrClient.request(HttpSolrClient.java:248)
at org.apache.solr.client.solrj.impl.LBSolrClient.doRequest(LBSolrClient.java:369)
at org.apache.solr.client.solrj.impl.LBSolrClient.request(LBSolrClient.java:297)
at org.apache.solr.client.solrj.impl.BaseCloudSolrClient.sendRequest(BaseCloudSolrClient.java:1188)
at org.apache.solr.client.solrj.impl.BaseCloudSolrClient.requestWithRetryOnStaleState(BaseCloudSolrClient.java:934)
at org.apache.solr.client.solrj.impl.BaseCloudSolrClient.request(BaseCloudSolrClient.java:866)
at org.apache.solr.client.solrj.SolrRequest.process(SolrRequest.java:225)
at org.apache.solr.client.solrj.SolrRequest.process(SolrRequest.java:242)
at org.apache.solr.cloud.api.collections.ShardSplitTest.doSplitMixedReplicaTypes(ShardSplitTest.java:365)
at org.apache.solr.cloud.api.collections.ShardSplitTest.testSplitMixedReplicaTypes(ShardSplitTest.java:350)
at sun.reflect.NativeMethodAccessorImpl.invoke0(Native Method)
at sun.reflect.NativeMethodAccessorImpl.invoke(NativeMethodAccessorImpl.java:62)
at sun.reflect.DelegatingMethodAccessorImpl.invoke(DelegatingMethodAccessorImpl.java:43)
at java.lang.reflect.Method.invoke(Method.java:498)
at com.carrotsearch.randomizedtesting.RandomizedRunner.invoke(RandomizedRunner.java:1758)
at com.carrotsearch.randomizedtesting.RandomizedRunner$8.evaluate(RandomizedRunner.java:946)
at com.carrotsearch.randomizedtesting.RandomizedRunner$9.evaluate(RandomizedRunner.java:982)
at com.carrotsearch.randomizedtesting.RandomizedRunner$10.evaluate(RandomizedRunner.java:996)
at org.apache.solr.BaseDistributedSearchTestCase$ShardsRepeatRule$ShardsFixedStatement.callStatement(BaseDistributedSearchTestCase.java:1084)
at org.apache.solr.BaseDistributedSearchTestCase$ShardsRepeatRule$ShardsStatement.evaluate(BaseDistributedSearchTestCase.java:1055)
at com.carrotsearch.randomizedtesting.rules.SystemPropertiesRestoreRule$1.evaluate(SystemPropertiesRestoreRule.java:80)
at org.junit.rules.RunRules.evaluate(RunRules.java:20)
at org.apache.lucene.util.TestRuleSetupTeardownChained$1.evaluate(TestRuleSetupTeardownChained.java:49)
at org.apache.lucene.util.AbstractBeforeAfterRule$1.evaluate(AbstractBeforeAfterRule.java:45)
at org.apache.lucene.util.TestRuleThreadAndTestName$1.evaluate(TestRuleThreadAndTestName.java:48)
at org.apache.lucene.util.TestRuleIgnoreAfterMaxFailures$1.evaluate(TestRuleIgnoreAfterMaxFailures.java:64)
at org.apache.lucene.util.TestRuleMarkFailure$1.evaluate(TestRuleMarkFailure.java:47)
at org.junit.rules.RunRules.evaluate(RunRules.java:20)
at com.carrotsearch.randomizedtesting.rules.StatementAdapter.evaluate(StatementAdapter.java:36)
at com.carrotsearch.randomizedtesting.ThreadLeakControl$StatementRunner.run(ThreadLeakControl.java:390)
at com.carrotsearch.randomizedtesting.ThreadLeakControl.forkTimeoutingTask(ThreadLeakControl.java:843)
at com.carrotsearch.randomizedtesting.ThreadLeakControl$3.evaluate(ThreadLeakControl.java:490)
at com.carrotsearch.randomizedtesting.RandomizedRunner.runSingleTest(RandomizedRunner.java:955)
at com.carrotsearch.randomizedtesting.RandomizedRunner$5.evaluate(RandomizedRunner.java:840)
at com.carrotsearch.randomizedtesting.RandomizedRunner$6.evaluate(RandomizedRunner.java:891)
at com.carrotsearch.randomizedtesting.RandomizedRunner$7.evaluate(RandomizedRunner.java:902)
at com.carrotsearch.randomizedtesting.rules.StatementAdapter.evaluate(StatementAdapter.java:36)
at com.carrotsearch.randomizedtesting.rules.SystemPropertiesRestoreRule$1.evaluate(SystemPropertiesRestoreRule.java:80)
at org.junit.rules.RunRules.evaluate(RunRules.java:20)
at org.apache.lucene.util.AbstractBeforeAfterRule$1.evaluate(AbstractBeforeAfterRule.java:45)
at com.carrotsearch.randomizedtesting.rules.StatementAdapter.evaluate(StatementAdapter.java:36)
at org.apache.lucene.util.TestRuleStoreClassName$1.evaluate(TestRuleStoreClassName.java:41)
at com.carrotsearch.randomizedtesting.rules.NoShadowingOrOverridesOnMethodsRule$1.evaluate(NoShadowingOrOverridesOnMethodsRule.java:40)
at com.carrotsearch.randomizedtesting.rules.NoShadowingOrOverridesOnMethodsRule$1.evaluate(NoShadowingOrOverridesOnMethodsRule.java:40)
at com.carrotsearch.randomizedtesting.rules.StatementAdapter.evaluate(StatementAdapter.java:36)
at com.carrotsearch.randomizedtesting.rules.StatementAdapter.evaluate(StatementAdapter.java:36)
at com.carrotsearch.randomizedtesting.rules.StatementAdapter.evaluate(StatementAdapter.java:36)
at org.apache.lucene.util.TestRuleAssertionsRequired$1.evaluate(TestRuleAssertionsRequired.java:53)
at org.apache.lucene.util.TestRuleMarkFailure$1.evaluate(TestRuleMarkFailure.java:47)
at org.apache.lucene.util.TestRuleIgnoreAfterMaxFailures$1.evaluate(TestRuleIgnoreAfterMaxFailures.java:64)
at org.apache.lucene.util.TestRuleIgnoreTestSuites$1.evaluate(TestRuleIgnoreTestSuites.java:54)
at org.junit.rules.RunRules.evaluate(RunRules.java:20)
at com.carrotsearch.randomizedtesting.rules.StatementAdapter.evaluate(StatementAdapter.java:36)
at com.carrotsearch.randomizedtesting.ThreadLeakControl$StatementRunner.run(ThreadLeakControl.java:390)
at com.carrotsearch.randomizedtesting.ThreadLeakControl.lambda$forkTimeoutingTask$0(ThreadLeakControl.java:850)
at java.lang.Thread.run(Thread.java:750)
Caused by: java.net.SocketTimeoutException: Read timed out
at java.net.SocketInputStream.socketRead0(Native Method)
at java.net.SocketInputStream.socketRead(SocketInputStream.java:116)
at java.net.SocketInputStream.read(SocketInputStream.java:171)
at java.net.SocketInputStream.read(SocketInputStream.java:141)
at org.apache.http.impl.io.SessionInputBufferImpl.streamRead(SessionInputBufferImpl.java:137)
at org.apache.http.impl.io.SessionInputBufferImpl.fillBuffer(SessionInputBufferImpl.java:153)
at org.apache.http.impl.io.SessionInputBufferImpl.readLine(SessionInputBufferImpl.java:280)
at org.apache.http.impl.conn.DefaultHttpResponseParser.parseHead(DefaultHttpResponseParser.java:138)
at org.apache.http.impl.conn.DefaultHttpResponseParser.parseHead(DefaultHttpResponseParser.java:56)
at org.apache.http.impl.io.AbstractMessageParser.parse(AbstractMessageParser.java:259)
at org.apache.http.impl.DefaultBHttpClientConnection.receiveResponseHeader(DefaultBHttpClientConnection.java:163)
at org.apache.http.impl.conn.CPoolProxy.receiveResponseHeader(CPoolProxy.java:157)
at org.apache.http.protocol.HttpRequestExecutor.doReceiveResponse(HttpRequestExecutor.java:273)
at org.apache.http.protocol.HttpRequestExecutor.execute(HttpRequestExecutor.java:125)
at org.apache.http.impl.execchain.MainClientExec.execute(MainClientExec.java:272)
at org.apache.http.impl.execchain.ProtocolExec.execute(ProtocolExec.java:186)
at org.apache.http.impl.execchain.RetryExec.execute(RetryExec.java:89)
at org.apache.http.impl.execchain.RedirectExec.execute(RedirectExec.java:110)
at org.apache.http.impl.client.InternalHttpClient.doExecute(InternalHttpClient.java:185)
at org.apache.http.impl.client.CloseableHttpClient.execute(CloseableHttpClient.java:83)
at org.apache.http.impl.client.CloseableHttpClient.execute(CloseableHttpClient.java:56)
at org.apache.solr.client.solrj.impl.HttpSolrClient.executeMethod(HttpSolrClient.java:571)
... 57 more
Build Log:
[...truncated 14691 lines...]
[junit4] Suite: org.apache.solr.cloud.api.collections.HdfsCloudIncrementalBackupTest
[junit4] 2> 932199 INFO (SUITE-HdfsCloudIncrementalBackupTest-seed#[3DB45BF76357C8CC]-worker) [ ] o.a.s.SolrTestCase Setting 'solr.default.confdir' system property to test-framework derived value of '/home/jenkins/jenkins-slave/workspace/Lucene/Lucene-Solr-Tests-8.11/solr/server/solr/configsets/_default/conf'
[junit4] 2> 932199 INFO (SUITE-HdfsCloudIncrementalBackupTest-seed#[3DB45BF76357C8CC]-worker) [ ] o.a.s.SolrTestCaseJ4 SecureRandom sanity checks: test.solr.allowed.securerandom=null & java.security.egd=file:/dev/./urandom
[junit4] 2> 932200 INFO (SUITE-HdfsCloudIncrementalBackupTest-seed#[3DB45BF76357C8CC]-worker) [ ] o.a.s.u.ErrorLogMuter Closing ErrorLogMuter-regex-219 after mutting 0 log messages
[junit4] 2> 932200 INFO (SUITE-HdfsCloudIncrementalBackupTest-seed#[3DB45BF76357C8CC]-worker) [ ] o.a.s.u.ErrorLogMuter Creating ErrorLogMuter-regex-220 for ERROR logs matching regex: ignore_exception
[junit4] 2> 932201 INFO (SUITE-HdfsCloudIncrementalBackupTest-seed#[3DB45BF76357C8CC]-worker) [ ] o.a.s.SolrTestCaseJ4 Created dataDir: /home/jenkins/jenkins-slave/workspace/Lucene/Lucene-Solr-Tests-8.11/solr/build/solr-core/test/J3/temp/solr.cloud.api.collections.HdfsCloudIncrementalBackupTest_3DB45BF76357C8CC-001/data-dir-102-001
[junit4] 2> 932201 INFO (SUITE-HdfsCloudIncrementalBackupTest-seed#[3DB45BF76357C8CC]-worker) [ ] o.a.s.SolrTestCaseJ4 Using TrieFields (NUMERIC_POINTS_SYSPROP=false) w/NUMERIC_DOCVALUES_SYSPROP=false
[junit4] 2> 932202 INFO (SUITE-HdfsCloudIncrementalBackupTest-seed#[3DB45BF76357C8CC]-worker) [ ] o.a.s.SolrTestCaseJ4 Randomized ssl (false) and clientAuth (false) via: @org.apache.solr.util.RandomizeSSL(reason=, ssl=NaN, value=NaN, clientAuth=NaN)
[junit4] 1> Formatting using clusterid: testClusterID
[junit4] 2> 932268 WARN (SUITE-HdfsCloudIncrementalBackupTest-seed#[3DB45BF76357C8CC]-worker) [ ] o.a.h.s.a.s.AuthenticationFilter Unable to initialize FileSignerSecretProvider, falling back to use random secrets. Reason: access denied ("java.io.FilePermission" "/home/jenkins/hadoop-http-auth-signature-secret" "read")
[junit4] 2> 932271 WARN (SUITE-HdfsCloudIncrementalBackupTest-seed#[3DB45BF76357C8CC]-worker) [ ] o.a.h.h.HttpRequestLog Jetty request log can only be enabled using Log4j
[junit4] 2> 932272 INFO (SUITE-HdfsCloudIncrementalBackupTest-seed#[3DB45BF76357C8CC]-worker) [ ] o.e.j.s.Server jetty-9.4.53.v20231009; built: 2023-10-09T12:29:09.265Z; git: 27bde00a0b95a1d5bbee0eae7984f891d2d0f8c9; jvm 1.8.0_362-b09
[junit4] 2> 932277 INFO (SUITE-HdfsCloudIncrementalBackupTest-seed#[3DB45BF76357C8CC]-worker) [ ] o.e.j.s.session DefaultSessionIdManager workerName=node0
[junit4] 2> 932277 INFO (SUITE-HdfsCloudIncrementalBackupTest-seed#[3DB45BF76357C8CC]-worker) [ ] o.e.j.s.session No SessionScavenger set, using defaults
[junit4] 2> 932277 INFO (SUITE-HdfsCloudIncrementalBackupTest-seed#[3DB45BF76357C8CC]-worker) [ ] o.e.j.s.session node0 Scavenging every 660000ms
[junit4] 2> 932277 INFO (SUITE-HdfsCloudIncrementalBackupTest-seed#[3DB45BF76357C8CC]-worker) [ ] o.e.j.s.h.ContextHandler Started o.e.j.s.ServletContextHandler@986287{static,/static,jar:file:/home/jenkins/.ivy2/cache/org.apache.hadoop/hadoop-hdfs/tests/hadoop-hdfs-3.2.4-tests.jar!/webapps/static,AVAILABLE}
[junit4] 2> 932391 INFO (SUITE-HdfsCloudIncrementalBackupTest-seed#[3DB45BF76357C8CC]-worker) [ ] o.e.j.s.h.ContextHandler Started o.e.j.w.WebAppContext@15bae213{hdfs,/,file:///home/jenkins/jenkins-slave/workspace/Lucene/Lucene-Solr-Tests-8.11/solr/build/solr-core/test/J3/temp/jetty-localhost-42603-hadoop-hdfs-3_2_4-tests_jar-_-any-2078868696785399862/webapp/,AVAILABLE}{jar:file:/home/jenkins/.ivy2/cache/org.apache.hadoop/hadoop-hdfs/tests/hadoop-hdfs-3.2.4-tests.jar!/webapps/hdfs}
[junit4] 2> 932391 INFO (SUITE-HdfsCloudIncrementalBackupTest-seed#[3DB45BF76357C8CC]-worker) [ ] o.e.j.s.AbstractConnector Started ServerConnector@4ca24eb6{HTTP/1.1, (http/1.1)}{localhost:42603}
[junit4] 2> 932391 INFO (SUITE-HdfsCloudIncrementalBackupTest-seed#[3DB45BF76357C8CC]-worker) [ ] o.e.j.s.Server Started @932463ms
[junit4] 2> 932462 WARN (Listener at localhost/35775) [ ] o.a.h.s.a.s.AuthenticationFilter Unable to initialize FileSignerSecretProvider, falling back to use random secrets. Reason: access denied ("java.io.FilePermission" "/home/jenkins/hadoop-http-auth-signature-secret" "read")
[junit4] 2> 932463 WARN (Listener at localhost/35775) [ ] o.a.h.h.HttpRequestLog Jetty request log can only be enabled using Log4j
[junit4] 2> 932464 INFO (Listener at localhost/35775) [ ] o.e.j.s.Server jetty-9.4.53.v20231009; built: 2023-10-09T12:29:09.265Z; git: 27bde00a0b95a1d5bbee0eae7984f891d2d0f8c9; jvm 1.8.0_362-b09
[junit4] 2> 932466 INFO (Listener at localhost/35775) [ ] o.e.j.s.session DefaultSessionIdManager workerName=node0
[junit4] 2> 932466 INFO (Listener at localhost/35775) [ ] o.e.j.s.session No SessionScavenger set, using defaults
[junit4] 2> 932466 INFO (Listener at localhost/35775) [ ] o.e.j.s.session node0 Scavenging every 600000ms
[junit4] 2> 932466 INFO (Listener at localhost/35775) [ ] o.e.j.s.h.ContextHandler Started o.e.j.s.ServletContextHandler@74ecb9dc{static,/static,jar:file:/home/jenkins/.ivy2/cache/org.apache.hadoop/hadoop-hdfs/tests/hadoop-hdfs-3.2.4-tests.jar!/webapps/static,AVAILABLE}
[junit4] 2> 932578 INFO (Listener at localhost/35775) [ ] o.e.j.s.h.ContextHandler Started o.e.j.w.WebAppContext@61b19abb{datanode,/,file:///home/jenkins/jenkins-slave/workspace/Lucene/Lucene-Solr-Tests-8.11/solr/build/solr-core/test/J3/temp/jetty-localhost-38077-hadoop-hdfs-3_2_4-tests_jar-_-any-4520365821120806612/webapp/,AVAILABLE}{jar:file:/home/jenkins/.ivy2/cache/org.apache.hadoop/hadoop-hdfs/tests/hadoop-hdfs-3.2.4-tests.jar!/webapps/datanode}
[junit4] 2> 932578 INFO (Listener at localhost/35775) [ ] o.e.j.s.AbstractConnector Started ServerConnector@15318fb4{HTTP/1.1, (http/1.1)}{localhost:38077}
[junit4] 2> 932578 INFO (Listener at localhost/35775) [ ] o.e.j.s.Server Started @932650ms
[junit4] 2> 932649 WARN (Listener at localhost/38837) [ ] o.a.h.s.a.s.AuthenticationFilter Unable to initialize FileSignerSecretProvider, falling back to use random secrets. Reason: access denied ("java.io.FilePermission" "/home/jenkins/hadoop-http-auth-signature-secret" "read")
[junit4] 2> 932651 WARN (Listener at localhost/38837) [ ] o.a.h.h.HttpRequestLog Jetty request log can only be enabled using Log4j
[junit4] 2> 932652 INFO (Listener at localhost/38837) [ ] o.e.j.s.Server jetty-9.4.53.v20231009; built: 2023-10-09T12:29:09.265Z; git: 27bde00a0b95a1d5bbee0eae7984f891d2d0f8c9; jvm 1.8.0_362-b09
[junit4] 2> 932663 INFO (Listener at localhost/38837) [ ] o.e.j.s.session DefaultSessionIdManager workerName=node0
[junit4] 2> 932663 INFO (Listener at localhost/38837) [ ] o.e.j.s.session No SessionScavenger set, using defaults
[junit4] 2> 932663 INFO (Listener at localhost/38837) [ ] o.e.j.s.session node0 Scavenging every 660000ms
[junit4] 2> 932664 INFO (Listener at localhost/38837) [ ] o.e.j.s.h.ContextHandler Started o.e.j.s.ServletContextHandler@4a55b622{static,/static,jar:file:/home/jenkins/.ivy2/cache/org.apache.hadoop/hadoop-hdfs/tests/hadoop-hdfs-3.2.4-tests.jar!/webapps/static,AVAILABLE}
[junit4] 2> 932733 INFO (Block report processor) [ ] BlockStateChange BLOCK* processReport 0x7db9ea1d8622c5e3: Processing first storage report for DS-475f6e7a-b78e-4e91-8af2-7e41d3d307d9 from datanode DatanodeRegistration(127.0.0.1:34063, datanodeUuid=c16c8a77-b0b6-4d05-8ae0-a9ecae0aa80f, infoPort=46363, infoSecurePort=0, ipcPort=38837, storageInfo=lv=-57;cid=testClusterID;nsid=1342912049;c=1703116613629)
[junit4] 2> 932733 INFO (Block report processor) [ ] BlockStateChange BLOCK* processReport 0x7db9ea1d8622c5e3: from storage DS-475f6e7a-b78e-4e91-8af2-7e41d3d307d9 node DatanodeRegistration(127.0.0.1:34063, datanodeUuid=c16c8a77-b0b6-4d05-8ae0-a9ecae0aa80f, infoPort=46363, infoSecurePort=0, ipcPort=38837, storageInfo=lv=-57;cid=testClusterID;nsid=1342912049;c=1703116613629), blocks: 0, hasStaleStorage: true, processing time: 0 msecs, invalidatedBlocks: 0
[junit4] 2> 932733 INFO (Block report processor) [ ] BlockStateChange BLOCK* processReport 0x7db9ea1d8622c5e3: Processing first storage report for DS-9a841537-154e-4fe7-8066-afc39aa46418 from datanode DatanodeRegistration(127.0.0.1:34063, datanodeUuid=c16c8a77-b0b6-4d05-8ae0-a9ecae0aa80f, infoPort=46363, infoSecurePort=0, ipcPort=38837, storageInfo=lv=-57;cid=testClusterID;nsid=1342912049;c=1703116613629)
[junit4] 2> 932733 INFO (Block report processor) [ ] BlockStateChange BLOCK* processReport 0x7db9ea1d8622c5e3: from storage DS-9a841537-154e-4fe7-8066-afc39aa46418 node DatanodeRegistration(127.0.0.1:34063, datanodeUuid=c16c8a77-b0b6-4d05-8ae0-a9ecae0aa80f, infoPort=46363, infoSecurePort=0, ipcPort=38837, storageInfo=lv=-57;cid=testClusterID;nsid=1342912049;c=1703116613629), blocks: 0, hasStaleStorage: false, processing time: 0 msecs, invalidatedBlocks: 0
[junit4] 2> 932783 INFO (Listener at localhost/38837) [ ] o.e.j.s.h.ContextHandler Started o.e.j.w.WebAppContext@3e4497ea{datanode,/,file:///home/jenkins/jenkins-slave/workspace/Lucene/Lucene-Solr-Tests-8.11/solr/build/solr-core/test/J3/temp/jetty-localhost-35605-hadoop-hdfs-3_2_4-tests_jar-_-any-8460966805319524427/webapp/,AVAILABLE}{jar:file:/home/jenkins/.ivy2/cache/org.apache.hadoop/hadoop-hdfs/tests/hadoop-hdfs-3.2.4-tests.jar!/webapps/datanode}
[junit4] 2> 932784 INFO (Listener at localhost/38837) [ ] o.e.j.s.AbstractConnector Started ServerConnector@4519b399{HTTP/1.1, (http/1.1)}{localhost:35605}
[junit4] 2> 932784 INFO (Listener at localhost/38837) [ ] o.e.j.s.Server Started @932855ms
[junit4] 2> 932876 INFO (Block report processor) [ ] BlockStateChange BLOCK* processReport 0xb996b980fdb4c96a: Processing first storage report for DS-31bc7f21-f98b-4f31-9270-b73649de248b from datanode DatanodeRegistration(127.0.0.1:37087, datanodeUuid=2218f22e-3e32-4864-9ab7-3041b98ae6c7, infoPort=38117, infoSecurePort=0, ipcPort=33409, storageInfo=lv=-57;cid=testClusterID;nsid=1342912049;c=1703116613629)
[junit4] 2> 932876 INFO (Block report processor) [ ] BlockStateChange BLOCK* processReport 0xb996b980fdb4c96a: from storage DS-31bc7f21-f98b-4f31-9270-b73649de248b node DatanodeRegistration(127.0.0.1:37087, datanodeUuid=2218f22e-3e32-4864-9ab7-3041b98ae6c7, infoPort=38117, infoSecurePort=0, ipcPort=33409, storageInfo=lv=-57;cid=testClusterID;nsid=1342912049;c=1703116613629), blocks: 0, hasStaleStorage: true, processing time: 0 msecs, invalidatedBlocks: 0
[junit4] 2> 932876 INFO (Block report processor) [ ] BlockStateChange BLOCK* processReport 0xb996b980fdb4c96a: Processing first storage report for DS-8de79281-3d57-422e-a03f-6293196bf93d from datanode DatanodeRegistration(127.0.0.1:37087, datanodeUuid=2218f22e-3e32-4864-9ab7-3041b98ae6c7, infoPort=38117, infoSecurePort=0, ipcPort=33409, storageInfo=lv=-57;cid=testClusterID;nsid=1342912049;c=1703116613629)
[junit4] 2> 932876 INFO (Block report processor) [ ] BlockStateChange BLOCK* processReport 0xb996b980fdb4c96a: from storage DS-8de79281-3d57-422e-a03f-6293196bf93d node DatanodeRegistration(127.0.0.1:37087, datanodeUuid=2218f22e-3e32-4864-9ab7-3041b98ae6c7, infoPort=38117, infoSecurePort=0, ipcPort=33409, storageInfo=lv=-57;cid=testClusterID;nsid=1342912049;c=1703116613629), blocks: 0, hasStaleStorage: false, processing time: 0 msecs, invalidatedBlocks: 0
[junit4] 2> 932926 INFO (Listener at localhost/33409) [ ] o.a.s.c.MiniSolrCloudCluster Starting cluster of 2 servers in /home/jenkins/jenkins-slave/workspace/Lucene/Lucene-Solr-Tests-8.11/solr/build/solr-core/test/J3/temp/solr.cloud.api.collections.HdfsCloudIncrementalBackupTest_3DB45BF76357C8CC-001/tempDir-002
[junit4] 2> 932926 INFO (Listener at localhost/33409) [ ] o.a.s.c.ZkTestServer STARTING ZK TEST SERVER
[junit4] 2> 932927 INFO (ZkTestServer Run Thread) [ ] o.a.s.c.ZkTestServer client port: 0.0.0.0/0.0.0.0:0
[junit4] 2> 932927 INFO (ZkTestServer Run Thread) [ ] o.a.s.c.ZkTestServer Starting server
[junit4] 2> 932928 WARN (ZkTestServer Run Thread) [ ] o.a.z.s.ServerCnxnFactory maxCnxns is not configured, using default value 0.
[junit4] 2> 933027 INFO (Listener at localhost/33409) [ ] o.a.s.c.ZkTestServer start zk server on port: 41247
[junit4] 2> 933027 INFO (Listener at localhost/33409) [ ] o.a.s.c.ZkTestServer waitForServerUp: 127.0.0.1:41247
[junit4] 2> 933027 INFO (Listener at localhost/33409) [ ] o.a.s.c.ZkTestServer parse host and port list: 127.0.0.1:41247
[junit4] 2> 933027 INFO (Listener at localhost/33409) [ ] o.a.s.c.ZkTestServer connecting to 127.0.0.1 41247
[junit4] 2> 933029 INFO (Listener at localhost/33409) [ ] o.a.s.c.c.ConnectionManager Waiting for client to connect to ZooKeeper
[junit4] 2> 933034 INFO (zkConnectionManagerCallback-10070-thread-1) [ ] o.a.s.c.c.ConnectionManager zkClient has connected
[junit4] 2> 933035 INFO (Listener at localhost/33409) [ ] o.a.s.c.c.ConnectionManager Client is connected to ZooKeeper
[junit4] 2> 933047 INFO (Listener at localhost/33409) [ ] o.a.s.c.c.ConnectionManager Waiting for client to connect to ZooKeeper
[junit4] 2> 933049 INFO (zkConnectionManagerCallback-10072-thread-1) [ ] o.a.s.c.c.ConnectionManager zkClient has connected
[junit4] 2> 933049 INFO (Listener at localhost/33409) [ ] o.a.s.c.c.ConnectionManager Client is connected to ZooKeeper
[junit4] 2> 933050 INFO (Listener at localhost/33409) [ ] o.a.s.c.c.ConnectionManager Waiting for client to connect to ZooKeeper
[junit4] 2> 933051 INFO (zkConnectionManagerCallback-10074-thread-1) [ ] o.a.s.c.c.ConnectionManager zkClient has connected
[junit4] 2> 933051 INFO (Listener at localhost/33409) [ ] o.a.s.c.c.ConnectionManager Client is connected to ZooKeeper
[junit4] 2> 933157 INFO (jetty-launcher-10075-thread-2) [ ] o.a.s.c.s.e.JettySolrRunner Start Jetty (configured port=0, binding port=0)
[junit4] 2> 933157 INFO (jetty-launcher-10075-thread-2) [ ] o.a.s.c.s.e.JettySolrRunner Trying to start Jetty on port 0 try number 2 ...
[junit4] 2> 933157 INFO (jetty-launcher-10075-thread-2) [ ] o.e.j.s.Server jetty-9.4.53.v20231009; built: 2023-10-09T12:29:09.265Z; git: 27bde00a0b95a1d5bbee0eae7984f891d2d0f8c9; jvm 1.8.0_362-b09
[junit4] 2> 933158 INFO (jetty-launcher-10075-thread-2) [ ] o.e.j.s.session DefaultSessionIdManager workerName=node0
[junit4] 2> 933158 INFO (jetty-launcher-10075-thread-2) [ ] o.e.j.s.session No SessionScavenger set, using defaults
[junit4] 2> 933158 INFO (jetty-launcher-10075-thread-2) [ ] o.e.j.s.session node0 Scavenging every 600000ms
[junit4] 2> 933158 INFO (jetty-launcher-10075-thread-2) [ ] o.e.j.s.h.ContextHandler Started o.e.j.s.ServletContextHandler@51cc4589{/solr,null,AVAILABLE}
[junit4] 2> 933159 INFO (jetty-launcher-10075-thread-2) [ ] o.e.j.s.AbstractConnector Started ServerConnector@5a20fa37{HTTP/1.1, (http/1.1, h2c)}{127.0.0.1:42255}
[junit4] 2> 933159 INFO (jetty-launcher-10075-thread-2) [ ] o.e.j.s.Server Started @933230ms
[junit4] 2> 933159 INFO (jetty-launcher-10075-thread-2) [ ] o.a.s.c.s.e.JettySolrRunner Jetty properties: {hostContext=/solr, zkHost=127.0.0.1:41247/solr, hostPort=42255}
[junit4] 2> 933159 ERROR (jetty-launcher-10075-thread-2) [ ] o.a.s.u.StartupLoggingUtils Missing Java Option solr.log.dir. Logging may be missing or incomplete.
[junit4] 2> 933159 INFO (jetty-launcher-10075-thread-2) [ ] o.a.s.s.SolrDispatchFilter Using logger factory org.apache.logging.slf4j.Log4jLoggerFactory
[junit4] 2> 933159 INFO (jetty-launcher-10075-thread-2) [ ] o.a.s.s.SolrDispatchFilter ___ _ Welcome to Apache Solr? version 8.11.3
[junit4] 2> 933159 INFO (jetty-launcher-10075-thread-2) [ ] o.a.s.s.SolrDispatchFilter / __| ___| |_ _ Starting in cloud mode on port null
[junit4] 2> 933159 INFO (jetty-launcher-10075-thread-2) [ ] o.a.s.s.SolrDispatchFilter \__ \/ _ \ | '_| Install dir: /home/jenkins/jenkins-slave/workspace/Lucene/Lucene-Solr-Tests-8.11/solr
[junit4] 2> 933159 INFO (jetty-launcher-10075-thread-2) [ ] o.a.s.s.SolrDispatchFilter |___/\___/_|_| Start time: 2023-12-20T23:56:54.560Z
[junit4] 2> 933160 INFO (jetty-launcher-10075-thread-1) [ ] o.a.s.c.s.e.JettySolrRunner Start Jetty (configured port=0, binding port=0)
[junit4] 2> 933160 INFO (jetty-launcher-10075-thread-1) [ ] o.a.s.c.s.e.JettySolrRunner Trying to start Jetty on port 0 try number 2 ...
[junit4] 2> 933160 INFO (jetty-launcher-10075-thread-1) [ ] o.e.j.s.Server jetty-9.4.53.v20231009; built: 2023-10-09T12:29:09.265Z; git: 27bde00a0b95a1d5bbee0eae7984f891d2d0f8c9; jvm 1.8.0_362-b09
[junit4] 2> 933162 INFO (jetty-launcher-10075-thread-2) [ ] o.a.s.c.c.ConnectionManager Waiting for client to connect to ZooKeeper
[junit4] 2> 933165 INFO (zkConnectionManagerCallback-10077-thread-1) [ ] o.a.s.c.c.ConnectionManager zkClient has connected
[junit4] 2> 933165 INFO (jetty-launcher-10075-thread-2) [ ] o.a.s.c.c.ConnectionManager Client is connected to ZooKeeper
[junit4] 2> 933166 INFO (jetty-launcher-10075-thread-1) [ ] o.e.j.s.session DefaultSessionIdManager workerName=node0
[junit4] 2> 933166 INFO (jetty-launcher-10075-thread-1) [ ] o.e.j.s.session No SessionScavenger set, using defaults
[junit4] 2> 933166 INFO (jetty-launcher-10075-thread-1) [ ] o.e.j.s.session node0 Scavenging every 600000ms
[junit4] 2> 933166 INFO (jetty-launcher-10075-thread-2) [ ] o.a.s.s.SolrDispatchFilter solr.xml found in ZooKeeper. Loading...
[junit4] 2> 933167 INFO (jetty-launcher-10075-thread-1) [ ] o.e.j.s.h.ContextHandler Started o.e.j.s.ServletContextHandler@59f76707{/solr,null,AVAILABLE}
[junit4] 2> 933167 INFO (jetty-launcher-10075-thread-1) [ ] o.e.j.s.AbstractConnector Started ServerConnector@cb6034{HTTP/1.1, (http/1.1, h2c)}{127.0.0.1:45733}
[junit4] 2> 933167 INFO (jetty-launcher-10075-thread-1) [ ] o.e.j.s.Server Started @933239ms
[junit4] 2> 933167 INFO (jetty-launcher-10075-thread-1) [ ] o.a.s.c.s.e.JettySolrRunner Jetty properties: {hostContext=/solr, zkHost=127.0.0.1:41247/solr, hostPort=45733}
[junit4] 2> 933167 ERROR (jetty-launcher-10075-thread-1) [ ] o.a.s.u.StartupLoggingUtils Missing Java Option solr.log.dir. Logging may be missing or incomplete.
[junit4] 2> 933167 INFO (jetty-launcher-10075-thread-1) [ ] o.a.s.s.SolrDispatchFilter Using logger factory org.apache.logging.slf4j.Log4jLoggerFactory
[junit4] 2> 933167 INFO (jetty-launcher-10075-thread-1) [ ] o.a.s.s.SolrDispatchFilter ___ _ Welcome to Apache Solr? version 8.11.3
[junit4] 2> 933167 INFO (jetty-launcher-10075-thread-1) [ ] o.a.s.s.SolrDispatchFilter / __| ___| |_ _ Starting in cloud mode on port null
[junit4] 2> 933167 INFO (jetty-launcher-10075-thread-1) [ ] o.a.s.s.SolrDispatchFilter \__ \/ _ \ | '_| Install dir: /home/jenkins/jenkins-slave/workspace/Lucene/Lucene-Solr-Tests-8.11/solr
[junit4] 2> 933167 INFO (jetty-launcher-10075-thread-1) [ ] o.a.s.s.SolrDispatchFilter |___/\___/_|_| Start time: 2023-12-20T23:56:54.568Z
[junit4] 2> 933171 INFO (jetty-launcher-10075-thread-2) [ ] o.a.s.c.SolrXmlConfig MBean server found: com.sun.jmx.mbeanserver.JmxMBeanServer@5a7b4e7e, but no JMX reporters were configured - adding default JMX reporter.
[junit4] 2> 933171 INFO (jetty-launcher-10075-thread-1) [ ] o.a.s.c.c.ConnectionManager Waiting for client to connect to ZooKeeper
[junit4] 2> 933175 INFO (zkConnectionManagerCallback-10079-thread-1) [ ] o.a.s.c.c.ConnectionManager zkClient has connected
[junit4] 2> 933175 INFO (jetty-launcher-10075-thread-1) [ ] o.a.s.c.c.ConnectionManager Client is connected to ZooKeeper
[junit4] 2> 933175 INFO (jetty-launcher-10075-thread-1) [ ] o.a.s.s.SolrDispatchFilter solr.xml found in ZooKeeper. Loading...
[junit4] 2> 933195 INFO (jetty-launcher-10075-thread-1) [ ] o.a.s.c.SolrXmlConfig MBean server found: com.sun.jmx.mbeanserver.JmxMBeanServer@5a7b4e7e, but no JMX reporters were configured - adding default JMX reporter.
[junit4] 2> 933196 WARN (jetty-launcher-10075-thread-1-SendThread(127.0.0.1:41247)) [ ] o.a.z.ClientCnxn An exception was thrown while closing send thread for session 0x100419fdd300004.
[junit4] 2> => EndOfStreamException: Unable to read additional data from server sessionid 0x100419fdd300004, likely server has closed socket
[junit4] 2> at org.apache.zookeeper.ClientCnxnSocketNIO.doIO(ClientCnxnSocketNIO.java:77)
[junit4] 2> org.apache.zookeeper.ClientCnxn$EndOfStreamException: Unable to read additional data from server sessionid 0x100419fdd300004, likely server has closed socket
[junit4] 2> at org.apache.zookeeper.ClientCnxnSocketNIO.doIO(ClientCnxnSocketNIO.java:77) ~[zookeeper-3.6.2.jar:3.6.2]
[junit4] 2> at org.apache.zookeeper.ClientCnxnSocketNIO.doTransport(ClientCnxnSocketNIO.java:350) ~[zookeeper-3.6.2.jar:3.6.2]
[junit4] 2> at org.apache.zookeeper.ClientCnxn$SendThread.run(ClientCnxn.java:1275) [zookeeper-3.6.2.jar:3.6.2]
[junit4] 2> 933632 INFO (jetty-launcher-10075-thread-2) [ ] o.a.s.h.c.HttpShardHandlerFactory Host whitelist initialized: WhitelistHostChecker [whitelistHosts=null, whitelistHostCheckingEnabled=true]
[junit4] 2> 933633 WARN (jetty-launcher-10075-thread-2) [ ] o.e.j.u.s.S.config Trusting all certificates configured for Client@7d75336a[provider=null,keyStore=null,trustStore=null]
[junit4] 2> 933633 WARN (jetty-launcher-10075-thread-2) [ ] o.e.j.u.s.S.config No Client EndPointIdentificationAlgorithm configured for Client@7d75336a[provider=null,keyStore=null,trustStore=null]
[junit4] 2> 933636 WARN (jetty-launcher-10075-thread-2) [ ] o.e.j.u.s.S.config Trusting all certificates configured for Client@5d93ac2[provider=null,keyStore=null,trustStore=null]
[junit4] 2> 933636 WARN (jetty-launcher-10075-thread-2) [ ] o.e.j.u.s.S.config No Client EndPointIdentificationAlgorithm configured for Client@5d93ac2[provider=null,keyStore=null,trustStore=null]
[junit4] 2> 933637 INFO (jetty-launcher-10075-thread-2) [ ] o.a.s.c.ZkContainer Zookeeper client=127.0.0.1:41247/solr
[junit4] 2> 933638 INFO (jetty-launcher-10075-thread-2) [ ] o.a.s.c.c.ConnectionManager Waiting for client to connect to ZooKeeper
[junit4] 2> 933638 INFO (zkConnectionManagerCallback-10093-thread-1) [ ] o.a.s.c.c.ConnectionManager zkClient has connected
[junit4] 2> 933638 INFO (jetty-launcher-10075-thread-2) [ ] o.a.s.c.c.ConnectionManager Client is connected to ZooKeeper
[junit4] 2> 933741 INFO (jetty-launcher-10075-thread-2) [n:127.0.0.1:42255_solr ] o.a.s.c.c.ConnectionManager Waiting for client to connect to ZooKeeper
[junit4] 2> 933743 INFO (zkConnectionManagerCallback-10095-thread-1) [ ] o.a.s.c.c.ConnectionManager zkClient has connected
[junit4] 2> 933743 INFO (jetty-launcher-10075-thread-2) [n:127.0.0.1:42255_solr ] o.a.s.c.c.ConnectionManager Client is connected to ZooKeeper
[junit4] 2> 933773 INFO (jetty-launcher-10075-thread-1) [ ] o.a.s.h.c.HttpShardHandlerFactory Host whitelist initialized: WhitelistHostChecker [whitelistHosts=null, whitelistHostCheckingEnabled=true]
[junit4] 2> 933774 WARN (jetty-launcher-10075-thread-1) [ ] o.e.j.u.s.S.config Trusting all certificates configured for Client@513c95cf[provider=null,keyStore=null,trustStore=null]
[junit4] 2> 933774 WARN (jetty-launcher-10075-thread-1) [ ] o.e.j.u.s.S.config No Client EndPointIdentificationAlgorithm configured for Client@513c95cf[provider=null,keyStore=null,trustStore=null]
[junit4] 2> 933778 WARN (jetty-launcher-10075-thread-1) [ ] o.e.j.u.s.S.config Trusting all certificates configured for Client@4901725d[provider=null,keyStore=null,trustStore=null]
[junit4] 2> 933778 WARN (jetty-launcher-10075-thread-1) [ ] o.e.j.u.s.S.config No Client EndPointIdentificationAlgorithm configured for Client@4901725d[provider=null,keyStore=null,trustStore=null]
[junit4] 2> 933780 INFO (jetty-launcher-10075-thread-1) [ ] o.a.s.c.ZkContainer Zookeeper client=127.0.0.1:41247/solr
[junit4] 2> 933787 INFO (jetty-launcher-10075-thread-1) [ ] o.a.s.c.c.ConnectionManager Waiting for client to connect to ZooKeeper
[junit4] 2> 933794 INFO (zkConnectionManagerCallback-10105-thread-1) [ ] o.a.s.c.c.ConnectionManager zkClient has connected
[junit4] 2> 933794 INFO (jetty-launcher-10075-thread-1) [ ] o.a.s.c.c.ConnectionManager Client is connected to ZooKeeper
[junit4] 2> 933826 WARN (jetty-launcher-10075-thread-2) [n:127.0.0.1:42255_solr ] o.a.s.c.ZkController Contents of zookeeper /security.json are world-readable; consider setting up ACLs as described in https://solr.apache.org/guide/zookeeper-access-control.html
[junit4] 2> 933831 INFO (jetty-launcher-10075-thread-2) [n:127.0.0.1:42255_solr ] o.a.s.c.OverseerElectionContext I am going to be the leader 127.0.0.1:42255_solr
[junit4] 2> 933831 INFO (jetty-launcher-10075-thread-2) [n:127.0.0.1:42255_solr ] o.a.s.c.Overseer Overseer (id=72129748904443910-127.0.0.1:42255_solr-n_0000000000) starting
[junit4] 2> 933842 INFO (OverseerStateUpdate-72129748904443910-127.0.0.1:42255_solr-n_0000000000) [n:127.0.0.1:42255_solr ] o.a.s.c.Overseer Starting to work on the main queue : 127.0.0.1:42255_solr
[junit4] 2> 933842 INFO (jetty-launcher-10075-thread-2) [n:127.0.0.1:42255_solr ] o.a.s.c.ZkController Register node as live in ZooKeeper:/live_nodes/127.0.0.1:42255_solr
[junit4] 2> 933844 INFO (OverseerStateUpdate-72129748904443910-127.0.0.1:42255_solr-n_0000000000) [n:127.0.0.1:42255_solr ] o.a.s.c.c.ZkStateReader Updated live nodes from ZooKeeper... (0) -> (1)
[junit4] 2> 933846 INFO (jetty-launcher-10075-thread-2) [n:127.0.0.1:42255_solr ] o.a.s.c.ZkController non-data nodes now []
[junit4] 2> 933848 INFO (jetty-launcher-10075-thread-2) [n:127.0.0.1:42255_solr ] o.a.s.p.PackageLoader /packages.json updated to version -1
[junit4] 2> 933848 WARN (jetty-launcher-10075-thread-2) [n:127.0.0.1:42255_solr ] o.a.s.c.CoreContainer Not all security plugins configured! authentication=disabled authorization=disabled. Solr is only as secure as you make it. Consider configuring authentication/authorization before exposing Solr to users internal or external. See https://s.apache.org/solrsecurity for more info
[junit4] 2> 933848 INFO (jetty-launcher-10075-thread-2) [n:127.0.0.1:42255_solr ] o.a.s.c.b.r.BackupRepositoryFactory Added backup repository with configuration params {type = repository,name = trackingBackupRepository,class = org.apache.solr.core.TrackingBackupRepository,attributes = {default=true, name=trackingBackupRepository, class=org.apache.solr.core.TrackingBackupRepository},args = {delegateRepoName=hdfs}}
[junit4] 2> 933848 INFO (jetty-launcher-10075-thread-2) [n:127.0.0.1:42255_solr ] o.a.s.c.b.r.BackupRepositoryFactory Added backup repository with configuration params {type = repository,name = hdfs,class = org.apache.solr.core.backup.repository.HdfsBackupRepository,attributes = {name=hdfs, class=org.apache.solr.core.backup.repository.HdfsBackupRepository},args = {location=/backup,solr.hdfs.home=hdfs://localhost:35775/solr,solr.hdfs.confdir=}}
[junit4] 2> 933848 INFO (jetty-launcher-10075-thread-2) [n:127.0.0.1:42255_solr ] o.a.s.c.b.r.BackupRepositoryFactory Default configuration for backup repository is with configuration params {type = repository,name = trackingBackupRepository,class = org.apache.solr.core.TrackingBackupRepository,attributes = {default=true, name=trackingBackupRepository, class=org.apache.solr.core.TrackingBackupRepository},args = {delegateRepoName=hdfs}}
[junit4] 2> 933881 INFO (jetty-launcher-10075-thread-2) [n:127.0.0.1:42255_solr ] o.a.s.h.a.MetricsHistoryHandler No .system collection, keeping metrics history in memory.
[junit4] 2> 933901 INFO (jetty-launcher-10075-thread-2) [n:127.0.0.1:42255_solr ] o.a.s.m.r.SolrJmxReporter JMX monitoring for 'solr.node' (registry 'solr.node') enabled at server: com.sun.jmx.mbeanserver.JmxMBeanServer@5a7b4e7e
[junit4] 2> 933909 INFO (jetty-launcher-10075-thread-2) [n:127.0.0.1:42255_solr ] o.a.s.m.r.SolrJmxReporter JMX monitoring for 'solr.jvm' (registry 'solr.jvm') enabled at server: com.sun.jmx.mbeanserver.JmxMBeanServer@5a7b4e7e
[junit4] 2> 933909 INFO (jetty-launcher-10075-thread-2) [n:127.0.0.1:42255_solr ] o.a.s.m.r.SolrJmxReporter JMX monitoring for 'solr.jetty' (registry 'solr.jetty') enabled at server: com.sun.jmx.mbeanserver.JmxMBeanServer@5a7b4e7e
[junit4] 2> 933909 INFO (jetty-launcher-10075-thread-1) [n:127.0.0.1:45733_solr ] o.a.s.c.c.ConnectionManager Waiting for client to connect to ZooKeeper
[junit4] 2> 933910 INFO (jetty-launcher-10075-thread-2) [n:127.0.0.1:42255_solr ] o.a.s.c.CorePropertiesLocator Found 0 core definitions underneath /home/jenkins/jenkins-slave/workspace/Lucene/Lucene-Solr-Tests-8.11/solr/build/solr-core/test/J3/temp/solr.cloud.api.collections.HdfsCloudIncrementalBackupTest_3DB45BF76357C8CC-001/tempDir-002/node2
[junit4] 2> 933910 INFO (zkConnectionManagerCallback-10116-thread-1) [ ] o.a.s.c.c.ConnectionManager zkClient has connected
[junit4] 2> 933910 INFO (jetty-launcher-10075-thread-1) [n:127.0.0.1:45733_solr ] o.a.s.c.c.ConnectionManager Client is connected to ZooKeeper
[junit4] 2> 933923 WARN (jetty-launcher-10075-thread-1) [n:127.0.0.1:45733_solr ] o.a.s.c.ZkController Contents of zookeeper /security.json are world-readable; consider setting up ACLs as described in https://solr.apache.org/guide/zookeeper-access-control.html
[junit4] 2> 933924 INFO (jetty-launcher-10075-thread-1) [n:127.0.0.1:45733_solr ] o.a.s.c.c.ZkStateReader Updated live nodes from ZooKeeper... (0) -> (1)
[junit4] 2> 933927 INFO (jetty-launcher-10075-thread-1) [n:127.0.0.1:45733_solr ] o.a.s.c.ZkController Publish node=127.0.0.1:45733_solr as DOWN
[junit4] 2> 933927 INFO (jetty-launcher-10075-thread-1) [n:127.0.0.1:45733_solr ] o.a.s.c.TransientSolrCoreCacheDefault Allocating transient core cache for max 2147483647 cores with initial capacity of 1024
[junit4] 2> 933927 INFO (jetty-launcher-10075-thread-1) [n:127.0.0.1:45733_solr ] o.a.s.c.ZkController Register node as live in ZooKeeper:/live_nodes/127.0.0.1:45733_solr
[junit4] 2> 933929 INFO (jetty-launcher-10075-thread-1) [n:127.0.0.1:45733_solr ] o.a.s.c.ZkController non-data nodes now []
[junit4] 2> 933930 INFO (jetty-launcher-10075-thread-1) [n:127.0.0.1:45733_solr ] o.a.s.p.PackageLoader /packages.json updated to version -1
[junit4] 2> 933930 WARN (jetty-launcher-10075-thread-1) [n:127.0.0.1:45733_solr ] o.a.s.c.CoreContainer Not all security plugins configured! authentication=disabled authorization=disabled. Solr is only as secure as you make it. Consider configuring authentication/authorization before exposing Solr to users internal or external. See https://s.apache.org/solrsecurity for more info
[junit4] 2> 933930 INFO (jetty-launcher-10075-thread-1) [n:127.0.0.1:45733_solr ] o.a.s.c.b.r.BackupRepositoryFactory Added backup repository with configuration params {type = repository,name = trackingBackupRepository,class = org.apache.solr.core.TrackingBackupRepository,attributes = {default=true, name=trackingBackupRepository, class=org.apache.solr.core.TrackingBackupRepository},args = {delegateRepoName=hdfs}}
[junit4] 2> 933930 INFO (jetty-launcher-10075-thread-1) [n:127.0.0.1:45733_solr ] o.a.s.c.b.r.BackupRepositoryFactory Added backup repository with configuration params {type = repository,name = hdfs,class = org.apache.solr.core.backup.repository.HdfsBackupRepository,attributes = {name=hdfs, class=org.apache.solr.core.backup.repository.HdfsBackupRepository},args = {location=/backup,solr.hdfs.home=hdfs://localhost:35775/solr,solr.hdfs.confdir=}}
[junit4] 2> 933930 INFO (jetty-launcher-10075-thread-1) [n:127.0.0.1:45733_solr ] o.a.s.c.b.r.BackupRepositoryFactory Default configuration for backup repository is with configuration params {type = repository,name = trackingBackupRepository,class = org.apache.solr.core.TrackingBackupRepository,attributes = {default=true, name=trackingBackupRepository, class=org.apache.solr.core.TrackingBackupRepository},args = {delegateRepoName=hdfs}}
[junit4] 2> 933936 INFO (zkCallback-10094-thread-1) [ ] o.a.s.c.c.ZkStateReader Updated live nodes from ZooKeeper... (1) -> (2)
[junit4] 2> 933939 INFO (zkCallback-10115-thread-1) [ ] o.a.s.c.c.ZkStateReader Updated live nodes from ZooKeeper... (1) -> (2)
[junit4] 2> 933955 INFO (jetty-launcher-10075-thread-1) [n:127.0.0.1:45733_solr ] o.a.s.h.a.MetricsHistoryHandler No .system collection, keeping metrics history in memory.
[junit4] 2> 933978 INFO (jetty-launcher-10075-thread-1) [n:127.0.0.1:45733_solr ] o.a.s.m.r.SolrJmxReporter JMX monitoring for 'solr.node' (registry 'solr.node') enabled at server: com.sun.jmx.mbeanserver.JmxMBeanServer@5a7b4e7e
[junit4] 2> 933989 INFO (jetty-launcher-10075-thread-1) [n:127.0.0.1:45733_solr ] o.a.s.m.r.SolrJmxReporter JMX monitoring for 'solr.jvm' (registry 'solr.jvm') enabled at server: com.sun.jmx.mbeanserver.JmxMBeanServer@5a7b4e7e
[junit4] 2> 933989 INFO (jetty-launcher-10075-thread-1) [n:127.0.0.1:45733_solr ] o.a.s.m.r.SolrJmxReporter JMX monitoring for 'solr.jetty' (registry 'solr.jetty') enabled at server: com.sun.jmx.mbeanserver.JmxMBeanServer@5a7b4e7e
[junit4] 2> 933990 INFO (jetty-launcher-10075-thread-1) [n:127.0.0.1:45733_solr ] o.a.s.c.CorePropertiesLocator Found 0 core definitions underneath /home/jenkins/jenkins-slave/workspace/Lucene/Lucene-Solr-Tests-8.11/solr/build/solr-core/test/J3/temp/solr.cloud.api.collections.HdfsCloudIncrementalBackupTest_3DB45BF76357C8CC-001/tempDir-002/node1
[junit4] 2> 934034 INFO (Listener at localhost/33409) [ ] o.a.s.c.MiniSolrCloudCluster waitForAllNodes: numServers=2
[junit4] 2> 934035 INFO (Listener at localhost/33409) [ ] o.a.s.c.c.ConnectionManager Waiting for client to connect to ZooKeeper
[junit4] 2> 934035 INFO (zkConnectionManagerCallback-10130-thread-1) [ ] o.a.s.c.c.ConnectionManager zkClient has connected
[junit4] 2> 934035 INFO (Listener at localhost/33409) [ ] o.a.s.c.c.ConnectionManager Client is connected to ZooKeeper
[junit4] 2> 934037 INFO (Listener at localhost/33409) [ ] o.a.s.c.c.ZkStateReader Updated live nodes from ZooKeeper... (0) -> (2)
[junit4] 2> 934038 INFO (Listener at localhost/33409) [ ] o.a.s.c.s.i.ZkClientClusterStateProvider Cluster at 127.0.0.1:41247/solr ready
[junit4] 2> 934081 INFO (TEST-HdfsCloudIncrementalBackupTest.testSimple-seed#[3DB45BF76357C8CC]) [ ] o.a.s.SolrTestCaseJ4 ###Starting testSimple
[junit4] 2> 934091 INFO (qtp1424428763-15588) [n:127.0.0.1:42255_solr ] o.a.s.s.HttpSolrCall HttpSolrCall.init(http://127.0.0.1:42255/solr/admin/collections?action=CREATE&name=hdfsbackuprestore_testbackupincsimple&collection.configName=conf1&numShards=2&nrtReplicas=1&wt=javabin&version=2)
[junit4] 2> 934104 INFO (OverseerThreadFactory-10110-thread-1-processing-n:127.0.0.1:42255_solr) [n:127.0.0.1:42255_solr ] o.a.s.c.a.c.CreateCollectionCmd Create collection hdfsbackuprestore_testbackupincsimple
[junit4] 2> 934213 INFO (OverseerStateUpdate-72129748904443910-127.0.0.1:42255_solr-n_0000000000) [n:127.0.0.1:42255_solr ] o.a.s.c.o.SliceMutator createReplica() {
[junit4] 2> "operation":"ADDREPLICA",
[junit4] 2> "collection":"hdfsbackuprestore_testbackupincsimple",
[junit4] 2> "shard":"shard1",
[junit4] 2> "core":"hdfsbackuprestore_testbackupincsimple_shard1_replica_n1",
[junit4] 2> "state":"down",
[junit4] 2> "node_name":"127.0.0.1:42255_solr",
[junit4] 2> "base_url":"http://127.0.0.1:42255/solr",
[junit4] 2> "type":"NRT",
[junit4] 2> "waitForFinalState":"false"}
[junit4] 2> 934218 INFO (OverseerStateUpdate-72129748904443910-127.0.0.1:42255_solr-n_0000000000) [n:127.0.0.1:42255_solr ] o.a.s.c.o.SliceMutator createReplica() {
[junit4] 2> "operation":"ADDREPLICA",
[junit4] 2> "collection":"hdfsbackuprestore_testbackupincsimple",
[junit4] 2> "shard":"shard2",
[junit4] 2> "core":"hdfsbackuprestore_testbackupincsimple_shard2_replica_n2",
[junit4] 2> "state":"down",
[junit4] 2> "node_name":"127.0.0.1:45733_solr",
[junit4] 2> "base_url":"http://127.0.0.1:45733/solr",
[junit4] 2> "type":"NRT",
[junit4] 2> "waitForFinalState":"false"}
[junit4] 2> 934421 INFO (qtp1424428763-15590) [n:127.0.0.1:42255_solr ] o.a.s.s.HttpSolrCall HttpSolrCall.init(http://127.0.0.1:42255/solr/admin/cores?null)
[junit4] 2> 934421 INFO (qtp1424428763-15590) [n:127.0.0.1:42255_solr x:hdfsbackuprestore_testbackupincsimple_shard1_replica_n1 ] o.a.s.h.a.CoreAdminOperation core create command qt=/admin/cores&coreNodeName=core_node3&collection.configName=conf1&newCollection=true&name=hdfsbackuprestore_testbackupincsimple_shard1_replica_n1&action=CREATE&numShards=2&collection=hdfsbackuprestore_testbackupincsimple&shard=shard1&wt=javabin&version=2&replicaType=NRT
[junit4] 2> 934422 INFO (qtp1424428763-15590) [n:127.0.0.1:42255_solr x:hdfsbackuprestore_testbackupincsimple_shard1_replica_n1 ] o.a.s.c.TransientSolrCoreCacheDefault Allocating transient core cache for max 2147483647 cores with initial capacity of 1024
[junit4] 2> 934430 INFO (qtp235704197-15599) [n:127.0.0.1:45733_solr ] o.a.s.s.HttpSolrCall HttpSolrCall.init(http://127.0.0.1:45733/solr/admin/cores?null)
[junit4] 2> 934430 INFO (qtp235704197-15599) [n:127.0.0.1:45733_solr x:hdfsbackuprestore_testbackupincsimple_shard2_replica_n2 ] o.a.s.h.a.CoreAdminOperation core create command qt=/admin/cores&coreNodeName=core_node4&collection.configName=conf1&newCollection=true&name=hdfsbackuprestore_testbackupincsimple_shard2_replica_n2&action=CREATE&numShards=2&collection=hdfsbackuprestore_testbackupincsimple&shard=shard2&wt=javabin&version=2&replicaType=NRT
[junit4] 2> 934441 INFO (qtp235704197-15599) [n:127.0.0.1:45733_solr c:hdfsbackuprestore_testbackupincsimple s:shard2 r:core_node4 x:hdfsbackuprestore_testbackupincsimple_shard2_replica_n2 ] o.a.s.c.SolrConfig Using Lucene MatchVersion: 8.11.3
[junit4] 2> 934441 INFO (qtp1424428763-15590) [n:127.0.0.1:42255_solr c:hdfsbackuprestore_testbackupincsimple s:shard1 r:core_node3 x:hdfsbackuprestore_testbackupincsimple_shard1_replica_n1 ] o.a.s.c.SolrConfig Using Lucene MatchVersion: 8.11.3
[junit4] 2> 934443 INFO (qtp235704197-15599) [n:127.0.0.1:45733_solr c:hdfsbackuprestore_testbackupincsimple s:shard2 r:core_node4 x:hdfsbackuprestore_testbackupincsimple_shard2_replica_n2 ] o.a.s.s.IndexSchema Schema name=minimal
[junit4] 2> 934443 INFO (qtp1424428763-15590) [n:127.0.0.1:42255_solr c:hdfsbackuprestore_testbackupincsimple s:shard1 r:core_node3 x:hdfsbackuprestore_testbackupincsimple_shard1_replica_n1 ] o.a.s.s.IndexSchema Schema name=minimal
[junit4] 2> 934443 INFO (qtp1424428763-15590) [n:127.0.0.1:42255_solr c:hdfsbackuprestore_testbackupincsimple s:shard1 r:core_node3 x:hdfsbackuprestore_testbackupincsimple_shard1_replica_n1 ] o.a.s.s.IndexSchema Loaded schema minimal/1.1 with uniqueid field id
[junit4] 2> 934443 INFO (qtp235704197-15599) [n:127.0.0.1:45733_solr c:hdfsbackuprestore_testbackupincsimple s:shard2 r:core_node4 x:hdfsbackuprestore_testbackupincsimple_shard2_replica_n2 ] o.a.s.s.IndexSchema Loaded schema minimal/1.1 with uniqueid field id
[junit4] 2> 934443 INFO (qtp1424428763-15590) [n:127.0.0.1:42255_solr c:hdfsbackuprestore_testbackupincsimple s:shard1 r:core_node3 x:hdfsbackuprestore_testbackupincsimple_shard1_replica_n1 ] o.a.s.c.CoreContainer Creating SolrCore 'hdfsbackuprestore_testbackupincsimple_shard1_replica_n1' using configuration from configset conf1, trusted=true
[junit4] 2> 934443 INFO (qtp235704197-15599) [n:127.0.0.1:45733_solr c:hdfsbackuprestore_testbackupincsimple s:shard2 r:core_node4 x:hdfsbackuprestore_testbackupincsimple_shard2_replica_n2 ] o.a.s.c.CoreContainer Creating SolrCore 'hdfsbackuprestore_testbackupincsimple_shard2_replica_n2' using configuration from configset conf1, trusted=true
[junit4] 2> 934443 INFO (qtp235704197-15599) [n:127.0.0.1:45733_solr c:hdfsbackuprestore_testbackupincsimple s:shard2 r:core_node4 x:hdfsbackuprestore_testbackupincsimple_shard2_replica_n2 ] o.a.s.m.r.SolrJmxReporter JMX monitoring for 'solr.core.hdfsbackuprestore_testbackupincsimple.shard2.replica_n2' (registry 'solr.core.hdfsbackuprestore_testbackupincsimple.shard2.replica_n2') enabled at server: com.sun.jmx.mbeanserver.JmxMBeanServer@5a7b4e7e
[junit4] 2> 934443 INFO (qtp1424428763-15590) [n:127.0.0.1:42255_solr c:hdfsbackuprestore_testbackupincsimple s:shard1 r:core_node3 x:hdfsbackuprestore_testbackupincsimple_shard1_replica_n1 ] o.a.s.m.r.SolrJmxReporter JMX monitoring for 'solr.core.hdfsbackuprestore_testbackupincsimple.shard1.replica_n1' (registry 'solr.core.hdfsbackuprestore_testbackupincsimple.shard1.replica_n1') enabled at server: com.sun.jmx.mbeanserver.JmxMBeanServer@5a7b4e7e
[junit4] 2> 934443 INFO (qtp235704197-15599) [n:127.0.0.1:45733_solr c:hdfsbackuprestore_testbackupincsimple s:shard2 r:core_node4 x:hdfsbackuprestore_testbackupincsimple_shard2_replica_n2 ] o.a.s.c.SolrCore [[hdfsbackuprestore_testbackupincsimple_shard2_replica_n2] ] Opening new SolrCore at [/home/jenkins/jenkins-slave/workspace/Lucene/Lucene-Solr-Tests-8.11/solr/build/solr-core/test/J3/temp/solr.cloud.api.collections.HdfsCloudIncrementalBackupTest_3DB45BF76357C8CC-001/tempDir-002/node1/hdfsbackuprestore_testbackupincsimple_shard2_replica_n2], dataDir=[/home/jenkins/jenkins-slave/workspace/Lucene/Lucene-Solr-Tests-8.11/solr/build/solr-core/test/J3/temp/solr.cloud.api.collections.HdfsCloudIncrementalBackupTest_3DB45BF76357C8CC-001/tempDir-002/node1/hdfsbackuprestore_testbackupincsimple_shard2_replica_n2/data/]
[junit4] 2> 934443 INFO (qtp1424428763-15590) [n:127.0.0.1:42255_solr c:hdfsbackuprestore_testbackupincsimple s:shard1 r:core_node3 x:hdfsbackuprestore_testbackupincsimple_shard1_replica_n1 ] o.a.s.c.SolrCore [[hdfsbackuprestore_testbackupincsimple_shard1_replica_n1] ] Opening new SolrCore at [/home/jenkins/jenkins-slave/workspace/Lucene/Lucene-Solr-Tests-8.11/solr/build/solr-core/test/J3/temp/solr.cloud.api.collections.HdfsCloudIncrementalBackupTest_3DB45BF76357C8CC-001/tempDir-002/node2/hdfsbackuprestore_testbackupincsimple_shard1_replica_n1], dataDir=[/home/jenkins/jenkins-slave/workspace/Lucene/Lucene-Solr-Tests-8.11/solr/build/solr-core/test/J3/temp/solr.cloud.api.collections.HdfsCloudIncrementalBackupTest_3DB45BF76357C8CC-001/tempDir-002/node2/hdfsbackuprestore_testbackupincsimple_shard1_replica_n1/data/]
[junit4] 2> 934521 INFO (qtp235704197-15599) [n:127.0.0.1:45733_solr c:hdfsbackuprestore_testbackupincsimple s:shard2 r:core_node4 x:hdfsbackuprestore_testbackupincsimple_shard2_replica_n2 ] o.a.s.u.UpdateHandler Using UpdateLog implementation: org.apache.solr.update.UpdateLog
[junit4] 2> 934521 INFO (qtp235704197-15599) [n:127.0.0.1:45733_solr c:hdfsbackuprestore_testbackupincsimple s:shard2 r:core_node4 x:hdfsbackuprestore_testbackupincsimple_shard2_replica_n2 ] o.a.s.u.UpdateLog Initializing UpdateLog: dataDir=null defaultSyncLevel=FLUSH numRecordsToKeep=100 maxNumLogsToKeep=10 numVersionBuckets=65536
[junit4] 2> 934522 INFO (qtp235704197-15599) [n:127.0.0.1:45733_solr c:hdfsbackuprestore_testbackupincsimple s:shard2 r:core_node4 x:hdfsbackuprestore_testbackupincsimple_shard2_replica_n2 ] o.a.s.u.CommitTracker Hard AutoCommit: disabled
[junit4] 2> 934522 INFO (qtp235704197-15599) [n:127.0.0.1:45733_solr c:hdfsbackuprestore_testbackupincsimple s:shard2 r:core_node4 x:hdfsbackuprestore_testbackupincsimple_shard2_replica_n2 ] o.a.s.u.CommitTracker Soft AutoCommit: disabled
[junit4] 2> 934523 INFO (qtp1424428763-15590) [n:127.0.0.1:42255_solr c:hdfsbackuprestore_testbackupincsimple s:shard1 r:core_node3 x:hdfsbackuprestore_testbackupincsimple_shard1_replica_n1 ] o.a.s.u.UpdateHandler Using UpdateLog implementation: org.apache.solr.update.UpdateLog
[junit4] 2> 934523 INFO (qtp1424428763-15590) [n:127.0.0.1:42255_solr c:hdfsbackuprestore_testbackupincsimple s:shard1 r:core_node3 x:hdfsbackuprestore_testbackupincsimple_shard1_replica_n1 ] o.a.s.u.UpdateLog Initializing UpdateLog: dataDir=null defaultSyncLevel=FLUSH numRecordsToKeep=100 maxNumLogsToKeep=10 numVersionBuckets=65536
[junit4] 2> 934524 INFO (qtp1424428763-15590) [n:127.0.0.1:42255_solr c:hdfsbackuprestore_testbackupincsimple s:shard1 r:core_node3 x:hdfsbackuprestore_testbackupincsimple_shard1_replica_n1 ] o.a.s.u.CommitTracker Hard AutoCommit: disabled
[junit4] 2> 934524 INFO (qtp1424428763-15590) [n:127.0.0.1:42255_solr c:hdfsbackuprestore_testbackupincsimple s:shard1 r:core_node3 x:hdfsbackuprestore_testbackupincsimple_shard1_replica_n1 ] o.a.s.u.CommitTracker Soft AutoCommit: disabled
[junit4] 2> 934527 INFO (qtp235704197-15599) [n:127.0.0.1:45733_solr c:hdfsbackuprestore_testbackupincsimple s:shard2 r:core_node4 x:hdfsbackuprestore_testbackupincsimple_shard2_replica_n2 ] o.a.s.r.ManagedResourceStorage Configured ZooKeeperStorageIO with znodeBase: /configs/conf1
[junit4] 2> 934527 INFO (qtp235704197-15599) [n:127.0.0.1:45733_solr c:hdfsbackuprestore_testbackupincsimple s:shard2 r:core_node4 x:hdfsbackuprestore_testbackupincsimple_shard2_replica_n2 ] o.a.s.r.ManagedResourceStorage Loaded null at path _rest_managed.json using ZooKeeperStorageIO:path=/configs/conf1
[junit4] 2> 934527 INFO (qtp1424428763-15590) [n:127.0.0.1:42255_solr c:hdfsbackuprestore_testbackupincsimple s:shard1 r:core_node3 x:hdfsbackuprestore_testbackupincsimple_shard1_replica_n1 ] o.a.s.r.ManagedResourceStorage Configured ZooKeeperStorageIO with znodeBase: /configs/conf1
[junit4] 2> 934528 INFO (qtp1424428763-15590) [n:127.0.0.1:42255_solr c:hdfsbackuprestore_testbackupincsimple s:shard1 r:core_node3 x:hdfsbackuprestore_testbackupincsimple_shard1_replica_n1 ] o.a.s.r.ManagedResourceStorage Loaded null at path _rest_managed.json using ZooKeeperStorageIO:path=/configs/conf1
[junit4] 2> 934528 INFO (qtp1424428763-15590) [n:127.0.0.1:42255_solr c:hdfsbackuprestore_testbackupincsimple s:shard1 r:core_node3 x:hdfsbackuprestore_testbackupincsimple_shard1_replica_n1 ] o.a.s.h.ReplicationHandler Commits will be reserved for 10000 ms
[junit4] 2> 934528 INFO (qtp1424428763-15590) [n:127.0.0.1:42255_solr c:hdfsbackuprestore_testbackupincsimple s:shard1 r:core_node3 x:hdfsbackuprestore_testbackupincsimple_shard1_replica_n1 ] o.a.s.u.UpdateLog Could not find max version in index or recent updates, using new clock 1785847208664367104
[junit4] 2> 934531 INFO (qtp235704197-15599) [n:127.0.0.1:45733_solr c:hdfsbackuprestore_testbackupincsimple s:shard2 r:core_node4 x:hdfsbackuprestore_testbackupincsimple_shard2_replica_n2 ] o.a.s.h.ReplicationHandler Commits will be reserved for 10000 ms
[junit4] 2> 934531 INFO (qtp235704197-15599) [n:127.0.0.1:45733_solr c:hdfsbackuprestore_testbackupincsimple s:shard2 r:core_node4 x:hdfsbackuprestore_testbackupincsimple_shard2_replica_n2 ] o.a.s.u.UpdateLog Could not find max version in index or recent updates, using new clock 1785847208667512832
[junit4] 2> 934535 INFO (searcherExecutor-10134-thread-1-processing-n:127.0.0.1:45733_solr x:hdfsbackuprestore_testbackupincsimple_shard2_replica_n2 c:hdfsbackuprestore_testbackupincsimple s:shard2 r:core_node4) [n:127.0.0.1:45733_solr c:hdfsbackuprestore_testbackupincsimple s:shard2 r:core_node4 x:hdfsbackuprestore_testbackupincsimple_shard2_replica_n2 ] o.a.s.c.SolrCore [hdfsbackuprestore_testbackupincsimple_shard2_replica_n2] Registered new searcher autowarm time: 0 ms
[junit4] 2> 934538 INFO (qtp1424428763-15590) [n:127.0.0.1:42255_solr c:hdfsbackuprestore_testbackupincsimple s:shard1 r:core_node3 x:hdfsbackuprestore_testbackupincsimple_shard1_replica_n1 ] o.a.s.c.ZkShardTerms Successful update of terms at /collections/hdfsbackuprestore_testbackupincsimple/terms/shard1 to Terms{values={core_node3=0}, version=0}
[junit4] 2> 934538 INFO (qtp1424428763-15590) [n:127.0.0.1:42255_solr c:hdfsbackuprestore_testbackupincsimple s:shard1 r:core_node3 x:hdfsbackuprestore_testbackupincsimple_shard1_replica_n1 ] o.a.s.c.ShardLeaderElectionContextBase make sure parent is created /collections/hdfsbackuprestore_testbackupincsimple/leaders/shard1
[junit4] 2> 934543 INFO (searcherExecutor-10133-thread-1-processing-n:127.0.0.1:42255_solr x:hdfsbackuprestore_testbackupincsimple_shard1_replica_n1 c:hdfsbackuprestore_testbackupincsimple s:shard1 r:core_node3) [n:127.0.0.1:42255_solr c:hdfsbackuprestore_testbackupincsimple s:shard1 r:core_node3 x:hdfsbackuprestore_testbackupincsimple_shard1_replica_n1 ] o.a.s.c.SolrCore [hdfsbackuprestore_testbackupincsimple_shard1_replica_n1] Registered new searcher autowarm time: 0 ms
[junit4] 2> 934545 INFO (qtp1424428763-15590) [n:127.0.0.1:42255_solr c:hdfsbackuprestore_testbackupincsimple s:shard1 r:core_node3 x:hdfsbackuprestore_testbackupincsimple_shard1_replica_n1 ] o.a.s.c.ShardLeaderElectionContext Enough replicas found to continue.
[junit4] 2> 934545 INFO (qtp1424428763-15590) [n:127.0.0.1:42255_solr c:hdfsbackuprestore_testbackupincsimple s:shard1 r:core_node3 x:hdfsbackuprestore_testbackupincsimple_shard1_replica_n1 ] o.a.s.c.ShardLeaderElectionContext I may be the new leader - try and sync
[junit4] 2> 934545 INFO (qtp1424428763-15590) [n:127.0.0.1:42255_solr c:hdfsbackuprestore_testbackupincsimple s:shard1 r:core_node3 x:hdfsbackuprestore_testbackupincsimple_shard1_replica_n1 ] o.a.s.c.SyncStrategy Sync replicas to http://127.0.0.1:42255/solr/hdfsbackuprestore_testbackupincsimple_shard1_replica_n1/
[junit4] 2> 934545 INFO (qtp1424428763-15590) [n:127.0.0.1:42255_solr c:hdfsbackuprestore_testbackupincsimple s:shard1 r:core_node3 x:hdfsbackuprestore_testbackupincsimple_shard1_replica_n1 ] o.a.s.c.SyncStrategy Sync Success - now sync replicas to me
[junit4] 2> 934546 INFO (qtp1424428763-15590) [n:127.0.0.1:42255_solr c:hdfsbackuprestore_testbackupincsimple s:shard1 r:core_node3 x:hdfsbackuprestore_testbackupincsimple_shard1_replica_n1 ] o.a.s.c.SyncStrategy http://127.0.0.1:42255/solr/hdfsbackuprestore_testbackupincsimple_shard1_replica_n1/ has no replicas
[junit4] 2> 934546 INFO (qtp1424428763-15590) [n:127.0.0.1:42255_solr c:hdfsbackuprestore_testbackupincsimple s:shard1 r:core_node3 x:hdfsbackuprestore_testbackupincsimple_shard1_replica_n1 ] o.a.s.c.ShardLeaderElectionContextBase Creating leader registration node /collections/hdfsbackuprestore_testbackupincsimple/leaders/shard1/leader after winning as /collections/hdfsbackuprestore_testbackupincsimple/leader_elect/shard1/election/72129748904443910-core_node3-n_0000000000
[junit4] 2> 934546 INFO (qtp235704197-15599) [n:127.0.0.1:45733_solr c:hdfsbackuprestore_testbackupincsimple s:shard2 r:core_node4 x:hdfsbackuprestore_testbackupincsimple_shard2_replica_n2 ] o.a.s.c.ZkShardTerms Successful update of terms at /collections/hdfsbackuprestore_testbackupincsimple/terms/shard2 to Terms{values={core_node4=0}, version=0}
[junit4] 2> 934546 INFO (qtp235704197-15599) [n:127.0.0.1:45733_solr c:hdfsbackuprestore_testbackupincsimple s:shard2 r:core_node4 x:hdfsbackuprestore_testbackupincsimple_shard2_replica_n2 ] o.a.s.c.ShardLeaderElectionContextBase make sure parent is created /collections/hdfsbackuprestore_testbackupincsimple/leaders/shard2
[junit4] 2> 934548 INFO (qtp1424428763-15590) [n:127.0.0.1:42255_solr c:hdfsbackuprestore_testbackupincsimple s:shard1 r:core_node3 x:hdfsbackuprestore_testbackupincsimple_shard1_replica_n1 ] o.a.s.c.ShardLeaderElectionContext I am the new leader: http://127.0.0.1:42255/solr/hdfsbackuprestore_testbackupincsimple_shard1_replica_n1/ shard1
[junit4] 2> 934550 INFO (qtp235704197-15599) [n:127.0.0.1:45733_solr c:hdfsbackuprestore_testbackupincsimple s:shard2 r:core_node4 x:hdfsbackuprestore_testbackupincsimple_shard2_replica_n2 ] o.a.s.c.ShardLeaderElectionContext Enough replicas found to continue.
[junit4] 2> 934550 INFO (qtp235704197-15599) [n:127.0.0.1:45733_solr c:hdfsbackuprestore_testbackupincsimple s:shard2 r:core_node4 x:hdfsbackuprestore_testbackupincsimple_shard2_replica_n2 ] o.a.s.c.ShardLeaderElectionContext I may be the new leader - try and sync
[junit4] 2> 934550 INFO (qtp235704197-15599) [n:127.0.0.1:45733_solr c:hdfsbackuprestore_testbackupincsimple s:shard2 r:core_node4 x:hdfsbackuprestore_testbackupincsimple_shard2_replica_n2 ] o.a.s.c.SyncStrategy Sync replicas to http://127.0.0.1:45733/solr/hdfsbackuprestore_testbackupincsimple_shard2_replica_n2/
[junit4] 2> 934550 INFO (qtp235704197-15599) [n:127.0.0.1:45733_solr c:hdfsbackuprestore_testbackupincsimple s:shard2 r:core_node4 x:hdfsbackuprestore_testbackupincsimple_shard2_replica_n2 ] o.a.s.c.SyncStrategy Sync Success - now sync replicas to me
[junit4] 2> 934551 INFO (qtp235704197-15599) [n:127.0.0.1:45733_solr c:hdfsbackuprestore_testbackupincsimple s:shard2 r:core_node4 x:hdfsbackuprestore_testbackupincsimple_shard2_replica_n2 ] o.a.s.c.SyncStrategy http://127.0.0.1:45733/solr/hdfsbackuprestore_testbackupincsimple_shard2_replica_n2/ has no replicas
[junit4] 2> 934551 INFO (qtp235704197-15599) [n:127.0.0.1:45733_solr c:hdfsbackuprestore_testbackupincsimple s:shard2 r:core_node4 x:hdfsbackuprestore_testbackupincsimple_shard2_replica_n2 ] o.a.s.c.ShardLeaderElectionContextBase Creating leader registration node /collections/hdfsbackuprestore_testbackupincsimple/leaders/shard2/leader after winning as /collections/hdfsbackuprestore_testbackupincsimple/leader_elect/shard2/election/72129748904443912-core_node4-n_0000000000
[junit4] 2> 934553 INFO (qtp235704197-15599) [n:127.0.0.1:45733_solr c:hdfsbackuprestore_testbackupincsimple s:shard2 r:core_node4 x:hdfsbackuprestore_testbackupincsimple_shard2_replica_n2 ] o.a.s.c.ShardLeaderElectionContext I am the new leader: http://127.0.0.1:45733/solr/hdfsbackuprestore_testbackupincsimple_shard2_replica_n2/ shard2
[junit4] 2> 934654 INFO (zkCallback-10094-thread-1) [ ] o.a.s.c.c.ZkStateReader A cluster state change: [WatchedEvent state:SyncConnected type:NodeDataChanged path:/collections/hdfsbackuprestore_testbackupincsimple/state.json] for collection [hdfsbackuprestore_testbackupincsimple] has occurred - updating... (live nodes size: [2])
[junit4] 2> 934654 INFO (zkCallback-10115-thread-1) [ ] o.a.s.c.c.ZkStateReader A cluster state change: [WatchedEvent state:SyncConnected type:NodeDataChanged path:/collections/hdfsbackuprestore_testbackupincsimple/state.json] for collection [hdfsbackuprestore_testbackupincsimple] has occurred - updating... (live nodes size: [2])
[junit4] 2> 934656 INFO (qtp235704197-15599) [n:127.0.0.1:45733_solr c:hdfsbackuprestore_testbackupincsimple s:shard2 r:core_node4 x:hdfsbackuprestore_testbackupincsimple_shard2_replica_n2 ] o.a.s.c.ZkController I am the leader, no recovery necessary
[junit4] 2> 934656 INFO (qtp1424428763-15590) [n:127.0.0.1:42255_solr c:hdfsbackuprestore_testbackupincsimple s:shard1 r:core_node3 x:hdfsbackuprestore_testbackupincsimple_shard1_replica_n1 ] o.a.s.c.ZkController I am the leader, no recovery necessary
[junit4] 2> 934659 INFO (qtp235704197-15599) [n:127.0.0.1:45733_solr ] o.a.s.s.HttpSolrCall [admin] webapp=null path=/admin/cores params={qt=/admin/cores&coreNodeName=core_node4&collection.configName=conf1&newCollection=true&name=hdfsbackuprestore_testbackupincsimple_shard2_replica_n2&action=CREATE&numShards=2&collection=hdfsbackuprestore_testbackupincsimple&shard=shard2&wt=javabin&version=2&replicaType=NRT} status=0 QTime=229
[junit4] 2> 934659 INFO (qtp1424428763-15590) [n:127.0.0.1:42255_solr ] o.a.s.s.HttpSolrCall [admin] webapp=null path=/admin/cores params={qt=/admin/cores&coreNodeName=core_node3&collection.configName=conf1&newCollection=true&name=hdfsbackuprestore_testbackupincsimple_shard1_replica_n1&action=CREATE&numShards=2&collection=hdfsbackuprestore_testbackupincsimple&shard=shard1&wt=javabin&version=2&replicaType=NRT} status=0 QTime=238
[junit4] 2> 934662 INFO (qtp1424428763-15588) [n:127.0.0.1:42255_solr ] o.a.s.h.a.CollectionsHandler Wait for new collection to be active for at most 45 seconds. Check all shard replicas
[junit4] 2> 934761 INFO (zkCallback-10094-thread-1) [ ] o.a.s.c.c.ZkStateReader A cluster state change: [WatchedEvent state:SyncConnected type:NodeDataChanged path:/collections/hdfsbackuprestore_testbackupincsimple/state.json] for collection [hdfsbackuprestore_testbackupincsimple] has occurred - updating... (live nodes size: [2])
[junit4] 2> 934761 INFO (zkCallback-10094-thread-2) [ ] o.a.s.c.c.ZkStateReader A cluster state change: [WatchedEvent state:SyncConnected type:NodeDataChanged path:/collections/hdfsbackuprestore_testbackupincsimple/state.json] for collection [hdfsbackuprestore_testbackupincsimple] has occurred - updating... (live nodes size: [2])
[junit4] 2> 934761 INFO (zkCallback-10115-thread-2) [ ] o.a.s.c.c.ZkStateReader A cluster state change: [WatchedEvent state:SyncConnected type:NodeDataChanged path:/collections/hdfsbackuprestore_testbackupincsimple/state.json] for collection [hdfsbackuprestore_testbackupincsimple] has occurred - updating... (live nodes size: [2])
[junit4] 2> 934761 INFO (zkCallback-10115-thread-1) [ ] o.a.s.c.c.ZkStateReader A cluster state change: [WatchedEvent state:SyncConnected type:NodeDataChanged path:/collections/hdfsbackuprestore_testbackupincsimple/state.json] for collection [hdfsbackuprestore_testbackupincsimple] has occurred - updating... (live nodes size: [2])
[junit4] 2> 934762 INFO (qtp1424428763-15588) [n:127.0.0.1:42255_solr ] o.a.s.s.HttpSolrCall [admin] webapp=null path=/admin/collections params={collection.configName=conf1&name=hdfsbackuprestore_testbackupincsimple&nrtReplicas=1&action=CREATE&numShards=2&wt=javabin&version=2} status=0 QTime=670
[junit4] 2> 934767 INFO (qtp1424428763-15591) [n:127.0.0.1:42255_solr ] o.a.s.s.HttpSolrCall HttpSolrCall.init(http://127.0.0.1:42255/solr/hdfsbackuprestore_testbackupincsimple_shard1_replica_n1/update?wt=javabin&version=2)
[junit4] 2> 934767 INFO (qtp235704197-15602) [n:127.0.0.1:45733_solr ] o.a.s.s.HttpSolrCall HttpSolrCall.init(http://127.0.0.1:45733/solr/hdfsbackuprestore_testbackupincsimple_shard2_replica_n2/update?wt=javabin&version=2)
[junit4] 2> 934774 INFO (qtp1424428763-15591) [n:127.0.0.1:42255_solr c:hdfsbackuprestore_testbackupincsimple s:shard1 r:core_node3 x:hdfsbackuprestore_testbackupincsimple_shard1_replica_n1 ] o.a.s.c.ZkShardTerms Successful update of terms at /collections/hdfsbackuprestore_testbackupincsimple/terms/shard1 to Terms{values={core_node3=1}, version=1}
[junit4] 2> 934774 INFO (qtp235704197-15602) [n:127.0.0.1:45733_solr c:hdfsbackuprestore_testbackupincsimple s:shard2 r:core_node4 x:hdfsbackuprestore_testbackupincsimple_shard2_replica_n2 ] o.a.s.c.ZkShardTerms Successful update of terms at /collections/hdfsbackuprestore_testbackupincsimple/terms/shard2 to Terms{values={core_node4=1}, version=1}
[junit4] 2> 934775 INFO (qtp1424428763-15591) [n:127.0.0.1:42255_solr c:hdfsbackuprestore_testbackupincsimple s:shard1 r:core_node3 x:hdfsbackuprestore_testbackupincsimple_shard1_replica_n1 ] o.a.s.u.p.LogUpdateProcessorFactory [hdfsbackuprestore_testbackupincsimple_shard1_replica_n1] webapp=/solr path=/update params={wt=javabin&version=2}{add=[a4e3448d-f6f9-47f8-8572-b01caec55b90 (1785847208917073920), 1e9c9be8-d53f-47b6-95b9-c75465b2d4ff (1785847208919171072), 180a18aa-b1e2-4cd1-bd8f-27ab4f0c9867 (1785847208919171073), 29b5885a-25d0-473f-b99e-b45b220aec9e (1785847208919171074), eaac2e9d-adc7-4e78-9b80-067cada630d0 (1785847208919171075), 3a1baa94-06c7-4689-8406-c01f072c1f7f (1785847208919171076), 4264e2fc-6c64-4bf5-acc5-6ae668b13b95 (1785847208919171077), 1e83dd51-2c2a-4a27-83f1-7a37acd6709a (1785847208919171078), 73dfff29-936f-40e7-a097-8bde827e20b8 (1785847208919171079), 03e2c841-fe30-4a71-b66a-529e7dcc2fd0 (1785847208919171080), ... (42 adds)]} 0 7
[junit4] 2> 934775 INFO (qtp235704197-15602) [n:127.0.0.1:45733_solr c:hdfsbackuprestore_testbackupincsimple s:shard2 r:core_node4 x:hdfsbackuprestore_testbackupincsimple_shard2_replica_n2 ] o.a.s.u.p.LogUpdateProcessorFactory [hdfsbackuprestore_testbackupincsimple_shard2_replica_n2] webapp=/solr path=/update params={wt=javabin&version=2}{add=[8b7e3883-f752-4028-a0a6-087b978d7325 (1785847208917073920), 2520d3c3-95b9-49b7-b092-5572b2ae2323 (1785847208919171072), 8e4bc83e-29a7-443c-92bc-434cee349a36 (1785847208919171073), 628fff9d-b866-4ead-9660-7da48ada5692 (1785847208919171074), f6b71c4c-4f01-4f3b-9dcd-de347a4cc895 (1785847208919171075), ad4734e3-4633-4826-a3ea-de2691c5590e (1785847208919171076), 8aa614f7-7c2e-4172-aaf9-ad18d764e6eb (1785847208919171077), 9c86495d-5cd9-479b-8407-69b6e9d93a7b (1785847208919171078), fe0af4b8-06ec-4592-82ed-bd5c7ecdc701 (1785847208919171079), c596374a-05b5-496c-a04d-039c82866730 (1785847208919171080), ... (29 adds)]} 0 7
[junit4] 2> 934776 INFO (qtp235704197-15603) [n:127.0.0.1:45733_solr ] o.a.s.s.HttpSolrCall HttpSolrCall.init(http://127.0.0.1:45733/solr/hdfsbackuprestore_testbackupincsimple/update?null)
[junit4] 2> 934781 INFO (qtp1424428763-15590) [n:127.0.0.1:42255_solr ] o.a.s.s.HttpSolrCall HttpSolrCall.init(http://127.0.0.1:42255/solr/hdfsbackuprestore_testbackupincsimple_shard1_replica_n1/update?update.distrib=TOLEADER&distrib.from=http%3A%2F%2F127.0.0.1%3A45733%2Fsolr%2Fhdfsbackuprestore_testbackupincsimple_shard2_replica_n2%2F)
[junit4] 2> 934820 INFO (searcherExecutor-10133-thread-1-processing-n:127.0.0.1:42255_solr x:hdfsbackuprestore_testbackupincsimple_shard1_replica_n1 c:hdfsbackuprestore_testbackupincsimple s:shard1 r:core_node3) [n:127.0.0.1:42255_solr c:hdfsbackuprestore_testbackupincsimple s:shard1 r:core_node3 x:hdfsbackuprestore_testbackupincsimple_shard1_replica_n1 ] o.a.s.c.SolrCore [hdfsbackuprestore_testbackupincsimple_shard1_replica_n1] Registered new searcher autowarm time: 0 ms
[junit4] 2> 934821 INFO (qtp1424428763-15590) [n:127.0.0.1:42255_solr c:hdfsbackuprestore_testbackupincsimple s:shard1 r:core_node3 x:hdfsbackuprestore_testbackupincsimple_shard1_replica_n1 ] o.a.s.u.p.LogUpdateProcessorFactory [hdfsbackuprestore_testbackupincsimple_shard1_replica_n1] webapp=/solr path=/update params={update.distrib=TOLEADER&waitSearcher=true&openSearcher=true&commit=true&softCommit=false&distrib.from=http://127.0.0.1:45733/solr/hdfsbackuprestore_testbackupincsimple_shard2_replica_n2/&commit_end_point=leaders&wt=javabin&version=2&expungeDeletes=false}{commit=} 0 40
[junit4] 2> 934865 INFO (searcherExecutor-10134-thread-1-processing-n:127.0.0.1:45733_solr x:hdfsbackuprestore_testbackupincsimple_shard2_replica_n2 c:hdfsbackuprestore_testbackupincsimple s:shard2 r:core_node4) [n:127.0.0.1:45733_solr c:hdfsbackuprestore_testbackupincsimple s:shard2 r:core_node4 x:hdfsbackuprestore_testbackupincsimple_shard2_replica_n2 ] o.a.s.c.SolrCore [hdfsbackuprestore_testbackupincsimple_shard2_replica_n2] Registered new searcher autowarm time: 0 ms
[junit4] 2> 934865 INFO (qtp235704197-15603) [n:127.0.0.1:45733_solr c:hdfsbackuprestore_testbackupincsimple s:shard2 r:core_node4 x:hdfsbackuprestore_testbackupincsimple_shard2_replica_n2 ] o.a.s.u.p.LogUpdateProcessorFactory [hdfsbackuprestore_testbackupincsimple_shard2_replica_n2] webapp=/solr path=/update params={_stateVer_=hdfsbackuprestore_testbackupincsimple:4&waitSearcher=true&commit=true&softCommit=false&wt=javabin&version=2}{commit=} 0 89
[junit4] 2> 934866 INFO (TEST-HdfsCloudIncrementalBackupTest.testSimple-seed#[3DB45BF76357C8CC]) [ ] o.a.s.c.a.c.AbstractIncrementalBackupTest Indexed 71 docs to collection: hdfsbackuprestore_testbackupincsimple
[junit4] 2> 934868 WARN (TEST-HdfsCloudIncrementalBackupTest.testSimple-seed#[3DB45BF76357C8CC]) [ ] o.a.s.c.b.r.HdfsBackupRepository HDFS support in Solr has been deprecated as of 8.6. See SOLR-14021 for details.
[junit4] 2> 934868 INFO (TEST-HdfsCloudIncrementalBackupTest.testSimple-seed#[3DB45BF76357C8CC]) [ ] o.a.s.c.HdfsDirectoryFactory solr.hdfs.home=hdfs://localhost:35775/solr
[junit4] 2> 934868 INFO (TEST-HdfsCloudIncrementalBackupTest.testSimple-seed#[3DB45BF76357C8CC]) [ ] o.a.s.c.HdfsDirectoryFactory Solr Kerberos Authentication disabled
[junit4] 2> 934878 INFO (qtp1424428763-15588) [n:127.0.0.1:42255_solr ] o.a.s.s.HttpSolrCall HttpSolrCall.init(http://127.0.0.1:42255/solr/admin/collections?action=BACKUP&async=f7fda96e-0e6f-4cd7-9f91-5735ef82a4b8&name=mytestbackuptestbackupincsimple&collection=hdfsbackuprestore_testbackupincsimple&location=%2Fbackup&repository=trackingBackupRepository&incremental=true&wt=javabin&version=2)
[junit4] 2> 934881 WARN (qtp1424428763-15588) [n:127.0.0.1:42255_solr c:hdfsbackuprestore_testbackupincsimple ] o.a.s.c.b.r.HdfsBackupRepository HDFS support in Solr has been deprecated as of 8.6. See SOLR-14021 for details.
[junit4] 2> 934881 INFO (qtp1424428763-15588) [n:127.0.0.1:42255_solr c:hdfsbackuprestore_testbackupincsimple ] o.a.s.c.HdfsDirectoryFactory solr.hdfs.home=hdfs://localhost:35775/solr
[junit4] 2> 934881 INFO (qtp1424428763-15588) [n:127.0.0.1:42255_solr c:hdfsbackuprestore_testbackupincsimple ] o.a.s.c.HdfsDirectoryFactory Solr Kerberos Authentication disabled
[junit4] 2> 934893 INFO (qtp1424428763-15588) [n:127.0.0.1:42255_solr c:hdfsbackuprestore_testbackupincsimple ] o.a.s.s.HttpSolrCall [admin] webapp=null path=/admin/collections params={async=f7fda96e-0e6f-4cd7-9f91-5735ef82a4b8&name=mytestbackuptestbackupincsimple&action=BACKUP&location=/backup&collection=hdfsbackuprestore_testbackupincsimple&incremental=true&repository=trackingBackupRepository&wt=javabin&version=2} status=0 QTime=14
[junit4] 2> 934893 INFO (qtp1424428763-15591) [n:127.0.0.1:42255_solr ] o.a.s.s.HttpSolrCall HttpSolrCall.init(http://127.0.0.1:42255/solr/admin/collections?action=REQUESTSTATUS&requestid=f7fda96e-0e6f-4cd7-9f91-5735ef82a4b8&wt=javabin&version=2)
[junit4] 2> 934894 INFO (qtp1424428763-15591) [n:127.0.0.1:42255_solr ] o.a.s.s.HttpSolrCall [admin] webapp=null path=/admin/collections params={requestid=f7fda96e-0e6f-4cd7-9f91-5735ef82a4b8&action=REQUESTSTATUS&wt=javabin&version=2} status=0 QTime=1
[junit4] 2> 934895 INFO (OverseerCollectionConfigSetProcessor-72129748904443910-127.0.0.1:42255_solr-n_0000000000) [n:127.0.0.1:42255_solr ] o.a.s.c.OverseerTaskQueue Response ZK path: /overseer/collection-queue-work/qnr-0000000000 doesn't exist. Requestor may have disconnected from ZooKeeper
[junit4] 2> 934897 WARN (OverseerThreadFactory-10110-thread-2-processing-n:127.0.0.1:42255_solr) [n:127.0.0.1:42255_solr c:hdfsbackuprestore_testbackupincsimple ] o.a.s.c.b.r.HdfsBackupRepository HDFS support in Solr has been deprecated as of 8.6. See SOLR-14021 for details.
[junit4] 2> 934897 INFO (OverseerThreadFactory-10110-thread-2-processing-n:127.0.0.1:42255_solr) [n:127.0.0.1:42255_solr c:hdfsbackuprestore_testbackupincsimple ] o.a.s.c.HdfsDirectoryFactory solr.hdfs.home=hdfs://localhost:35775/solr
[junit4] 2> 934897 INFO (OverseerThreadFactory-10110-thread-2-processing-n:127.0.0.1:42255_solr) [n:127.0.0.1:42255_solr c:hdfsbackuprestore_testbackupincsimple ] o.a.s.c.HdfsDirectoryFactory Solr Kerberos Authentication disabled
[junit4] 2> 934918 INFO (OverseerThreadFactory-10110-thread-2-processing-n:127.0.0.1:42255_solr) [n:127.0.0.1:42255_solr c:hdfsbackuprestore_testbackupincsimple ] o.a.s.c.a.c.BackupCmd Starting backup of collection=hdfsbackuprestore_testbackupincsimple with backupName=mytestbackuptestbackupincsimple at location=hdfs://localhost:35775/backup/mytestbackuptestbackupincsimple/hdfsbackuprestore_testbackupincsimple
[junit4] 2> 934925 INFO (qtp235704197-15600) [n:127.0.0.1:45733_solr ] o.a.s.s.HttpSolrCall HttpSolrCall.init(http://127.0.0.1:45733/solr/admin/cores?null)
[junit4] 2> 934925 INFO (qtp1424428763-15590) [n:127.0.0.1:42255_solr ] o.a.s.s.HttpSolrCall HttpSolrCall.init(http://127.0.0.1:42255/solr/admin/cores?null)
[junit4] 2> 934927 INFO (qtp235704197-15600) [n:127.0.0.1:45733_solr x:hdfsbackuprestore_testbackupincsimple_shard2_replica_n2 ] o.a.s.s.HttpSolrCall [admin] webapp=null path=/admin/cores params={core=hdfsbackuprestore_testbackupincsimple_shard2_replica_n2&async=f7fda96e-0e6f-4cd7-9f91-5735ef82a4b81100997876102523&qt=/admin/cores&name=shard2&shardBackupId=md_shard2_0&action=BACKUPCORE&location=hdfs://localhost:35775/backup/mytestbackuptestbackupincsimple/hdfsbackuprestore_testbackupincsimple&incremental=true&repository=trackingBackupRepository&wt=javabin&version=2} status=0 QTime=1
[junit4] 2> 934927 INFO (qtp1424428763-15590) [n:127.0.0.1:42255_solr x:hdfsbackuprestore_testbackupincsimple_shard1_replica_n1 ] o.a.s.s.HttpSolrCall [admin] webapp=null path=/admin/cores params={core=hdfsbackuprestore_testbackupincsimple_shard1_replica_n1&async=f7fda96e-0e6f-4cd7-9f91-5735ef82a4b81100997876507914&qt=/admin/cores&name=shard1&shardBackupId=md_shard1_0&action=BACKUPCORE&location=hdfs://localhost:35775/backup/mytestbackuptestbackupincsimple/hdfsbackuprestore_testbackupincsimple&incremental=true&repository=trackingBackupRepository&wt=javabin&version=2} status=0 QTime=1
[junit4] 2> 934927 WARN (parallelCoreAdminExecutor-10121-thread-1-processing-n:127.0.0.1:45733_solr x:hdfsbackuprestore_testbackupincsimple_shard2_replica_n2 f7fda96e-0e6f-4cd7-9f91-5735ef82a4b81100997876102523 BACKUPCORE) [n:127.0.0.1:45733_solr x:hdfsbackuprestore_testbackupincsimple_shard2_replica_n2 ] o.a.s.c.b.r.HdfsBackupRepository HDFS support in Solr has been deprecated as of 8.6. See SOLR-14021 for details.
[junit4] 2> 934927 INFO (parallelCoreAdminExecutor-10121-thread-1-processing-n:127.0.0.1:45733_solr x:hdfsbackuprestore_testbackupincsimple_shard2_replica_n2 f7fda96e-0e6f-4cd7-9f91-5735ef82a4b81100997876102523 BACKUPCORE) [n:127.0.0.1:45733_solr x:hdfsbackuprestore_testbackupincsimple_shard2_replica_n2 ] o.a.s.c.HdfsDirectoryFactory solr.hdfs.home=hdfs://localhost:35775/solr
[junit4] 2> 934927 INFO (parallelCoreAdminExecutor-10121-thread-1-processing-n:127.0.0.1:45733_solr x:hdfsbackuprestore_testbackupincsimple_shard2_replica_n2 f7fda96e-0e6f-4cd7-9f91-5735ef82a4b81100997876102523 BACKUPCORE) [n:127.0.0.1:45733_solr x:hdfsbackuprestore_testbackupincsimple_shard2_replica_n2 ] o.a.s.c.HdfsDirectoryFactory Solr Kerberos Authentication disabled
[junit4] 2> 934928 INFO (qtp235704197-15602) [n:127.0.0.1:45733_solr ] o.a.s.s.HttpSolrCall HttpSolrCall.init(http://127.0.0.1:45733/solr/admin/cores?null)
[...truncated too long message...]
Submitting job to respond to event WatchedEvent state:Closed type:None path:null
[junit4] 2> 2146498 DEBUG (closeThreadPool-17730-thread-1-EventThread) [ ] o.a.s.c.c.SolrZkClient Submitting job to respond to event WatchedEvent state:Closed type:None path:null
[junit4] 2> 2146499 INFO (closeThreadPool-17938-thread-3) [ ] o.e.j.s.AbstractConnector Stopped ServerConnector@666e7076{HTTP/1.1, (http/1.1, h2c)}{127.0.0.1:0}
[junit4] 2> 2146500 INFO (closeThreadPool-17938-thread-3) [ ] o.e.j.s.h.ContextHandler Stopped o.e.j.s.ServletContextHandler@52db8626{/k_hfy/eg,null,STOPPED}
[junit4] 2> 2146500 INFO (closeThreadPool-17938-thread-3) [ ] o.e.j.s.session node0 Stopped scavenging
[junit4] 2> 2146501 INFO (TEST-ShardSplitTest.testSplitStaticIndexReplication-seed#[3DB45BF76357C8CC]) [ ] o.a.s.u.ErrorLogMuter Closing ErrorLogMuter-regex-349 after mutting 0 log messages
[junit4] 2> 2146501 INFO (TEST-ShardSplitTest.testSplitStaticIndexReplication-seed#[3DB45BF76357C8CC]) [ ] o.a.s.u.ErrorLogMuter Creating ErrorLogMuter-regex-350 for ERROR logs matching regex: ignore_exception
[junit4] 2> 2146502 INFO (TEST-ShardSplitTest.testSplitStaticIndexReplication-seed#[3DB45BF76357C8CC]) [ ] o.a.s.c.ZkTestServer Shutting down ZkTestServer.
[junit4] 2> 2146603 DEBUG (TEST-ShardSplitTest.testSplitStaticIndexReplication-seed#[3DB45BF76357C8CC]-EventThread) [ ] o.a.s.c.c.SolrZkClient Submitting job to respond to event WatchedEvent state:Closed type:None path:null
[junit4] 2> 2146604 WARN (TEST-ShardSplitTest.testSplitStaticIndexReplication-seed#[3DB45BF76357C8CC]-SendThread(127.0.0.1:37701)) [ ] o.a.z.ClientCnxn An exception was thrown while closing send thread for session 0x10041b1e9c80001.
[junit4] 2> => EndOfStreamException: Unable to read additional data from server sessionid 0x10041b1e9c80001, likely server has closed socket
[junit4] 2> at org.apache.zookeeper.ClientCnxnSocketNIO.doIO(ClientCnxnSocketNIO.java:77)
[junit4] 2> org.apache.zookeeper.ClientCnxn$EndOfStreamException: Unable to read additional data from server sessionid 0x10041b1e9c80001, likely server has closed socket
[junit4] 2> at org.apache.zookeeper.ClientCnxnSocketNIO.doIO(ClientCnxnSocketNIO.java:77) ~[zookeeper-3.6.2.jar:3.6.2]
[junit4] 2> at org.apache.zookeeper.ClientCnxnSocketNIO.doTransport(ClientCnxnSocketNIO.java:350) ~[zookeeper-3.6.2.jar:3.6.2]
[junit4] 2> at org.apache.zookeeper.ClientCnxn$SendThread.run(ClientCnxn.java:1275) [zookeeper-3.6.2.jar:3.6.2]
[junit4] 2> 2146704 DEBUG (TEST-ShardSplitTest.testSplitStaticIndexReplication-seed#[3DB45BF76357C8CC]-EventThread) [ ] o.a.s.c.c.SolrZkClient Submitting job to respond to event WatchedEvent state:Closed type:None path:null
[junit4] 2> 2146705 WARN (ZkTestServer Run Thread) [ ] o.a.s.c.ZkTestServer Watch limit violations:
[junit4] 2> Maximum concurrent create/delete watches above limit:
[junit4] 2>
[junit4] 2> 11 /solr/collections/testSplitStaticIndexReplication_rewrite/terms/shard1_0
[junit4] 2> 9 /solr/aliases.json
[junit4] 2> 8 /solr/collections/collection1/state.json
[junit4] 2> 6 /solr/packages.json
[junit4] 2> 6 /solr/security.json
[junit4] 2> 6 /solr/configs/conf1
[junit4] 2> 6 /solr/collections/collection1/terms/shard1
[junit4] 2> 5 /solr/collections/collection1/collectionprops.json
[junit4] 2> 5 /solr/collections/collection1/terms/shard2
[junit4] 2> 4 /solr/collections/testSplitStaticIndexReplication_rewrite/terms/shard1
[junit4] 2> 4 /solr/collections/testSplitStaticIndexReplication_rewrite/terms/shard1_1
[junit4] 2> 3 /solr/collections/control_collection/terms/shard1
[junit4] 2> 3 /solr/collections/testSplitStaticIndexReplication_rewrite/collectionprops.json
[junit4] 2>
[junit4] 2> Maximum concurrent data watches above limit:
[junit4] 2>
[junit4] 2> 98 /solr/clusterstate.json
[junit4] 2> 13 /solr/collections/testSplitStaticIndexReplication_rewrite/state.json
[junit4] 2> 9 /solr/clusterprops.json
[junit4] 2> 7 /solr/collections/control_collection/state.json
[junit4] 2> 2 /solr/overseer_elect/election/72129826425143312-127.0.0.1:45961_k_hfy%2Feg-n_0000000003
[junit4] 2> 2 /solr/overseer_elect/election/72129826425143300-127.0.0.1:38875_k_hfy%2Feg-n_0000000000
[junit4] 2>
[junit4] 2> Maximum concurrent children watches above limit:
[junit4] 2>
[junit4] 2> 66 /solr/overseer/queue
[junit4] 2> 51 /solr/live_nodes
[junit4] 2> 30 /solr/collections/testSplitStaticIndexReplication_rewrite/state.json
[junit4] 2> 24 /solr/overseer/collection-queue-work
[junit4] 2> 15 /solr/collections
[junit4] 2> 2 /solr/collections/control_collection/state.json
[junit4] 2>
[junit4] 2> 2146709 INFO (TEST-ShardSplitTest.testSplitStaticIndexReplication-seed#[3DB45BF76357C8CC]) [ ] o.a.s.c.ZkTestServer waitForServerDown: 127.0.0.1:37701
[junit4] 2> 2146709 INFO (TEST-ShardSplitTest.testSplitStaticIndexReplication-seed#[3DB45BF76357C8CC]) [ ] o.a.s.c.ZkTestServer parse host and port list: 127.0.0.1:37701
[junit4] 2> 2146709 INFO (TEST-ShardSplitTest.testSplitStaticIndexReplication-seed#[3DB45BF76357C8CC]) [ ] o.a.s.c.ZkTestServer connecting to 127.0.0.1 37701
[junit4] 2> 2146712 INFO (SUITE-ShardSplitTest-seed#[3DB45BF76357C8CC]-worker) [ ] o.a.s.u.ErrorLogMuter Closing ErrorLogMuter-regex-350 after mutting 0 log messages
[junit4] 2> 2146712 INFO (SUITE-ShardSplitTest-seed#[3DB45BF76357C8CC]-worker) [ ] o.a.s.u.ErrorLogMuter Creating ErrorLogMuter-regex-351 for ERROR logs matching regex: ignore_exception
[junit4] 2> NOTE: leaving temporary files on disk at: /home/jenkins/jenkins-slave/workspace/Lucene/Lucene-Solr-Tests-8.11/solr/build/solr-core/test/J0/temp/solr.cloud.api.collections.ShardSplitTest_3DB45BF76357C8CC-001
[junit4] 2> Dec 21, 2023 12:17:08 AM com.carrotsearch.randomizedtesting.ThreadLeakControl checkThreadLeaks
[junit4] 2> WARNING: Will linger awaiting termination of 1 leaked thread(s).
[junit4] 2> NOTE: test params are: codec=CheapBastard, sim=Asserting(RandomSimilarity(queryNorm=false): {}), locale=fr-CA, timezone=Africa/Lagos
[junit4] 2> NOTE: Linux 5.4.0-169-generic amd64/Temurin 1.8.0_362 (64-bit)/cpus=4,threads=1,free=153256704,total=513277952
[junit4] 2> NOTE: All tests run in this JVM: [TestConfigsApi, TestOverriddenPrefixQueryForCustomFieldType, MoveReplicaHDFSFailoverTest, TestReplicationHandler, TestConfigSetsAPIShareSchema, DisMaxRequestHandlerTest, ZkCollectionPropsCachingTest, TestPerFieldSimilarity, CopyFieldTest, ReplaceNodeTest, TestRangeQuery, PrimUtilsTest, TestClassicSimilarityFactory, NodeAddedTriggerIntegrationTest, DocValuesMissingTest, TestConfigReload, TestNumericTerms64, SimpleCollectionCreateDeleteTest, AggValueSourceTest, HdfsRestartWhileUpdatingTest, TestIntervalFaceting, InfoHandlerTest, TestUseDocValuesAsStored2, HdfsCollectionsAPIDistributedZkTest, StatsReloadRaceTest, TestSchemaDesignerAPI, TestFileDictionaryLookup, TestPivotHelperCode, TestRandomFlRTGCloud, TestHalfAndHalfDocValues, CurrencyRangeFacetCloudTest, RecoveryZkTest, MetricUtilsTest, HighlighterWithoutStoredIdTest, TestPolicyCloud, ZkControllerTest, CdcrUpdateLogTest, TestBlockCollapse, TestSearcherReuse, TriLevelCompositeIdRoutingTest, RequestLoggingTest, TimeZoneUtilsTest, CloudMLTQParserTest, ClusterStateMockUtilTest, TestObjectReleaseTracker, TestSimpleTrackingShardHandler, SpatialRPTFieldTypeTest, BadCopyFieldTest, TestRecoveryHdfs, LeaderFailureAfterFreshStartTest, TestLRUStatsCache, NodeMarkersRegistrationTest, TestHdfsCloudBackupRestore, IgnoreCommitOptimizeUpdateProcessorFactoryTest, TestUnInvertedFieldException, SolrTestCaseJ4Test, CollectionReloadTest, RAMDirectoryFactoryTest, SplitShardTest, ParsingFieldUpdateProcessorsTest, TestCloudManagedSchema, ExitableDirectoryReaderTest, TestLFUCache, TestFieldCache, PathHierarchyTokenizerFactoryTest, TestSchemaResource, CoreAdminCreateDiscoverTest, AutoAddReplicasIntegrationTest, TestCodecSupport, TestLuceneIndexBackCompat, ScheduledTriggerTest, MetricsHandlerTest, CoreMergeIndexesAdminHandlerTest, TestCloudSearcherWarming, TestDefaultStatsCache, TestRestoreCore, SolrIndexSplitterTest, TestStressThreadBackup, MultiDestinationAuditLoggerTest, JSONWriterTest, TemplateUpdateProcessorTest, TestOmitPositions, TestDistribDocBasedVersion, ConfigureRecoveryStrategyTest, AnalysisAfterCoreReloadTest, TestSSLRandomization, SearchHandlerTest, TestSolrJacksonAnnotation, SuggestComponentContextFilterQueryTest, TestPHPSerializedResponseWriter, HDFSCollectionsAPITest, FullSolrCloudDistribCmdsTest, TestHighlightDedupGrouping, TestRetrieveFieldsOptimizer, TestReloadAndDeleteDocs, HdfsChaosMonkeySafeLeaderTest, TestImpersonationWithHadoopAuth, ZookeeperReadAPITest, MaxScoreCollectorTest, BasicZkTest, JavabinLoaderTest, ClassificationUpdateProcessorIntegrationTest, PreAnalyzedFieldManagedSchemaCloudTest, DocumentBuilderTest, Tagger2Test, QueryComponentPartialResultsTest, TestXIncludeConfig, NotRequiredUniqueKeyTest, FacetPivotSmallTest, BasicAuthIntegrationTest, SegmentsInfoRequestHandlerTest, PeerSyncWithIndexFingerprintCachingTest, DistributedVersionInfoTest, DistributedDebugComponentTest, TestComplexPhraseQParserPlugin, TestIndexingPerformance, OverseerTest, RouteFieldTest, DistribCursorPagingTest, TestLeaderElectionZkExpiry, TestOnReconnectListenerSupport, TestPullReplicaWithAuth, TestQueryingOnDownCollection, TestSolrCloudWithDelegationTokens, TestSolrCloudWithSecureImpersonation, TestStressInPlaceUpdates, TestTolerantUpdateProcessorRandomCloud, TestWithCollection, TestZkChroot, ZkShardTermsTest, ZkSolrClientTest, ShardSplitTest]
[junit4] Completed [732/959 (2!)] on J0 in 415.70s, 11 tests, 2 errors, 3 skipped <<< FAILURES!
[...truncated 55093 lines...]