You are viewing a plain text version of this content. The canonical link for it is here.
Posted to dev@lucene.apache.org by Apache Jenkins Server <je...@builds.apache.org> on 2013/12/06 17:23:57 UTC
[JENKINS] Lucene-Solr-Tests-4.x-Java7 - Build # 1802 - Failure
Build: https://builds.apache.org/job/Lucene-Solr-Tests-4.x-Java7/1802/
All tests passed
Build Log:
[...truncated 33094 lines...]
[javadoc] Generating Javadoc
[javadoc] Javadoc execution
[javadoc] warning: [options] bootstrap class path not set in conjunction with -source 1.6
[javadoc] Loading source files for package org.apache.lucene...
[javadoc] Loading source files for package org.apache.lucene.analysis...
[javadoc] Loading source files for package org.apache.lucene.analysis.tokenattributes...
[javadoc] Loading source files for package org.apache.lucene.codecs...
[javadoc] Loading source files for package org.apache.lucene.codecs.compressing...
[javadoc] Loading source files for package org.apache.lucene.codecs.lucene3x...
[javadoc] Loading source files for package org.apache.lucene.codecs.lucene40...
[javadoc] Loading source files for package org.apache.lucene.codecs.lucene41...
[javadoc] Loading source files for package org.apache.lucene.codecs.lucene42...
[javadoc] Loading source files for package org.apache.lucene.codecs.lucene45...
[javadoc] Loading source files for package org.apache.lucene.codecs.lucene46...
[javadoc] Loading source files for package org.apache.lucene.codecs.perfield...
[javadoc] Loading source files for package org.apache.lucene.document...
[javadoc] Loading source files for package org.apache.lucene.index...
[javadoc] Loading source files for package org.apache.lucene.search...
[javadoc] Loading source files for package org.apache.lucene.search.payloads...
[javadoc] Loading source files for package org.apache.lucene.search.similarities...
[javadoc] Loading source files for package org.apache.lucene.search.spans...
[javadoc] Loading source files for package org.apache.lucene.store...
[javadoc] Loading source files for package org.apache.lucene.util...
[javadoc] Loading source files for package org.apache.lucene.util.automaton...
[javadoc] Loading source files for package org.apache.lucene.util.fst...
[javadoc] Loading source files for package org.apache.lucene.util.mutable...
[javadoc] Loading source files for package org.apache.lucene.util.packed...
[javadoc] Constructing Javadoc information...
[javadoc] Standard Doclet version 1.7.0_25
[javadoc] Building tree for all the packages and classes...
[javadoc] Generating /usr/home/hudson/hudson-slave/workspace/Lucene-Solr-Tests-4.x-Java7/lucene/build/docs/core/org/apache/lucene/search/package-summary.html...
[javadoc] Copying file /usr/home/hudson/hudson-slave/workspace/Lucene-Solr-Tests-4.x-Java7/lucene/core/src/java/org/apache/lucene/search/doc-files/nrq-formula-2.png to directory /usr/home/hudson/hudson-slave/workspace/Lucene-Solr-Tests-4.x-Java7/lucene/build/docs/core/org/apache/lucene/search/doc-files...
[javadoc] Copying file /usr/home/hudson/hudson-slave/workspace/Lucene-Solr-Tests-4.x-Java7/lucene/core/src/java/org/apache/lucene/search/doc-files/nrq-formula-1.png to directory /usr/home/hudson/hudson-slave/workspace/Lucene-Solr-Tests-4.x-Java7/lucene/build/docs/core/org/apache/lucene/search/doc-files...
[javadoc] Building index for all the packages and classes...
[javadoc] Building index for all classes...
[javadoc] Generating /usr/home/hudson/hudson-slave/workspace/Lucene-Solr-Tests-4.x-Java7/lucene/build/docs/core/help-doc.html...
[javadoc] 1 warning
[...truncated 27 lines...]
[javadoc] Generating Javadoc
[javadoc] Javadoc execution
[javadoc] Loading source files for package org.apache.lucene.analysis.ar...
[javadoc] warning: [options] bootstrap class path not set in conjunction with -source 1.6
[javadoc] Loading source files for package org.apache.lucene.analysis.bg...
[javadoc] Loading source files for package org.apache.lucene.analysis.br...
[javadoc] Loading source files for package org.apache.lucene.analysis.ca...
[javadoc] Loading source files for package org.apache.lucene.analysis.charfilter...
[javadoc] Loading source files for package org.apache.lucene.analysis.cjk...
[javadoc] Loading source files for package org.apache.lucene.analysis.cn...
[javadoc] Loading source files for package org.apache.lucene.analysis.commongrams...
[javadoc] Loading source files for package org.apache.lucene.analysis.compound...
[javadoc] Loading source files for package org.apache.lucene.analysis.compound.hyphenation...
[javadoc] Loading source files for package org.apache.lucene.analysis.core...
[javadoc] Loading source files for package org.apache.lucene.analysis.cz...
[javadoc] Loading source files for package org.apache.lucene.analysis.da...
[javadoc] Loading source files for package org.apache.lucene.analysis.de...
[javadoc] Loading source files for package org.apache.lucene.analysis.el...
[javadoc] Loading source files for package org.apache.lucene.analysis.en...
[javadoc] Loading source files for package org.apache.lucene.analysis.es...
[javadoc] Loading source files for package org.apache.lucene.analysis.eu...
[javadoc] Loading source files for package org.apache.lucene.analysis.fa...
[javadoc] Loading source files for package org.apache.lucene.analysis.fi...
[javadoc] Loading source files for package org.apache.lucene.analysis.fr...
[javadoc] Loading source files for package org.apache.lucene.analysis.ga...
[javadoc] Loading source files for package org.apache.lucene.analysis.gl...
[javadoc] Loading source files for package org.apache.lucene.analysis.hi...
[javadoc] Loading source files for package org.apache.lucene.analysis.hu...
[javadoc] Loading source files for package org.apache.lucene.analysis.hunspell...
[javadoc] Loading source files for package org.apache.lucene.analysis.hy...
[javadoc] Loading source files for package org.apache.lucene.analysis.id...
[javadoc] Loading source files for package org.apache.lucene.analysis.in...
[javadoc] Loading source files for package org.apache.lucene.analysis.it...
[javadoc] Loading source files for package org.apache.lucene.analysis.lv...
[javadoc] Loading source files for package org.apache.lucene.analysis.miscellaneous...
[javadoc] Loading source files for package org.apache.lucene.analysis.ngram...
[javadoc] Loading source files for package org.apache.lucene.analysis.nl...
[javadoc] Loading source files for package org.apache.lucene.analysis.no...
[javadoc] Loading source files for package org.apache.lucene.analysis.path...
[javadoc] Loading source files for package org.apache.lucene.analysis.pattern...
[javadoc] Loading source files for package org.apache.lucene.analysis.payloads...
[javadoc] Loading source files for package org.apache.lucene.analysis.position...
[javadoc] Loading source files for package org.apache.lucene.analysis.pt...
[javadoc] Loading source files for package org.apache.lucene.analysis.query...
[javadoc] Loading source files for package org.apache.lucene.analysis.reverse...
[javadoc] Loading source files for package org.apache.lucene.analysis.ro...
[javadoc] Loading source files for package org.apache.lucene.analysis.ru...
[javadoc] Loading source files for package org.apache.lucene.analysis.shingle...
[javadoc] Loading source files for package org.apache.lucene.analysis.sinks...
[javadoc] Loading source files for package org.apache.lucene.analysis.snowball...
[javadoc] Loading source files for package org.apache.lucene.analysis.standard...
[javadoc] Loading source files for package org.apache.lucene.analysis.standard.std31...
[javadoc] Loading source files for package org.apache.lucene.analysis.standard.std34...
[javadoc] Loading source files for package org.apache.lucene.analysis.standard.std36...
[javadoc] Loading source files for package org.apache.lucene.analysis.sv...
[javadoc] Loading source files for package org.apache.lucene.analysis.synonym...
[javadoc] Loading source files for package org.apache.lucene.analysis.th...
[javadoc] Loading source files for package org.apache.lucene.analysis.tr...
[javadoc] Loading source files for package org.apache.lucene.analysis.util...
[javadoc] Loading source files for package org.apache.lucene.analysis.wikipedia...
[javadoc] Loading source files for package org.apache.lucene.collation...
[javadoc] Loading source files for package org.apache.lucene.collation.tokenattributes...
[javadoc] Loading source files for package org.tartarus.snowball...
[javadoc] Loading source files for package org.tartarus.snowball.ext...
[javadoc] Constructing Javadoc information...
[javadoc] Standard Doclet version 1.7.0_25
[javadoc] Building tree for all the packages and classes...
[javadoc] Building index for all the packages and classes...
[javadoc] Building index for all classes...
[javadoc] Generating /usr/home/hudson/hudson-slave/workspace/Lucene-Solr-Tests-4.x-Java7/lucene/build/docs/analyzers-common/help-doc.html...
[javadoc] 1 warning
[...truncated 29 lines...]
[javadoc] Generating Javadoc
[javadoc] Javadoc execution
[javadoc] warning: [options] bootstrap class path not set in conjunction with -source 1.6
[javadoc] Loading source files for package org.apache.lucene.analysis.icu...
[javadoc] Loading source files for package org.apache.lucene.analysis.icu.segmentation...
[javadoc] Loading source files for package org.apache.lucene.analysis.icu.tokenattributes...
[javadoc] Loading source files for package org.apache.lucene.collation...
[javadoc] Loading source files for package org.apache.lucene.collation.tokenattributes...
[javadoc] Constructing Javadoc information...
[javadoc] Standard Doclet version 1.7.0_25
[javadoc] Building tree for all the packages and classes...
[javadoc] Building index for all the packages and classes...
[javadoc] Building index for all classes...
[javadoc] Generating /usr/home/hudson/hudson-slave/workspace/Lucene-Solr-Tests-4.x-Java7/lucene/build/docs/analyzers-icu/help-doc.html...
[javadoc] Note: Custom tags that were not seen: @lucene.internal
[javadoc] 1 warning
[...truncated 28 lines...]
[javadoc] Generating Javadoc
[javadoc] Javadoc execution
[javadoc] warning: [options] bootstrap class path not set in conjunction with -source 1.6
[javadoc] Loading source files for package org.apache.lucene.analysis.ja...
[javadoc] Loading source files for package org.apache.lucene.analysis.ja.dict...
[javadoc] Loading source files for package org.apache.lucene.analysis.ja.tokenattributes...
[javadoc] Loading source files for package org.apache.lucene.analysis.ja.util...
[javadoc] Constructing Javadoc information...
[javadoc] Standard Doclet version 1.7.0_25
[javadoc] Building tree for all the packages and classes...
[javadoc] Building index for all the packages and classes...
[javadoc] Building index for all classes...
[javadoc] Generating /usr/home/hudson/hudson-slave/workspace/Lucene-Solr-Tests-4.x-Java7/lucene/build/docs/analyzers-kuromoji/help-doc.html...
[javadoc] Note: Custom tags that were not seen: @lucene.internal
[javadoc] 1 warning
[...truncated 28 lines...]
[javadoc] Generating Javadoc
[javadoc] Javadoc execution
[javadoc] warning: [options] bootstrap class path not set in conjunction with -source 1.6
[javadoc] Loading source files for package org.apache.lucene.analysis.morfologik...
[javadoc] Constructing Javadoc information...
[javadoc] Standard Doclet version 1.7.0_25
[javadoc] Building tree for all the packages and classes...
[javadoc] Building index for all the packages and classes...
[javadoc] Building index for all classes...
[javadoc] Generating /usr/home/hudson/hudson-slave/workspace/Lucene-Solr-Tests-4.x-Java7/lucene/build/docs/analyzers-morfologik/help-doc.html...
[javadoc] Note: Custom tags that were not seen: @lucene.internal, @lucene.experimental
[javadoc] 1 warning
[...truncated 28 lines...]
[javadoc] Generating Javadoc
[javadoc] Javadoc execution
[javadoc] warning: [options] bootstrap class path not set in conjunction with -source 1.6
[javadoc] Loading source files for package org.apache.lucene.analysis.phonetic...
[javadoc] Constructing Javadoc information...
[javadoc] Standard Doclet version 1.7.0_25
[javadoc] Building tree for all the packages and classes...
[javadoc] Building index for all the packages and classes...
[javadoc] Building index for all classes...
[javadoc] Generating /usr/home/hudson/hudson-slave/workspace/Lucene-Solr-Tests-4.x-Java7/lucene/build/docs/analyzers-phonetic/help-doc.html...
[javadoc] Note: Custom tags that were not seen: @lucene.internal
[javadoc] 1 warning
[...truncated 28 lines...]
[javadoc] Generating Javadoc
[javadoc] Javadoc execution
[javadoc] warning: [options] bootstrap class path not set in conjunction with -source 1.6
[javadoc] Loading source files for package org.apache.lucene.analysis.cn.smart...
[javadoc] Loading source files for package org.apache.lucene.analysis.cn.smart.hhmm...
[javadoc] Constructing Javadoc information...
[javadoc] Standard Doclet version 1.7.0_25
[javadoc] Building tree for all the packages and classes...
[javadoc] Building index for all the packages and classes...
[javadoc] Building index for all classes...
[javadoc] Generating /usr/home/hudson/hudson-slave/workspace/Lucene-Solr-Tests-4.x-Java7/lucene/build/docs/analyzers-smartcn/help-doc.html...
[javadoc] Note: Custom tags that were not seen: @lucene.internal
[javadoc] 1 warning
[...truncated 28 lines...]
[javadoc] Generating Javadoc
[javadoc] Javadoc execution
[javadoc] warning: [options] bootstrap class path not set in conjunction with -source 1.6
[javadoc] Loading source files for package org.apache.lucene.analysis.pl...
[javadoc] Loading source files for package org.apache.lucene.analysis.stempel...
[javadoc] Loading source files for package org.egothor.stemmer...
[javadoc] Constructing Javadoc information...
[javadoc] Standard Doclet version 1.7.0_25
[javadoc] Building tree for all the packages and classes...
[javadoc] Building index for all the packages and classes...
[javadoc] Building index for all classes...
[javadoc] Generating /usr/home/hudson/hudson-slave/workspace/Lucene-Solr-Tests-4.x-Java7/lucene/build/docs/analyzers-stempel/help-doc.html...
[javadoc] Note: Custom tags that were not seen: @lucene.internal, @lucene.experimental
[javadoc] 1 warning
[...truncated 28 lines...]
[javadoc] Generating Javadoc
[javadoc] Javadoc execution
[javadoc] Loading source files for package org.apache.lucene.analysis.uima...
[javadoc] warning: [options] bootstrap class path not set in conjunction with -source 1.6
[javadoc] Loading source files for package org.apache.lucene.analysis.uima.ae...
[javadoc] Constructing Javadoc information...
[javadoc] Standard Doclet version 1.7.0_25
[javadoc] Building tree for all the packages and classes...
[javadoc] Building index for all the packages and classes...
[javadoc] Building index for all classes...
[javadoc] Generating /usr/home/hudson/hudson-slave/workspace/Lucene-Solr-Tests-4.x-Java7/lucene/build/docs/analyzers-uima/help-doc.html...
[javadoc] Note: Custom tags that were not seen: @lucene.internal, @lucene.experimental
[javadoc] 1 warning
[...truncated 31 lines...]
[javadoc] Generating Javadoc
[javadoc] Javadoc execution
[javadoc] warning: [options] bootstrap class path not set in conjunction with -source 1.6
[javadoc] Loading source files for package org.apache.lucene.index.memory...
[javadoc] Constructing Javadoc information...
[javadoc] Standard Doclet version 1.7.0_25
[javadoc] Building tree for all the packages and classes...
[javadoc] Building index for all the packages and classes...
[javadoc] Building index for all classes...
[javadoc] Generating /usr/home/hudson/hudson-slave/workspace/Lucene-Solr-Tests-4.x-Java7/lucene/build/docs/memory/help-doc.html...
[javadoc] Note: Custom tags that were not seen: @lucene.internal, @lucene.experimental
[javadoc] 1 warning
[...truncated 30 lines...]
[javadoc] Generating Javadoc
[javadoc] Javadoc execution
[javadoc] warning: [options] bootstrap class path not set in conjunction with -source 1.6
[javadoc] Loading source files for package org.apache.lucene.search.highlight...
[javadoc] Loading source files for package org.apache.lucene.search.postingshighlight...
[javadoc] Loading source files for package org.apache.lucene.search.vectorhighlight...
[javadoc] Constructing Javadoc information...
[javadoc] Standard Doclet version 1.7.0_25
[javadoc] Building tree for all the packages and classes...
[javadoc] Building index for all the packages and classes...
[javadoc] Building index for all classes...
[javadoc] Generating /usr/home/hudson/hudson-slave/workspace/Lucene-Solr-Tests-4.x-Java7/lucene/build/docs/highlighter/help-doc.html...
[javadoc] 1 warning
[...truncated 32 lines...]
[javadoc] Generating Javadoc
[javadoc] Javadoc execution
[javadoc] warning: [options] bootstrap class path not set in conjunction with -source 1.6
[javadoc] Loading source files for package org.apache.lucene.queries...
[javadoc] Loading source files for package org.apache.lucene.queries.function...
[javadoc] Loading source files for package org.apache.lucene.queries.function.docvalues...
[javadoc] Loading source files for package org.apache.lucene.queries.function.valuesource...
[javadoc] Loading source files for package org.apache.lucene.queries.mlt...
[javadoc] Constructing Javadoc information...
[javadoc] Standard Doclet version 1.7.0_25
[javadoc] Building tree for all the packages and classes...
[javadoc] Building index for all the packages and classes...
[javadoc] Building index for all classes...
[javadoc] Generating /usr/home/hudson/hudson-slave/workspace/Lucene-Solr-Tests-4.x-Java7/lucene/build/docs/queries/help-doc.html...
[javadoc] 1 warning
[...truncated 27 lines...]
[javadoc] Generating Javadoc
[javadoc] Javadoc execution
[javadoc] warning: [options] bootstrap class path not set in conjunction with -source 1.6
[javadoc] Loading source files for package org.apache.lucene.sandbox.queries...
[javadoc] Loading source files for package org.apache.lucene.sandbox.queries.regex...
[javadoc] Constructing Javadoc information...
[javadoc] Standard Doclet version 1.7.0_25
[javadoc] Building tree for all the packages and classes...
[javadoc] Building index for all the packages and classes...
[javadoc] Building index for all classes...
[javadoc] Generating /usr/home/hudson/hudson-slave/workspace/Lucene-Solr-Tests-4.x-Java7/lucene/build/docs/sandbox/help-doc.html...
[javadoc] Note: Custom tags that were not seen: @lucene.internal, @lucene.experimental
[javadoc] 1 warning
[...truncated 27 lines...]
[javadoc] Generating Javadoc
[javadoc] Javadoc execution
[javadoc] Loading source files for package org.apache.lucene.queryparser.analyzing...
[javadoc] warning: [options] bootstrap class path not set in conjunction with -source 1.6
[javadoc] Loading source files for package org.apache.lucene.queryparser.classic...
[javadoc] Loading source files for package org.apache.lucene.queryparser.complexPhrase...
[javadoc] Loading source files for package org.apache.lucene.queryparser.ext...
[javadoc] Loading source files for package org.apache.lucene.queryparser.flexible.core...
[javadoc] Loading source files for package org.apache.lucene.queryparser.flexible.core.builders...
[javadoc] Loading source files for package org.apache.lucene.queryparser.flexible.core.config...
[javadoc] Loading source files for package org.apache.lucene.queryparser.flexible.core.messages...
[javadoc] Loading source files for package org.apache.lucene.queryparser.flexible.core.nodes...
[javadoc] Loading source files for package org.apache.lucene.queryparser.flexible.core.parser...
[javadoc] Loading source files for package org.apache.lucene.queryparser.flexible.core.processors...
[javadoc] Loading source files for package org.apache.lucene.queryparser.flexible.core.util...
[javadoc] Loading source files for package org.apache.lucene.queryparser.flexible.messages...
[javadoc] Loading source files for package org.apache.lucene.queryparser.flexible.precedence...
[javadoc] Loading source files for package org.apache.lucene.queryparser.flexible.precedence.processors...
[javadoc] Loading source files for package org.apache.lucene.queryparser.flexible.standard...
[javadoc] Loading source files for package org.apache.lucene.queryparser.flexible.standard.builders...
[javadoc] Loading source files for package org.apache.lucene.queryparser.flexible.standard.config...
[javadoc] Loading source files for package org.apache.lucene.queryparser.flexible.standard.nodes...
[javadoc] Loading source files for package org.apache.lucene.queryparser.flexible.standard.parser...
[javadoc] Loading source files for package org.apache.lucene.queryparser.flexible.standard.processors...
[javadoc] Loading source files for package org.apache.lucene.queryparser.simple...
[javadoc] Loading source files for package org.apache.lucene.queryparser.surround.parser...
[javadoc] Loading source files for package org.apache.lucene.queryparser.surround.query...
[javadoc] Loading source files for package org.apache.lucene.queryparser.xml...
[javadoc] Loading source files for package org.apache.lucene.queryparser.xml.builders...
[javadoc] Constructing Javadoc information...
[javadoc] Standard Doclet version 1.7.0_25
[javadoc] Building tree for all the packages and classes...
[javadoc] Building index for all the packages and classes...
[javadoc] Building index for all classes...
[javadoc] Generating /usr/home/hudson/hudson-slave/workspace/Lucene-Solr-Tests-4.x-Java7/lucene/build/docs/queryparser/help-doc.html...
[javadoc] Note: Custom tags that were not seen: @lucene.internal, @lucene.experimental
[javadoc] 1 warning
[...truncated 30 lines...]
[javadoc] Generating Javadoc
[javadoc] Javadoc execution
[javadoc] warning: [options] bootstrap class path not set in conjunction with -source 1.6
[javadoc] Loading source files for package org.apache.lucene.facet...
[javadoc] Loading source files for package org.apache.lucene.facet.associations...
[javadoc] Loading source files for package org.apache.lucene.facet.collections...
[javadoc] Loading source files for package org.apache.lucene.facet.complements...
[javadoc] Loading source files for package org.apache.lucene.facet.encoding...
[javadoc] Loading source files for package org.apache.lucene.facet.index...
[javadoc] Loading source files for package org.apache.lucene.facet.old...
[javadoc] Loading source files for package org.apache.lucene.facet.params...
[javadoc] Loading source files for package org.apache.lucene.facet.partitions...
[javadoc] Loading source files for package org.apache.lucene.facet.range...
[javadoc] Loading source files for package org.apache.lucene.facet.sampling...
[javadoc] Loading source files for package org.apache.lucene.facet.search...
[javadoc] Loading source files for package org.apache.lucene.facet.sortedset...
[javadoc] Loading source files for package org.apache.lucene.facet.taxonomy...
[javadoc] Loading source files for package org.apache.lucene.facet.taxonomy.directory...
[javadoc] Loading source files for package org.apache.lucene.facet.taxonomy.writercache...
[javadoc] Loading source files for package org.apache.lucene.facet.taxonomy.writercache.cl2o...
[javadoc] Loading source files for package org.apache.lucene.facet.taxonomy.writercache.lru...
[javadoc] Loading source files for package org.apache.lucene.facet.util...
[javadoc] Constructing Javadoc information...
[javadoc] Standard Doclet version 1.7.0_25
[javadoc] Building tree for all the packages and classes...
[javadoc] Building index for all the packages and classes...
[javadoc] Building index for all classes...
[javadoc] Generating /usr/home/hudson/hudson-slave/workspace/Lucene-Solr-Tests-4.x-Java7/lucene/build/docs/facet/help-doc.html...
[javadoc] 1 warning
[...truncated 30 lines...]
[javadoc] Generating Javadoc
[javadoc] Javadoc execution
[javadoc] Loading source files for package org.apache.lucene.spatial...
[javadoc] warning: [options] bootstrap class path not set in conjunction with -source 1.6
[javadoc] Loading source files for package org.apache.lucene.spatial.prefix...
[javadoc] Loading source files for package org.apache.lucene.spatial.prefix.tree...
[javadoc] Loading source files for package org.apache.lucene.spatial.query...
[javadoc] Loading source files for package org.apache.lucene.spatial.util...
[javadoc] Loading source files for package org.apache.lucene.spatial.vector...
[javadoc] Constructing Javadoc information...
[javadoc] Standard Doclet version 1.7.0_25
[javadoc] Building tree for all the packages and classes...
[javadoc] Building index for all the packages and classes...
[javadoc] Building index for all classes...
[javadoc] Generating /usr/home/hudson/hudson-slave/workspace/Lucene-Solr-Tests-4.x-Java7/lucene/build/docs/spatial/help-doc.html...
[javadoc] 1 warning
[...truncated 35 lines...]
[javadoc] Generating Javadoc
[javadoc] Javadoc execution
[javadoc] warning: [options] bootstrap class path not set in conjunction with -source 1.6
[javadoc] Loading source files for package org.apache.lucene.benchmark...
[javadoc] Loading source files for package org.apache.lucene.benchmark.byTask...
[javadoc] Loading source files for package org.apache.lucene.benchmark.byTask.feeds...
[javadoc] Loading source files for package org.apache.lucene.benchmark.byTask.programmatic...
[javadoc] Loading source files for package org.apache.lucene.benchmark.byTask.stats...
[javadoc] Loading source files for package org.apache.lucene.benchmark.byTask.tasks...
[javadoc] Loading source files for package org.apache.lucene.benchmark.byTask.utils...
[javadoc] Loading source files for package org.apache.lucene.benchmark.quality...
[javadoc] Loading source files for package org.apache.lucene.benchmark.quality.trec...
[javadoc] Loading source files for package org.apache.lucene.benchmark.quality.utils...
[javadoc] Loading source files for package org.apache.lucene.benchmark.utils...
[javadoc] Constructing Javadoc information...
[javadoc] Standard Doclet version 1.7.0_25
[javadoc] Building tree for all the packages and classes...
[javadoc] Building index for all the packages and classes...
[javadoc] Building index for all classes...
[javadoc] Generating /usr/home/hudson/hudson-slave/workspace/Lucene-Solr-Tests-4.x-Java7/lucene/build/docs/benchmark/help-doc.html...
[javadoc] Note: Custom tags that were not seen: @lucene.internal
[javadoc] 1 warning
[...truncated 30 lines...]
[javadoc] Generating Javadoc
[javadoc] Javadoc execution
[javadoc] warning: [options] bootstrap class path not set in conjunction with -source 1.6
[javadoc] Loading source files for package org.apache.lucene.classification...
[javadoc] Loading source files for package org.apache.lucene.classification.utils...
[javadoc] Constructing Javadoc information...
[javadoc] Standard Doclet version 1.7.0_25
[javadoc] Building tree for all the packages and classes...
[javadoc] Building index for all the packages and classes...
[javadoc] Building index for all classes...
[javadoc] Generating /usr/home/hudson/hudson-slave/workspace/Lucene-Solr-Tests-4.x-Java7/lucene/build/docs/classification/help-doc.html...
[javadoc] Note: Custom tags that were not seen: @lucene.internal
[javadoc] 1 warning
[...truncated 25 lines...]
[javadoc] Generating Javadoc
[javadoc] Javadoc execution
[javadoc] warning: [options] bootstrap class path not set in conjunction with -source 1.6
[javadoc] Loading source files for package org.apache.lucene.codecs.appending...
[javadoc] Loading source files for package org.apache.lucene.codecs.blockterms...
[javadoc] Loading source files for package org.apache.lucene.codecs.bloom...
[javadoc] Loading source files for package org.apache.lucene.codecs.diskdv...
[javadoc] Loading source files for package org.apache.lucene.codecs.intblock...
[javadoc] Loading source files for package org.apache.lucene.codecs.memory...
[javadoc] Loading source files for package org.apache.lucene.codecs.pulsing...
[javadoc] Loading source files for package org.apache.lucene.codecs.sep...
[javadoc] Loading source files for package org.apache.lucene.codecs.simpletext...
[javadoc] Constructing Javadoc information...
[javadoc] Standard Doclet version 1.7.0_25
[javadoc] Building tree for all the packages and classes...
[javadoc] Building index for all the packages and classes...
[javadoc] Building index for all classes...
[javadoc] Generating /usr/home/hudson/hudson-slave/workspace/Lucene-Solr-Tests-4.x-Java7/lucene/build/docs/codecs/help-doc.html...
[javadoc] 1 warning
[...truncated 37 lines...]
[javadoc] Generating Javadoc
[javadoc] Javadoc execution
[javadoc] warning: [options] bootstrap class path not set in conjunction with -source 1.6
[javadoc] Loading source files for package org.apache.lucene.expressions...
[javadoc] Loading source files for package org.apache.lucene.expressions.js...
[javadoc] Constructing Javadoc information...
[javadoc] Standard Doclet version 1.7.0_25
[javadoc] Building tree for all the packages and classes...
[javadoc] Building index for all the packages and classes...
[javadoc] Building index for all classes...
[javadoc] Generating /usr/home/hudson/hudson-slave/workspace/Lucene-Solr-Tests-4.x-Java7/lucene/build/docs/expressions/help-doc.html...
[javadoc] Note: Custom tags that were not seen: @lucene.internal
[javadoc] 1 warning
[...truncated 36 lines...]
[javadoc] Generating Javadoc
[javadoc] Javadoc execution
[javadoc] Loading source files for package org.apache.lucene.demo...
[javadoc] warning: [options] bootstrap class path not set in conjunction with -source 1.6
[javadoc] Loading source files for package org.apache.lucene.demo.facet...
[javadoc] Loading source files for package org.apache.lucene.demo.xmlparser...
[javadoc] Constructing Javadoc information...
[javadoc] Standard Doclet version 1.7.0_25
[javadoc] Building tree for all the packages and classes...
[javadoc] Building index for all the packages and classes...
[javadoc] Building index for all classes...
[javadoc] Generating /usr/home/hudson/hudson-slave/workspace/Lucene-Solr-Tests-4.x-Java7/lucene/build/docs/demo/help-doc.html...
[javadoc] Note: Custom tags that were not seen: @lucene.internal
[javadoc] 1 warning
[...truncated 27 lines...]
[javadoc] Generating Javadoc
[javadoc] Javadoc execution
[javadoc] warning: [options] bootstrap class path not set in conjunction with -source 1.6
[javadoc] Loading source files for package org.apache.lucene.expressions...
[javadoc] Loading source files for package org.apache.lucene.expressions.js...
[javadoc] Constructing Javadoc information...
[javadoc] Standard Doclet version 1.7.0_25
[javadoc] Building tree for all the packages and classes...
[javadoc] Building index for all the packages and classes...
[javadoc] Building index for all classes...
[javadoc] Generating /usr/home/hudson/hudson-slave/workspace/Lucene-Solr-Tests-4.x-Java7/lucene/build/docs/expressions/help-doc.html...
[javadoc] Note: Custom tags that were not seen: @lucene.internal
[javadoc] 1 warning
[...truncated 27 lines...]
[javadoc] Generating Javadoc
[javadoc] Javadoc execution
[javadoc] warning: [options] bootstrap class path not set in conjunction with -source 1.6
[javadoc] Loading source files for package org.apache.lucene.facet...
[javadoc] Loading source files for package org.apache.lucene.facet.associations...
[javadoc] Loading source files for package org.apache.lucene.facet.collections...
[javadoc] Loading source files for package org.apache.lucene.facet.complements...
[javadoc] Loading source files for package org.apache.lucene.facet.encoding...
[javadoc] Loading source files for package org.apache.lucene.facet.index...
[javadoc] Loading source files for package org.apache.lucene.facet.old...
[javadoc] Loading source files for package org.apache.lucene.facet.params...
[javadoc] Loading source files for package org.apache.lucene.facet.partitions...
[javadoc] Loading source files for package org.apache.lucene.facet.range...
[javadoc] Loading source files for package org.apache.lucene.facet.sampling...
[javadoc] Loading source files for package org.apache.lucene.facet.search...
[javadoc] Loading source files for package org.apache.lucene.facet.sortedset...
[javadoc] Loading source files for package org.apache.lucene.facet.taxonomy...
[javadoc] Loading source files for package org.apache.lucene.facet.taxonomy.directory...
[javadoc] Loading source files for package org.apache.lucene.facet.taxonomy.writercache...
[javadoc] Loading source files for package org.apache.lucene.facet.taxonomy.writercache.cl2o...
[javadoc] Loading source files for package org.apache.lucene.facet.taxonomy.writercache.lru...
[javadoc] Loading source files for package org.apache.lucene.facet.util...
[javadoc] Constructing Javadoc information...
[javadoc] Standard Doclet version 1.7.0_25
[javadoc] Building tree for all the packages and classes...
[javadoc] Building index for all the packages and classes...
[javadoc] Building index for all classes...
[javadoc] Generating /usr/home/hudson/hudson-slave/workspace/Lucene-Solr-Tests-4.x-Java7/lucene/build/docs/facet/help-doc.html...
[javadoc] 1 warning
[...truncated 28 lines...]
[javadoc] Generating Javadoc
[javadoc] Javadoc execution
[javadoc] warning: [options] bootstrap class path not set in conjunction with -source 1.6
[javadoc] Loading source files for package org.apache.lucene.search.grouping...
[javadoc] Loading source files for package org.apache.lucene.search.grouping.function...
[javadoc] Loading source files for package org.apache.lucene.search.grouping.term...
[javadoc] Constructing Javadoc information...
[javadoc] Standard Doclet version 1.7.0_25
[javadoc] Building tree for all the packages and classes...
[javadoc] Building index for all the packages and classes...
[javadoc] Building index for all classes...
[javadoc] Generating /usr/home/hudson/hudson-slave/workspace/Lucene-Solr-Tests-4.x-Java7/lucene/build/docs/grouping/help-doc.html...
[javadoc] 1 warning
[...truncated 27 lines...]
[javadoc] Generating Javadoc
[javadoc] Javadoc execution
[javadoc] warning: [options] bootstrap class path not set in conjunction with -source 1.6
[javadoc] Loading source files for package org.apache.lucene.search.highlight...
[javadoc] Loading source files for package org.apache.lucene.search.postingshighlight...
[javadoc] Loading source files for package org.apache.lucene.search.vectorhighlight...
[javadoc] Constructing Javadoc information...
[javadoc] Standard Doclet version 1.7.0_25
[javadoc] Building tree for all the packages and classes...
[javadoc] Building index for all the packages and classes...
[javadoc] Building index for all classes...
[javadoc] Generating /usr/home/hudson/hudson-slave/workspace/Lucene-Solr-Tests-4.x-Java7/lucene/build/docs/highlighter/help-doc.html...
[javadoc] 1 warning
[...truncated 28 lines...]
[javadoc] Generating Javadoc
[javadoc] Javadoc execution
[javadoc] warning: [options] bootstrap class path not set in conjunction with -source 1.6
[javadoc] Loading source files for package org.apache.lucene.search.join...
[javadoc] Constructing Javadoc information...
[javadoc] Standard Doclet version 1.7.0_25
[javadoc] Building tree for all the packages and classes...
[javadoc] Building index for all the packages and classes...
[javadoc] Building index for all classes...
[javadoc] Generating /usr/home/hudson/hudson-slave/workspace/Lucene-Solr-Tests-4.x-Java7/lucene/build/docs/join/help-doc.html...
[javadoc] Note: Custom tags that were not seen: @lucene.internal
[javadoc] 1 warning
[...truncated 27 lines...]
[javadoc] Generating Javadoc
[javadoc] Javadoc execution
[javadoc] warning: [options] bootstrap class path not set in conjunction with -source 1.6
[javadoc] Loading source files for package org.apache.lucene.index.memory...
[javadoc] Constructing Javadoc information...
[javadoc] Standard Doclet version 1.7.0_25
[javadoc] Building tree for all the packages and classes...
[javadoc] Building index for all the packages and classes...
[javadoc] Building index for all classes...
[javadoc] Generating /usr/home/hudson/hudson-slave/workspace/Lucene-Solr-Tests-4.x-Java7/lucene/build/docs/memory/help-doc.html...
[javadoc] Note: Custom tags that were not seen: @lucene.internal, @lucene.experimental
[javadoc] 1 warning
[...truncated 25 lines...]
[javadoc] Generating Javadoc
[javadoc] Javadoc execution
[javadoc] warning: [options] bootstrap class path not set in conjunction with -source 1.6
[javadoc] Loading source files for package org.apache.lucene.document...
[javadoc] Loading source files for package org.apache.lucene.index...
[javadoc] Loading source files for package org.apache.lucene.index.sorter...
[javadoc] Loading source files for package org.apache.lucene.misc...
[javadoc] Loading source files for package org.apache.lucene.store...
[javadoc] Loading source files for package org.apache.lucene.util.fst...
[javadoc] Constructing Javadoc information...
[javadoc] Standard Doclet version 1.7.0_25
[javadoc] Building tree for all the packages and classes...
[javadoc] Generating /usr/home/hudson/hudson-slave/workspace/Lucene-Solr-Tests-4.x-Java7/lucene/build/docs/misc/org/apache/lucene/misc/package-summary.html...
[javadoc] Copying file /usr/home/hudson/hudson-slave/workspace/Lucene-Solr-Tests-4.x-Java7/lucene/misc/src/java/org/apache/lucene/misc/doc-files/ss.baselineTf.svg to directory /usr/home/hudson/hudson-slave/workspace/Lucene-Solr-Tests-4.x-Java7/lucene/build/docs/misc/org/apache/lucene/misc/doc-files...
[javadoc] Copying file /usr/home/hudson/hudson-slave/workspace/Lucene-Solr-Tests-4.x-Java7/lucene/misc/src/java/org/apache/lucene/misc/doc-files/ss.computeLengthNorm.svg to directory /usr/home/hudson/hudson-slave/workspace/Lucene-Solr-Tests-4.x-Java7/lucene/build/docs/misc/org/apache/lucene/misc/doc-files...
[javadoc] Copying file /usr/home/hudson/hudson-slave/workspace/Lucene-Solr-Tests-4.x-Java7/lucene/misc/src/java/org/apache/lucene/misc/doc-files/ss.hyperbolicTf.svg to directory /usr/home/hudson/hudson-slave/workspace/Lucene-Solr-Tests-4.x-Java7/lucene/build/docs/misc/org/apache/lucene/misc/doc-files...
[javadoc] Copying file /usr/home/hudson/hudson-slave/workspace/Lucene-Solr-Tests-4.x-Java7/lucene/misc/src/java/org/apache/lucene/misc/doc-files/ss.gnuplot to directory /usr/home/hudson/hudson-slave/workspace/Lucene-Solr-Tests-4.x-Java7/lucene/build/docs/misc/org/apache/lucene/misc/doc-files...
[javadoc] Building index for all the packages and classes...
[javadoc] Building index for all classes...
[javadoc] Generating /usr/home/hudson/hudson-slave/workspace/Lucene-Solr-Tests-4.x-Java7/lucene/build/docs/misc/help-doc.html...
[javadoc] 1 warning
[...truncated 24 lines...]
[javadoc] Generating Javadoc
[javadoc] Javadoc execution
[javadoc] warning: [options] bootstrap class path not set in conjunction with -source 1.6
[javadoc] Loading source files for package org.apache.lucene.queries...
[javadoc] Loading source files for package org.apache.lucene.queries.function...
[javadoc] Loading source files for package org.apache.lucene.queries.function.docvalues...
[javadoc] Loading source files for package org.apache.lucene.queries.function.valuesource...
[javadoc] Loading source files for package org.apache.lucene.queries.mlt...
[javadoc] Constructing Javadoc information...
[javadoc] Standard Doclet version 1.7.0_25
[javadoc] Building tree for all the packages and classes...
[javadoc] Building index for all the packages and classes...
[javadoc] Building index for all classes...
[javadoc] Generating /usr/home/hudson/hudson-slave/workspace/Lucene-Solr-Tests-4.x-Java7/lucene/build/docs/queries/help-doc.html...
[javadoc] 1 warning
[...truncated 31 lines...]
[javadoc] Generating Javadoc
[javadoc] Javadoc execution
[javadoc] Loading source files for package org.apache.lucene.queryparser.analyzing...
[javadoc] warning: [options] bootstrap class path not set in conjunction with -source 1.6
[javadoc] Loading source files for package org.apache.lucene.queryparser.classic...
[javadoc] Loading source files for package org.apache.lucene.queryparser.complexPhrase...
[javadoc] Loading source files for package org.apache.lucene.queryparser.ext...
[javadoc] Loading source files for package org.apache.lucene.queryparser.flexible.core...
[javadoc] Loading source files for package org.apache.lucene.queryparser.flexible.core.builders...
[javadoc] Loading source files for package org.apache.lucene.queryparser.flexible.core.config...
[javadoc] Loading source files for package org.apache.lucene.queryparser.flexible.core.messages...
[javadoc] Loading source files for package org.apache.lucene.queryparser.flexible.core.nodes...
[javadoc] Loading source files for package org.apache.lucene.queryparser.flexible.core.parser...
[javadoc] Loading source files for package org.apache.lucene.queryparser.flexible.core.processors...
[javadoc] Loading source files for package org.apache.lucene.queryparser.flexible.core.util...
[javadoc] Loading source files for package org.apache.lucene.queryparser.flexible.messages...
[javadoc] Loading source files for package org.apache.lucene.queryparser.flexible.precedence...
[javadoc] Loading source files for package org.apache.lucene.queryparser.flexible.precedence.processors...
[javadoc] Loading source files for package org.apache.lucene.queryparser.flexible.standard...
[javadoc] Loading source files for package org.apache.lucene.queryparser.flexible.standard.builders...
[javadoc] Loading source files for package org.apache.lucene.queryparser.flexible.standard.config...
[javadoc] Loading source files for package org.apache.lucene.queryparser.flexible.standard.nodes...
[javadoc] Loading source files for package org.apache.lucene.queryparser.flexible.standard.parser...
[javadoc] Loading source files for package org.apache.lucene.queryparser.flexible.standard.processors...
[javadoc] Loading source files for package org.apache.lucene.queryparser.simple...
[javadoc] Loading source files for package org.apache.lucene.queryparser.surround.parser...
[javadoc] Loading source files for package org.apache.lucene.queryparser.surround.query...
[javadoc] Loading source files for package org.apache.lucene.queryparser.xml...
[javadoc] Loading source files for package org.apache.lucene.queryparser.xml.builders...
[javadoc] Constructing Javadoc information...
[javadoc] Standard Doclet version 1.7.0_25
[javadoc] Building tree for all the packages and classes...
[javadoc] Building index for all the packages and classes...
[javadoc] Building index for all classes...
[javadoc] Generating /usr/home/hudson/hudson-slave/workspace/Lucene-Solr-Tests-4.x-Java7/lucene/build/docs/queryparser/help-doc.html...
[javadoc] Note: Custom tags that were not seen: @lucene.internal, @lucene.experimental
[javadoc] 1 warning
[...truncated 29 lines...]
[javadoc] Generating Javadoc
[javadoc] Javadoc execution
[javadoc] warning: [options] bootstrap class path not set in conjunction with -source 1.6
[javadoc] Loading source files for package org.apache.lucene.replicator...
[javadoc] Loading source files for package org.apache.lucene.replicator.http...
[javadoc] Constructing Javadoc information...
[javadoc] Standard Doclet version 1.7.0_25
[javadoc] Building tree for all the packages and classes...
[javadoc] Building index for all the packages and classes...
[javadoc] Building index for all classes...
[javadoc] Generating /usr/home/hudson/hudson-slave/workspace/Lucene-Solr-Tests-4.x-Java7/lucene/build/docs/replicator/help-doc.html...
[javadoc] Note: Custom tags that were not seen: @lucene.internal
[javadoc] 1 warning
[...truncated 24 lines...]
[javadoc] Generating Javadoc
[javadoc] Javadoc execution
[javadoc] warning: [options] bootstrap class path not set in conjunction with -source 1.6
[javadoc] Loading source files for package org.apache.lucene.sandbox.queries...
[javadoc] Loading source files for package org.apache.lucene.sandbox.queries.regex...
[javadoc] Constructing Javadoc information...
[javadoc] Standard Doclet version 1.7.0_25
[javadoc] Building tree for all the packages and classes...
[javadoc] Building index for all the packages and classes...
[javadoc] Building index for all classes...
[javadoc] Generating /usr/home/hudson/hudson-slave/workspace/Lucene-Solr-Tests-4.x-Java7/lucene/build/docs/sandbox/help-doc.html...
[javadoc] Note: Custom tags that were not seen: @lucene.internal, @lucene.experimental
[javadoc] 1 warning
[...truncated 27 lines...]
[javadoc] Generating Javadoc
[javadoc] Javadoc execution
[javadoc] warning: [options] bootstrap class path not set in conjunction with -source 1.6
[javadoc] Loading source files for package org.apache.lucene.spatial...
[javadoc] Loading source files for package org.apache.lucene.spatial.prefix...
[javadoc] Loading source files for package org.apache.lucene.spatial.prefix.tree...
[javadoc] Loading source files for package org.apache.lucene.spatial.query...
[javadoc] Loading source files for package org.apache.lucene.spatial.util...
[javadoc] Loading source files for package org.apache.lucene.spatial.vector...
[javadoc] Constructing Javadoc information...
[javadoc] Standard Doclet version 1.7.0_25
[javadoc] Building tree for all the packages and classes...
[javadoc] Building index for all the packages and classes...
[javadoc] Building index for all classes...
[javadoc] Generating /usr/home/hudson/hudson-slave/workspace/Lucene-Solr-Tests-4.x-Java7/lucene/build/docs/spatial/help-doc.html...
[javadoc] 1 warning
[...truncated 32 lines...]
[javadoc] Generating Javadoc
[javadoc] Javadoc execution
[javadoc] warning: [options] bootstrap class path not set in conjunction with -source 1.6
[javadoc] Loading source files for package org.apache.lucene.search.spell...
[javadoc] Loading source files for package org.apache.lucene.search.suggest...
[javadoc] Loading source files for package org.apache.lucene.search.suggest.analyzing...
[javadoc] Loading source files for package org.apache.lucene.search.suggest.fst...
[javadoc] Loading source files for package org.apache.lucene.search.suggest.jaspell...
[javadoc] Loading source files for package org.apache.lucene.search.suggest.tst...
[javadoc] Constructing Javadoc information...
[javadoc] Standard Doclet version 1.7.0_25
[javadoc] Building tree for all the packages and classes...
[javadoc] Building index for all the packages and classes...
[javadoc] Building index for all classes...
[javadoc] Generating /usr/home/hudson/hudson-slave/workspace/Lucene-Solr-Tests-4.x-Java7/lucene/build/docs/suggest/help-doc.html...
[javadoc] 1 warning
[...truncated 18 lines...]
[javadoc] Generating Javadoc
[javadoc] Javadoc execution
[javadoc] warning: [options] bootstrap class path not set in conjunction with -source 1.6
[javadoc] Loading source files for package org.apache.lucene.analysis...
[javadoc] Loading source files for package org.apache.lucene.codecs...
[javadoc] Loading source files for package org.apache.lucene.codecs.appending...
[javadoc] Loading source files for package org.apache.lucene.codecs.asserting...
[javadoc] Loading source files for package org.apache.lucene.codecs.bloom...
[javadoc] Loading source files for package org.apache.lucene.codecs.cheapbastard...
[javadoc] Loading source files for package org.apache.lucene.codecs.compressing...
[javadoc] Loading source files for package org.apache.lucene.codecs.compressing.dummy...
[javadoc] Loading source files for package org.apache.lucene.codecs.lucene3x...
[javadoc] Loading source files for package org.apache.lucene.codecs.lucene40...
[javadoc] Loading source files for package org.apache.lucene.codecs.lucene41...
[javadoc] Loading source files for package org.apache.lucene.codecs.lucene41ords...
[javadoc] Loading source files for package org.apache.lucene.codecs.lucene42...
[javadoc] Loading source files for package org.apache.lucene.codecs.lucene45...
[javadoc] Loading source files for package org.apache.lucene.codecs.mockintblock...
[javadoc] Loading source files for package org.apache.lucene.codecs.mockrandom...
[javadoc] Loading source files for package org.apache.lucene.codecs.mocksep...
[javadoc] Loading source files for package org.apache.lucene.codecs.nestedpulsing...
[javadoc] Loading source files for package org.apache.lucene.codecs.ramonly...
[javadoc] Loading source files for package org.apache.lucene.index...
[javadoc] Loading source files for package org.apache.lucene.search...
[javadoc] Loading source files for package org.apache.lucene.store...
[javadoc] Loading source files for package org.apache.lucene.util...
[javadoc] Loading source files for package org.apache.lucene.util.automaton...
[javadoc] Loading source files for package org.apache.lucene.util.fst...
[javadoc] Constructing Javadoc information...
[javadoc] Standard Doclet version 1.7.0_25
[javadoc] Building tree for all the packages and classes...
[javadoc] Building index for all the packages and classes...
[javadoc] Building index for all classes...
[javadoc] Generating /usr/home/hudson/hudson-slave/workspace/Lucene-Solr-Tests-4.x-Java7/lucene/build/docs/test-framework/help-doc.html...
[javadoc] 1 warning
[...truncated 3204 lines...]
-ecj-javadoc-lint-src:
[ecj-lint] Compiling 131 source files
[ecj-lint] ----------
[ecj-lint] 1. ERROR in /usr/home/hudson/hudson-slave/workspace/Lucene-Solr-Tests-4.x-Java7/solr/solrj/src/java/org/apache/solr/common/cloud/ClusterState.java (at line 63)
[ecj-lint] * @deprecated
[ecj-lint] ^^^^^^^^^^
[ecj-lint] Javadoc: Description expected after @deprecated
[ecj-lint] ----------
[ecj-lint] 2. ERROR in /usr/home/hudson/hudson-slave/workspace/Lucene-Solr-Tests-4.x-Java7/solr/solrj/src/java/org/apache/solr/common/cloud/ClusterState.java (at line 366)
[ecj-lint] * @param liveNodes
[ecj-lint] ^^^^^^^^^
[ecj-lint] Javadoc: Description expected after this reference
[ecj-lint] ----------
[ecj-lint] 2 problems (2 errors)
BUILD FAILED
/usr/home/hudson/hudson-slave/workspace/Lucene-Solr-Tests-4.x-Java7/build.xml:426: The following error occurred while executing this line:
/usr/home/hudson/hudson-slave/workspace/Lucene-Solr-Tests-4.x-Java7/build.xml:57: The following error occurred while executing this line:
/usr/home/hudson/hudson-slave/workspace/Lucene-Solr-Tests-4.x-Java7/solr/build.xml:562: The following error occurred while executing this line:
/usr/home/hudson/hudson-slave/workspace/Lucene-Solr-Tests-4.x-Java7/solr/solrj/build.xml:60: The following error occurred while executing this line:
/usr/home/hudson/hudson-slave/workspace/Lucene-Solr-Tests-4.x-Java7/lucene/common-build.xml:1832: Compile failed; see the compiler error output for details.
Total time: 92 minutes 4 seconds
Build step 'Invoke Ant' marked build as failure
Archiving artifacts
Recording test results
Email was triggered for: Failure
Sending email for trigger: Failure
[JENKINS] Lucene-Solr-Tests-4.x-Java7 - Build # 1803 - Still
Failing
Posted by Apache Jenkins Server <je...@builds.apache.org>.
Build: https://builds.apache.org/job/Lucene-Solr-Tests-4.x-Java7/1803/
2 tests failed.
REGRESSION: org.apache.lucene.analysis.uima.UIMABaseAnalyzerTest.baseUIMAAnalyzerIntegrationTest
Error Message:
Test abandoned because suite timeout was reached.
Stack Trace:
java.lang.Exception: Test abandoned because suite timeout was reached.
at __randomizedtesting.SeedInfo.seed([B5FF79B9C8449580]:0)
FAILED: junit.framework.TestSuite.org.apache.lucene.analysis.uima.UIMABaseAnalyzerTest
Error Message:
Suite timeout exceeded (>= 7200000 msec).
Stack Trace:
java.lang.Exception: Suite timeout exceeded (>= 7200000 msec).
at __randomizedtesting.SeedInfo.seed([B5FF79B9C8449580]:0)
Build Log:
[...truncated 6630 lines...]
[junit4] Suite: org.apache.lucene.analysis.uima.UIMABaseAnalyzerTest
[junit4] 2> ?????? ??, ???? ?:??:?? ??????? WhitespaceTokenizer initialize
[junit4] 2> INFO: "Whitespace tokenizer successfully initialized"
[junit4] 2> ?????? ??, ???? ?:??:?? ??????? WhitespaceTokenizer typeSystemInit
[junit4] 2> INFO: "Whitespace tokenizer typesystem initialized"
[junit4] 2> ?????? ??, ???? ?:??:?? ??????? WhitespaceTokenizer process
[junit4] 2> INFO: "Whitespace tokenizer starts processing"
[junit4] 2> ?????? ??, ???? ?:??:?? ??????? WhitespaceTokenizer process
[junit4] 2> INFO: "Whitespace tokenizer finished processing"
[junit4] 2> ?????? ??, ???? ?:??:?? ??????? com.carrotsearch.randomizedtesting.ThreadLeakControl$2 evaluate
[junit4] 2> WARNING: Suite execution timed out: org.apache.lucene.analysis.uima.UIMABaseAnalyzerTest
[junit4] 2> ==== jstack at approximately timeout time ====
[junit4] 2> "TEST-UIMABaseAnalyzerTest.baseUIMAAnalyzerIntegrationTest-seed#[B5FF79B9C8449580]" ID=17 RUNNABLE
[junit4] 2> at java.util.HashMap.getEntry(HashMap.java:446)
[junit4] 2> at java.util.HashMap.containsKey(HashMap.java:434)
[junit4] 2> at java.util.HashSet.contains(HashSet.java:201)
[junit4] 2> at org.apache.uima.analysis_engine.impl.AnalysisEngineManagementImpl.setName(AnalysisEngineManagementImpl.java:242)
[junit4] 2> at org.apache.uima.analysis_engine.impl.AnalysisEngineImplBase.initialize(AnalysisEngineImplBase.java:181)
[junit4] 2> at org.apache.uima.analysis_engine.impl.AggregateAnalysisEngine_impl.initialize(AggregateAnalysisEngine_impl.java:127)
[junit4] 2> at org.apache.uima.impl.AnalysisEngineFactory_impl.produceResource(AnalysisEngineFactory_impl.java:94)
[junit4] 2> at org.apache.uima.impl.CompositeResourceFactory_impl.produceResource(CompositeResourceFactory_impl.java:62)
[junit4] 2> at org.apache.uima.UIMAFramework.produceResource(UIMAFramework.java:267)
[junit4] 2> at org.apache.uima.UIMAFramework.produceAnalysisEngine(UIMAFramework.java:335)
[junit4] 2> at org.apache.lucene.analysis.uima.ae.BasicAEProvider.getAE(BasicAEProvider.java:73)
[junit4] 2> at org.apache.lucene.analysis.uima.BaseUIMATokenizer.analyzeInput(BaseUIMATokenizer.java:63)
[junit4] 2> at org.apache.lucene.analysis.uima.UIMAAnnotationsTokenizer.initializeIterator(UIMAAnnotationsTokenizer.java:60)
[junit4] 2> at org.apache.lucene.analysis.uima.UIMAAnnotationsTokenizer.incrementToken(UIMAAnnotationsTokenizer.java:74)
[junit4] 2> at org.apache.lucene.index.DocInverterPerField.processFields(DocInverterPerField.java:102)
[junit4] 2> at org.apache.lucene.index.DocFieldProcessor.processDocument(DocFieldProcessor.java:248)
[junit4] 2> at org.apache.lucene.index.DocumentsWriterPerThread.updateDocument(DocumentsWriterPerThread.java:253)
[junit4] 2> at org.apache.lucene.index.DocumentsWriter.updateDocument(DocumentsWriter.java:453)
[junit4] 2> at org.apache.lucene.index.IndexWriter.updateDocument(IndexWriter.java:1520)
[junit4] 2> at org.apache.lucene.index.IndexWriter.addDocument(IndexWriter.java:1190)
[junit4] 2> at org.apache.lucene.analysis.uima.UIMABaseAnalyzerTest.baseUIMAAnalyzerIntegrationTest(UIMABaseAnalyzerTest.java:78)
[junit4] 2> at sun.reflect.NativeMethodAccessorImpl.invoke0(Native Method)
[junit4] 2> at sun.reflect.NativeMethodAccessorImpl.invoke(NativeMethodAccessorImpl.java:57)
[junit4] 2> at sun.reflect.DelegatingMethodAccessorImpl.invoke(DelegatingMethodAccessorImpl.java:43)
[junit4] 2> at java.lang.reflect.Method.invoke(Method.java:606)
[junit4] 2> at com.carrotsearch.randomizedtesting.RandomizedRunner.invoke(RandomizedRunner.java:1559)
[junit4] 2> at com.carrotsearch.randomizedtesting.RandomizedRunner.access$600(RandomizedRunner.java:79)
[junit4] 2> at com.carrotsearch.randomizedtesting.RandomizedRunner$6.evaluate(RandomizedRunner.java:737)
[junit4] 2> at com.carrotsearch.randomizedtesting.RandomizedRunner$7.evaluate(RandomizedRunner.java:773)
[junit4] 2> at com.carrotsearch.randomizedtesting.RandomizedRunner$8.evaluate(RandomizedRunner.java:787)
[junit4] 2> at org.apache.lucene.util.TestRuleSetupTeardownChained$1.evaluate(TestRuleSetupTeardownChained.java:50)
[junit4] 2> at org.apache.lucene.util.TestRuleFieldCacheSanity$1.evaluate(TestRuleFieldCacheSanity.java:51)
[junit4] 2> at org.apache.lucene.util.AbstractBeforeAfterRule$1.evaluate(AbstractBeforeAfterRule.java:46)
[junit4] 2> at com.carrotsearch.randomizedtesting.rules.SystemPropertiesInvariantRule$1.evaluate(SystemPropertiesInvariantRule.java:55)
[junit4] 2> at org.apache.lucene.util.TestRuleThreadAndTestName$1.evaluate(TestRuleThreadAndTestName.java:49)
[junit4] 2> at org.apache.lucene.util.TestRuleIgnoreAfterMaxFailures$1.evaluate(TestRuleIgnoreAfterMaxFailures.java:70)
[junit4] 2> at org.apache.lucene.util.TestRuleMarkFailure$1.evaluate(TestRuleMarkFailure.java:48)
[junit4] 2> at com.carrotsearch.randomizedtesting.rules.StatementAdapter.evaluate(StatementAdapter.java:36)
[junit4] 2> at com.carrotsearch.randomizedtesting.ThreadLeakControl$StatementRunner.run(ThreadLeakControl.java:358)
[junit4] 2> at com.carrotsearch.randomizedtesting.ThreadLeakControl.forkTimeoutingTask(ThreadLeakControl.java:782)
[junit4] 2> at com.carrotsearch.randomizedtesting.ThreadLeakControl$3.evaluate(ThreadLeakControl.java:442)
[junit4] 2> at com.carrotsearch.randomizedtesting.RandomizedRunner.runSingleTest(RandomizedRunner.java:746)
[junit4] 2> at com.carrotsearch.randomizedtesting.RandomizedRunner$3.evaluate(RandomizedRunner.java:648)
[junit4] 2> at com.carrotsearch.randomizedtesting.RandomizedRunner$4.evaluate(RandomizedRunner.java:682)
[junit4] 2> at com.carrotsearch.randomizedtesting.RandomizedRunner$5.evaluate(RandomizedRunner.java:693)
[junit4] 2> at org.apache.lucene.util.AbstractBeforeAfterRule$1.evaluate(AbstractBeforeAfterRule.java:46)
[junit4] 2> at org.apache.lucene.util.TestRuleStoreClassName$1.evaluate(TestRuleStoreClassName.java:42)
[junit4] 2> at com.carrotsearch.randomizedtesting.rules.SystemPropertiesInvariantRule$1.evaluate(SystemPropertiesInvariantRule.java:55)
[junit4] 2> at com.carrotsearch.randomizedtesting.rules.NoShadowingOrOverridesOnMethodsRule$1.evaluate(NoShadowingOrOverridesOnMethodsRule.java:39)
[junit4] 2> at com.carrotsearch.randomizedtesting.rules.NoShadowingOrOverridesOnMethodsRule$1.evaluate(NoShadowingOrOverridesOnMethodsRule.java:39)
[junit4] 2> at com.carrotsearch.randomizedtesting.rules.StatementAdapter.evaluate(StatementAdapter.java:36)
[junit4] 2> at org.apache.lucene.util.TestRuleAssertionsRequired$1.evaluate(TestRuleAssertionsRequired.java:43)
[junit4] 2> at org.apache.lucene.util.TestRuleMarkFailure$1.evaluate(TestRuleMarkFailure.java:48)
[junit4] 2> at org.apache.lucene.util.TestRuleIgnoreAfterMaxFailures$1.evaluate(TestRuleIgnoreAfterMaxFailures.java:70)
[junit4] 2> at org.apache.lucene.util.TestRuleIgnoreTestSuites$1.evaluate(TestRuleIgnoreTestSuites.java:55)
[junit4] 2> at com.carrotsearch.randomizedtesting.rules.StatementAdapter.evaluate(StatementAdapter.java:36)
[junit4] 2> at com.carrotsearch.randomizedtesting.ThreadLeakControl$StatementRunner.run(ThreadLeakControl.java:358)
[junit4] 2> at java.lang.Thread.run(Thread.java:724)
[junit4] 2> Locked synchronizers:
[junit4] 2> - java.util.concurrent.locks.ReentrantLock$NonfairSync@51485b22
[junit4] 2>
[junit4] 2> "SUITE-UIMABaseAnalyzerTest-seed#[B5FF79B9C8449580]" ID=16 RUNNABLE
[junit4] 2> at sun.management.ThreadImpl.dumpThreads0(Native Method)
[junit4] 2> at sun.management.ThreadImpl.dumpAllThreads(ThreadImpl.java:446)
[junit4] 2> at com.carrotsearch.randomizedtesting.ThreadLeakControl.formatThreadStacksFull(ThreadLeakControl.java:655)
[junit4] 2> at com.carrotsearch.randomizedtesting.ThreadLeakControl.access$800(ThreadLeakControl.java:60)
[junit4] 2> at com.carrotsearch.randomizedtesting.ThreadLeakControl$2.evaluate(ThreadLeakControl.java:396)
[junit4] 2> - locked java.lang.Object@65573ede
[junit4] 2> at com.carrotsearch.randomizedtesting.RandomizedRunner.runSuite(RandomizedRunner.java:556)
[junit4] 2> at com.carrotsearch.randomizedtesting.RandomizedRunner.access$200(RandomizedRunner.java:79)
[junit4] 2> at com.carrotsearch.randomizedtesting.RandomizedRunner$1.run(RandomizedRunner.java:492)
[junit4] 2>
[junit4] 2> "Signal Dispatcher" ID=5 RUNNABLE
[junit4] 2>
[junit4] 2> "Finalizer" ID=3 WAITING on java.lang.ref.ReferenceQueue$Lock@42e094cc
[junit4] 2> at java.lang.Object.wait(Native Method)
[junit4] 2> - waiting on java.lang.ref.ReferenceQueue$Lock@42e094cc
[junit4] 2> at java.lang.ref.ReferenceQueue.remove(ReferenceQueue.java:135)
[junit4] 2> at java.lang.ref.ReferenceQueue.remove(ReferenceQueue.java:151)
[junit4] 2> at java.lang.ref.Finalizer$FinalizerThread.run(Finalizer.java:189)
[junit4] 2>
[junit4] 2> "Reference Handler" ID=2 WAITING on java.lang.ref.Reference$Lock@2648ff61
[junit4] 2> at java.lang.Object.wait(Native Method)
[junit4] 2> - waiting on java.lang.ref.Reference$Lock@2648ff61
[junit4] 2> at java.lang.Object.wait(Object.java:503)
[junit4] 2> at java.lang.ref.Reference$ReferenceHandler.run(Reference.java:133)
[junit4] 2>
[junit4] 2> "main" ID=1 WAITING on com.carrotsearch.randomizedtesting.RandomizedRunner$1@2b978c74
[junit4] 2> at java.lang.Object.wait(Native Method)
[junit4] 2> - waiting on com.carrotsearch.randomizedtesting.RandomizedRunner$1@2b978c74
[junit4] 2> at java.lang.Thread.join(Thread.java:1260)
[junit4] 2> at java.lang.Thread.join(Thread.java:1334)
[junit4] 2> at com.carrotsearch.randomizedtesting.RandomizedRunner.runSuite(RandomizedRunner.java:502)
[junit4] 2> at com.carrotsearch.randomizedtesting.RandomizedRunner.run(RandomizedRunner.java:399)
[junit4] 2> at com.carrotsearch.ant.tasks.junit4.slave.SlaveMain.execute(SlaveMain.java:180)
[junit4] 2> at com.carrotsearch.ant.tasks.junit4.slave.SlaveMain.main(SlaveMain.java:275)
[junit4] 2> at com.carrotsearch.ant.tasks.junit4.slave.SlaveMainSafe.main(SlaveMainSafe.java:12)
[junit4] 2>
[junit4] 2> ^^==============================================
[junit4] 2>
[junit4] 2> NOTE: reproduce with: ant test -Dtestcase=UIMABaseAnalyzerTest -Dtests.method=baseUIMAAnalyzerIntegrationTest -Dtests.seed=B5FF79B9C8449580 -Dtests.multiplier=3 -Dtests.slow=true -Dtests.locale=hi_IN -Dtests.timezone=Pacific/Tongatapu -Dtests.file.encoding=US-ASCII
[junit4] ERROR 7194s | UIMABaseAnalyzerTest.baseUIMAAnalyzerIntegrationTest <<<
[junit4] > Throwable #1: java.lang.Exception: Test abandoned because suite timeout was reached.
[junit4] > at __randomizedtesting.SeedInfo.seed([B5FF79B9C8449580]:0)
[junit4] 2> ?????? ??, ???? ?:??:?? ??????? com.carrotsearch.randomizedtesting.ThreadLeakControl checkThreadLeaks
[junit4] 2> WARNING: Will linger awaiting termination of 1 leaked thread(s).
[junit4] 2> ?????? ??, ???? ?:??:?? ??????? com.carrotsearch.randomizedtesting.ThreadLeakControl checkThreadLeaks
[junit4] 2> SEVERE: 1 thread leaked from SUITE scope at org.apache.lucene.analysis.uima.UIMABaseAnalyzerTest:
[junit4] 2> 1) Thread[id=17, name=TEST-UIMABaseAnalyzerTest.baseUIMAAnalyzerIntegrationTest-seed#[B5FF79B9C8449580], state=RUNNABLE, group=TGRP-UIMABaseAnalyzerTest]
[junit4] 2> at java.util.HashMap.getEntry(HashMap.java:446)
[junit4] 2> at java.util.HashMap.containsKey(HashMap.java:434)
[junit4] 2> at java.util.HashSet.contains(HashSet.java:201)
[junit4] 2> at org.apache.uima.analysis_engine.impl.AnalysisEngineManagementImpl.setName(AnalysisEngineManagementImpl.java:242)
[junit4] 2> at org.apache.uima.analysis_engine.impl.AnalysisEngineImplBase.initialize(AnalysisEngineImplBase.java:181)
[junit4] 2> at org.apache.uima.analysis_engine.impl.AggregateAnalysisEngine_impl.initialize(AggregateAnalysisEngine_impl.java:127)
[junit4] 2> at org.apache.uima.impl.AnalysisEngineFactory_impl.produceResource(AnalysisEngineFactory_impl.java:94)
[junit4] 2> at org.apache.uima.impl.CompositeResourceFactory_impl.produceResource(CompositeResourceFactory_impl.java:62)
[junit4] 2> at org.apache.uima.UIMAFramework.produceResource(UIMAFramework.java:267)
[junit4] 2> at org.apache.uima.UIMAFramework.produceAnalysisEngine(UIMAFramework.java:335)
[junit4] 2> at org.apache.lucene.analysis.uima.ae.BasicAEProvider.getAE(BasicAEProvider.java:73)
[junit4] 2> at org.apache.lucene.analysis.uima.BaseUIMATokenizer.analyzeInput(BaseUIMATokenizer.java:63)
[junit4] 2> at org.apache.lucene.analysis.uima.UIMAAnnotationsTokenizer.initializeIterator(UIMAAnnotationsTokenizer.java:60)
[junit4] 2> at org.apache.lucene.analysis.uima.UIMAAnnotationsTokenizer.incrementToken(UIMAAnnotationsTokenizer.java:74)
[junit4] 2> at org.apache.lucene.index.DocInverterPerField.processFields(DocInverterPerField.java:102)
[junit4] 2> at org.apache.lucene.index.DocFieldProcessor.processDocument(DocFieldProcessor.java:248)
[junit4] 2> at org.apache.lucene.index.DocumentsWriterPerThread.updateDocument(DocumentsWriterPerThread.java:253)
[junit4] 2> at org.apache.lucene.index.DocumentsWriter.updateDocument(DocumentsWriter.java:453)
[junit4] 2> at org.apache.lucene.index.IndexWriter.updateDocument(IndexWriter.java:1520)
[junit4] 2> at org.apache.lucene.index.IndexWriter.addDocument(IndexWriter.java:1190)
[junit4] 2> at org.apache.lucene.analysis.uima.UIMABaseAnalyzerTest.baseUIMAAnalyzerIntegrationTest(UIMABaseAnalyzerTest.java:78)
[junit4] 2> at sun.reflect.NativeMethodAccessorImpl.invoke0(Native Method)
[junit4] 2> at sun.reflect.NativeMethodAccessorImpl.invoke(NativeMethodAccessorImpl.java:57)
[junit4] 2> at sun.reflect.DelegatingMethodAccessorImpl.invoke(DelegatingMethodAccessorImpl.java:43)
[junit4] 2> at java.lang.reflect.Method.invoke(Method.java:606)
[junit4] 2> at com.carrotsearch.randomizedtesting.RandomizedRunner.invoke(RandomizedRunner.java:1559)
[junit4] 2> at com.carrotsearch.randomizedtesting.RandomizedRunner.access$600(RandomizedRunner.java:79)
[junit4] 2> at com.carrotsearch.randomizedtesting.RandomizedRunner$6.evaluate(RandomizedRunner.java:737)
[junit4] 2> at com.carrotsearch.randomizedtesting.RandomizedRunner$7.evaluate(RandomizedRunner.java:773)
[junit4] 2> at com.carrotsearch.randomizedtesting.RandomizedRunner$8.evaluate(RandomizedRunner.java:787)
[junit4] 2> at org.apache.lucene.util.TestRuleSetupTeardownChained$1.evaluate(TestRuleSetupTeardownChained.java:50)
[junit4] 2> at org.apache.lucene.util.TestRuleFieldCacheSanity$1.evaluate(TestRuleFieldCacheSanity.java:51)
[junit4] 2> at org.apache.lucene.util.AbstractBeforeAfterRule$1.evaluate(AbstractBeforeAfterRule.java:46)
[junit4] 2> at com.carrotsearch.randomizedtesting.rules.SystemPropertiesInvariantRule$1.evaluate(SystemPropertiesInvariantRule.java:55)
[junit4] 2> at org.apache.lucene.util.TestRuleThreadAndTestName$1.evaluate(TestRuleThreadAndTestName.java:49)
[junit4] 2> at org.apache.lucene.util.TestRuleIgnoreAfterMaxFailures$1.evaluate(TestRuleIgnoreAfterMaxFailures.java:70)
[junit4] 2> at org.apache.lucene.util.TestRuleMarkFailure$1.evaluate(TestRuleMarkFailure.java:48)
[junit4] 2> at com.carrotsearch.randomizedtesting.rules.StatementAdapter.evaluate(StatementAdapter.java:36)
[junit4] 2> at com.carrotsearch.randomizedtesting.ThreadLeakControl$StatementRunner.run(ThreadLeakControl.java:358)
[junit4] 2> at com.carrotsearch.randomizedtesting.ThreadLeakControl.forkTimeoutingTask(ThreadLeakControl.java:782)
[junit4] 2> at com.carrotsearch.randomizedtesting.ThreadLeakControl$3.evaluate(ThreadLeakControl.java:442)
[junit4] 2> at com.carrotsearch.randomizedtesting.RandomizedRunner.runSingleTest(RandomizedRunner.java:746)
[junit4] 2> at com.carrotsearch.randomizedtesting.RandomizedRunner$3.evaluate(RandomizedRunner.java:648)
[junit4] 2> at com.carrotsearch.randomizedtesting.RandomizedRunner$4.evaluate(RandomizedRunner.java:682)
[junit4] 2> at com.carrotsearch.randomizedtesting.RandomizedRunner$5.evaluate(RandomizedRunner.java:693)
[junit4] 2> at org.apache.lucene.util.AbstractBeforeAfterRule$1.evaluate(AbstractBeforeAfterRule.java:46)
[junit4] 2> at org.apache.lucene.util.TestRuleStoreClassName$1.evaluate(TestRuleStoreClassName.java:42)
[junit4] 2> at com.carrotsearch.randomizedtesting.rules.SystemPropertiesInvariantRule$1.evaluate(SystemPropertiesInvariantRule.java:55)
[junit4] 2> at com.carrotsearch.randomizedtesting.rules.NoShadowingOrOverridesOnMethodsRule$1.evaluate(NoShadowingOrOverridesOnMethodsRule.java:39)
[junit4] 2> at com.carrotsearch.randomizedtesting.rules.NoShadowingOrOverridesOnMethodsRule$1.evaluate(NoShadowingOrOverridesOnMethodsRule.java:39)
[junit4] 2> at com.carrotsearch.randomizedtesting.rules.StatementAdapter.evaluate(StatementAdapter.java:36)
[junit4] 2> at org.apache.lucene.util.TestRuleAssertionsRequired$1.evaluate(TestRuleAssertionsRequired.java:43)
[junit4] 2> at org.apache.lucene.util.TestRuleMarkFailure$1.evaluate(TestRuleMarkFailure.java:48)
[junit4] 2> at org.apache.lucene.util.TestRuleIgnoreAfterMaxFailures$1.evaluate(TestRuleIgnoreAfterMaxFailures.java:70)
[junit4] 2> at org.apache.lucene.util.TestRuleIgnoreTestSuites$1.evaluate(TestRuleIgnoreTestSuites.java:55)
[junit4] 2> at com.carrotsearch.randomizedtesting.rules.StatementAdapter.evaluate(StatementAdapter.java:36)
[junit4] 2> at com.carrotsearch.randomizedtesting.ThreadLeakControl$StatementRunner.run(ThreadLeakControl.java:358)
[junit4] 2> at java.lang.Thread.run(Thread.java:724)
[junit4] 2> ?????? ??, ???? ?:??:?? ??????? com.carrotsearch.randomizedtesting.ThreadLeakControl tryToInterruptAll
[junit4] 2> INFO: Starting to interrupt leaked threads:
[junit4] 2> 1) Thread[id=17, name=TEST-UIMABaseAnalyzerTest.baseUIMAAnalyzerIntegrationTest-seed#[B5FF79B9C8449580], state=RUNNABLE, group=TGRP-UIMABaseAnalyzerTest]
[junit4] 2> ?????? ??, ???? ?:??:?? ??????? com.carrotsearch.randomizedtesting.ThreadLeakControl tryToInterruptAll
[junit4] 2> SEVERE: There are still zombie threads that couldn't be terminated:
[junit4] 2> 1) Thread[id=17, name=TEST-UIMABaseAnalyzerTest.baseUIMAAnalyzerIntegrationTest-seed#[B5FF79B9C8449580], state=RUNNABLE, group=TGRP-UIMABaseAnalyzerTest]
[junit4] 2> at java.util.HashMap.getEntry(HashMap.java:446)
[junit4] 2> at java.util.HashMap.containsKey(HashMap.java:434)
[junit4] 2> at java.util.HashSet.contains(HashSet.java:201)
[junit4] 2> at org.apache.uima.analysis_engine.impl.AnalysisEngineManagementImpl.setName(AnalysisEngineManagementImpl.java:242)
[junit4] 2> at org.apache.uima.analysis_engine.impl.AnalysisEngineImplBase.initialize(AnalysisEngineImplBase.java:181)
[junit4] 2> at org.apache.uima.analysis_engine.impl.AggregateAnalysisEngine_impl.initialize(AggregateAnalysisEngine_impl.java:127)
[junit4] 2> at org.apache.uima.impl.AnalysisEngineFactory_impl.produceResource(AnalysisEngineFactory_impl.java:94)
[junit4] 2> at org.apache.uima.impl.CompositeResourceFactory_impl.produceResource(CompositeResourceFactory_impl.java:62)
[junit4] 2> at org.apache.uima.UIMAFramework.produceResource(UIMAFramework.java:267)
[junit4] 2> at org.apache.uima.UIMAFramework.produceAnalysisEngine(UIMAFramework.java:335)
[junit4] 2> at org.apache.lucene.analysis.uima.ae.BasicAEProvider.getAE(BasicAEProvider.java:73)
[junit4] 2> at org.apache.lucene.analysis.uima.BaseUIMATokenizer.analyzeInput(BaseUIMATokenizer.java:63)
[junit4] 2> at org.apache.lucene.analysis.uima.UIMAAnnotationsTokenizer.initializeIterator(UIMAAnnotationsTokenizer.java:60)
[junit4] 2> at org.apache.lucene.analysis.uima.UIMAAnnotationsTokenizer.incrementToken(UIMAAnnotationsTokenizer.java:74)
[junit4] 2> at org.apache.lucene.index.DocInverterPerField.processFields(DocInverterPerField.java:102)
[junit4] 2> at org.apache.lucene.index.DocFieldProcessor.processDocument(DocFieldProcessor.java:248)
[junit4] 2> at org.apache.lucene.index.DocumentsWriterPerThread.updateDocument(DocumentsWriterPerThread.java:253)
[junit4] 2> at org.apache.lucene.index.DocumentsWriter.updateDocument(DocumentsWriter.java:453)
[junit4] 2> at org.apache.lucene.index.IndexWriter.updateDocument(IndexWriter.java:1520)
[junit4] 2> at org.apache.lucene.index.IndexWriter.addDocument(IndexWriter.java:1190)
[junit4] 2> at org.apache.lucene.analysis.uima.UIMABaseAnalyzerTest.baseUIMAAnalyzerIntegrationTest(UIMABaseAnalyzerTest.java:78)
[junit4] 2> at sun.reflect.NativeMethodAccessorImpl.invoke0(Native Method)
[junit4] 2> at sun.reflect.NativeMethodAccessorImpl.invoke(NativeMethodAccessorImpl.java:57)
[junit4] 2> at sun.reflect.DelegatingMethodAccessorImpl.invoke(DelegatingMethodAccessorImpl.java:43)
[junit4] 2> at java.lang.reflect.Method.invoke(Method.java:606)
[junit4] 2> at com.carrotsearch.randomizedtesting.RandomizedRunner.invoke(RandomizedRunner.java:1559)
[junit4] 2> at com.carrotsearch.randomizedtesting.RandomizedRunner.access$600(RandomizedRunner.java:79)
[junit4] 2> at com.carrotsearch.randomizedtesting.RandomizedRunner$6.evaluate(RandomizedRunner.java:737)
[junit4] 2> at com.carrotsearch.randomizedtesting.RandomizedRunner$7.evaluate(RandomizedRunner.java:773)
[junit4] 2> at com.carrotsearch.randomizedtesting.RandomizedRunner$8.evaluate(RandomizedRunner.java:787)
[junit4] 2> at org.apache.lucene.util.TestRuleSetupTeardownChained$1.evaluate(TestRuleSetupTeardownChained.java:50)
[junit4] 2> at org.apache.lucene.util.TestRuleFieldCacheSanity$1.evaluate(TestRuleFieldCacheSanity.java:51)
[junit4] 2> at org.apache.lucene.util.AbstractBeforeAfterRule$1.evaluate(AbstractBeforeAfterRule.java:46)
[junit4] 2> at com.carrotsearch.randomizedtesting.rules.SystemPropertiesInvariantRule$1.evaluate(SystemPropertiesInvariantRule.java:55)
[junit4] 2> at org.apache.lucene.util.TestRuleThreadAndTestName$1.evaluate(TestRuleThreadAndTestName.java:49)
[junit4] 2> at org.apache.lucene.util.TestRuleIgnoreAfterMaxFailures$1.evaluate(TestRuleIgnoreAfterMaxFailures.java:70)
[junit4] 2> at org.apache.lucene.util.TestRuleMarkFailure$1.evaluate(TestRuleMarkFailure.java:48)
[junit4] 2> at com.carrotsearch.randomizedtesting.rules.StatementAdapter.evaluate(StatementAdapter.java:36)
[junit4] 2> at com.carrotsearch.randomizedtesting.ThreadLeakControl$StatementRunner.run(ThreadLeakControl.java:358)
[junit4] 2> at com.carrotsearch.randomizedtesting.ThreadLeakControl.forkTimeoutingTask(ThreadLeakControl.java:782)
[junit4] 2> at com.carrotsearch.randomizedtesting.ThreadLeakControl$3.evaluate(ThreadLeakControl.java:442)
[junit4] 2> at com.carrotsearch.randomizedtesting.RandomizedRunner.runSingleTest(RandomizedRunner.java:746)
[junit4] 2> at com.carrotsearch.randomizedtesting.RandomizedRunner$3.evaluate(RandomizedRunner.java:648)
[junit4] 2> at com.carrotsearch.randomizedtesting.RandomizedRunner$4.evaluate(RandomizedRunner.java:682)
[junit4] 2> at com.carrotsearch.randomizedtesting.RandomizedRunner$5.evaluate(RandomizedRunner.java:693)
[junit4] 2> at org.apache.lucene.util.AbstractBeforeAfterRule$1.evaluate(AbstractBeforeAfterRule.java:46)
[junit4] 2> at org.apache.lucene.util.TestRuleStoreClassName$1.evaluate(TestRuleStoreClassName.java:42)
[junit4] 2> at com.carrotsearch.randomizedtesting.rules.SystemPropertiesInvariantRule$1.evaluate(SystemPropertiesInvariantRule.java:55)
[junit4] 2> at com.carrotsearch.randomizedtesting.rules.NoShadowingOrOverridesOnMethodsRule$1.evaluate(NoShadowingOrOverridesOnMethodsRule.java:39)
[junit4] 2> at com.carrotsearch.randomizedtesting.rules.NoShadowingOrOverridesOnMethodsRule$1.evaluate(NoShadowingOrOverridesOnMethodsRule.java:39)
[junit4] 2> at com.carrotsearch.randomizedtesting.rules.StatementAdapter.evaluate(StatementAdapter.java:36)
[junit4] 2> at org.apache.lucene.util.TestRuleAssertionsRequired$1.evaluate(TestRuleAssertionsRequired.java:43)
[junit4] 2> at org.apache.lucene.util.TestRuleMarkFailure$1.evaluate(TestRuleMarkFailure.java:48)
[junit4] 2> at org.apache.lucene.util.TestRuleIgnoreAfterMaxFailures$1.evaluate(TestRuleIgnoreAfterMaxFailures.java:70)
[junit4] 2> at org.apache.lucene.util.TestRuleIgnoreTestSuites$1.evaluate(TestRuleIgnoreTestSuites.java:55)
[junit4] 2> at com.carrotsearch.randomizedtesting.rules.StatementAdapter.evaluate(StatementAdapter.java:36)
[junit4] 2> at com.carrotsearch.randomizedtesting.ThreadLeakControl$StatementRunner.run(ThreadLeakControl.java:358)
[junit4] 2> at java.lang.Thread.run(Thread.java:724)
[junit4] 2> NOTE: test params are: codec=Lucene46: {dummy=PostingsFormat(name=Lucene41WithOrds)}, docValues:{}, sim=DefaultSimilarity, locale=hi_IN, timezone=Pacific/Tongatapu
[junit4] 2> NOTE: FreeBSD 9.1-RELEASE-p3 amd64/Oracle Corporation 1.7.0_25 (64-bit)/cpus=16,threads=2,free=40122304,total=185597952
[junit4] 2> NOTE: All tests run in this JVM: [UIMATypeAwareAnalyzerTest, UIMABaseAnalyzerTest]
[junit4] 2> NOTE: reproduce with: ant test -Dtestcase=UIMABaseAnalyzerTest -Dtests.seed=B5FF79B9C8449580 -Dtests.multiplier=3 -Dtests.slow=true -Dtests.locale=hi_IN -Dtests.timezone=Pacific/Tongatapu -Dtests.file.encoding=US-ASCII
[junit4] ERROR 0.00s | UIMABaseAnalyzerTest (suite) <<<
[junit4] > Throwable #1: java.lang.Exception: Suite timeout exceeded (>= 7200000 msec).
[junit4] > at __randomizedtesting.SeedInfo.seed([B5FF79B9C8449580]:0)
[junit4] Completed in 7223.38s, 4 tests, 2 errors <<< FAILURES!
[...truncated 13 lines...]
BUILD FAILED
/usr/home/hudson/hudson-slave/workspace/Lucene-Solr-Tests-4.x-Java7/build.xml:426: The following error occurred while executing this line:
/usr/home/hudson/hudson-slave/workspace/Lucene-Solr-Tests-4.x-Java7/build.xml:406: The following error occurred while executing this line:
/usr/home/hudson/hudson-slave/workspace/Lucene-Solr-Tests-4.x-Java7/build.xml:39: The following error occurred while executing this line:
/usr/home/hudson/hudson-slave/workspace/Lucene-Solr-Tests-4.x-Java7/extra-targets.xml:37: The following error occurred while executing this line:
/usr/home/hudson/hudson-slave/workspace/Lucene-Solr-Tests-4.x-Java7/lucene/build.xml:539: The following error occurred while executing this line:
/usr/home/hudson/hudson-slave/workspace/Lucene-Solr-Tests-4.x-Java7/lucene/common-build.xml:2025: The following error occurred while executing this line:
/usr/home/hudson/hudson-slave/workspace/Lucene-Solr-Tests-4.x-Java7/lucene/analysis/build.xml:106: The following error occurred while executing this line:
/usr/home/hudson/hudson-slave/workspace/Lucene-Solr-Tests-4.x-Java7/lucene/analysis/build.xml:38: The following error occurred while executing this line:
/usr/home/hudson/hudson-slave/workspace/Lucene-Solr-Tests-4.x-Java7/lucene/module-build.xml:60: The following error occurred while executing this line:
/usr/home/hudson/hudson-slave/workspace/Lucene-Solr-Tests-4.x-Java7/lucene/common-build.xml:1307: The following error occurred while executing this line:
/usr/home/hudson/hudson-slave/workspace/Lucene-Solr-Tests-4.x-Java7/lucene/common-build.xml:940: There were test failures: 5 suites, 12 tests, 1 suite-level error, 1 error
Total time: 138 minutes 45 seconds
Build step 'Invoke Ant' marked build as failure
Archiving artifacts
Recording test results
Email was triggered for: Failure
Sending email for trigger: Failure